You are viewing a plain text version of this content. The canonical link for it is here.
Posted to commits@karaf.apache.org by Apache Jenkins Server <je...@builds.apache.org> on 2012/07/29 15:03:55 UTC
Build failed in Jenkins: Karaf-2.2.x #659
See <https://builds.apache.org/job/Karaf-2.2.x/659/>
------------------------------------------
Started by an SCM change
Building remotely on ubuntu1 in workspace <https://builds.apache.org/job/Karaf-2.2.x/ws/>
hudson.util.IOException2: remote file operation failed: <https://builds.apache.org/job/Karaf-2.2.x/ws/> at hudson.remoting.Channel@65fd2b3f:ubuntu1
at hudson.FilePath.act(FilePath.java:838)
at hudson.FilePath.act(FilePath.java:824)
at hudson.scm.SubversionSCM.checkout(SubversionSCM.java:743)
at hudson.scm.SubversionSCM.checkout(SubversionSCM.java:685)
at hudson.model.AbstractProject.checkout(AbstractProject.java:1256)
at hudson.model.AbstractBuild$AbstractBuildExecution.defaultCheckout(AbstractBuild.java:589)
at jenkins.scm.SCMCheckoutStrategy.checkout(SCMCheckoutStrategy.java:88)
at hudson.model.AbstractBuild$AbstractBuildExecution.run(AbstractBuild.java:494)
at hudson.model.Run.execute(Run.java:1488)
at hudson.maven.MavenModuleSetBuild.run(MavenModuleSetBuild.java:477)
at hudson.model.ResourceController.execute(ResourceController.java:88)
at hudson.model.Executor.run(Executor.java:236)
Caused by: java.io.IOException: Remote call on ubuntu1 failed
at hudson.remoting.Channel.call(Channel.java:672)
at hudson.FilePath.act(FilePath.java:831)
... 11 more
Caused by: java.lang.LinkageError: loader (instance of hudson/remoting/RemoteClassLoader): attempted duplicate class definition for name: "hudson/model/Descriptor"
at java.lang.ClassLoader.defineClass1(Native Method)
at java.lang.ClassLoader.defineClass(ClassLoader.java:634)
at java.lang.ClassLoader.defineClass(ClassLoader.java:480)
at hudson.remoting.RemoteClassLoader.loadClassFile(RemoteClassLoader.java:152)
at hudson.remoting.RemoteClassLoader.findClass(RemoteClassLoader.java:131)
at java.lang.ClassLoader.loadClass(ClassLoader.java:321)
at java.lang.ClassLoader.loadClass(ClassLoader.java:266)
at java.lang.Class.getDeclaredFields0(Native Method)
at java.lang.Class.privateGetDeclaredFields(Class.java:2308)
at java.lang.Class.getDeclaredField(Class.java:1897)
at java.io.ObjectStreamClass.getDeclaredSUID(ObjectStreamClass.java:1624)
at java.io.ObjectStreamClass.access$700(ObjectStreamClass.java:69)
at java.io.ObjectStreamClass$2.run(ObjectStreamClass.java:442)
at java.security.AccessController.doPrivileged(Native Method)
at java.io.ObjectStreamClass.<init>(ObjectStreamClass.java:430)
at java.io.ObjectStreamClass.lookup(ObjectStreamClass.java:327)
at java.io.ObjectStreamClass.initNonProxy(ObjectStreamClass.java:564)
at java.io.ObjectInputStream.readNonProxyDesc(ObjectInputStream.java:1600)
at java.io.ObjectInputStream.readClassDesc(ObjectInputStream.java:1513)
at java.io.ObjectInputStream.readNonProxyDesc(ObjectInputStream.java:1600)
at java.io.ObjectInputStream.readClassDesc(ObjectInputStream.java:1513)
at java.io.ObjectInputStream.readOrdinaryObject(ObjectInputStream.java:1749)
at java.io.ObjectInputStream.readObject0(ObjectInputStream.java:1346)
at java.io.ObjectInputStream.defaultReadFields(ObjectInputStream.java:1963)
at java.io.ObjectInputStream.readSerialData(ObjectInputStream.java:1887)
at java.io.ObjectInputStream.readOrdinaryObject(ObjectInputStream.java:1770)
at java.io.ObjectInputStream.readObject0(ObjectInputStream.java:1346)
at java.io.ObjectInputStream.defaultReadFields(ObjectInputStream.java:1963)
at java.io.ObjectInputStream.readSerialData(ObjectInputStream.java:1887)
at java.io.ObjectInputStream.readOrdinaryObject(ObjectInputStream.java:1770)
at java.io.ObjectInputStream.readObject0(ObjectInputStream.java:1346)
at java.io.ObjectInputStream.defaultReadFields(ObjectInputStream.java:1963)
at java.io.ObjectInputStream.readSerialData(ObjectInputStream.java:1887)
at java.io.ObjectInputStream.readOrdinaryObject(ObjectInputStream.java:1770)
at java.io.ObjectInputStream.readObject0(ObjectInputStream.java:1346)
at java.io.ObjectInputStream.readObject(ObjectInputStream.java:368)
at hudson.remoting.UserRequest.deserialize(UserRequest.java:182)
at hudson.remoting.UserRequest.perform(UserRequest.java:98)
at hudson.remoting.UserRequest.perform(UserRequest.java:48)
at hudson.remoting.Request$2.run(Request.java:326)
at hudson.remoting.InterceptingExecutorService$1.call(InterceptingExecutorService.java:72)
at java.util.concurrent.FutureTask$Sync.innerRun(FutureTask.java:334)
at java.util.concurrent.FutureTask.run(FutureTask.java:166)
at java.util.concurrent.ThreadPoolExecutor.runWorker(ThreadPoolExecutor.java:1110)
at java.util.concurrent.ThreadPoolExecutor$Worker.run(ThreadPoolExecutor.java:603)
at java.lang.Thread.run(Thread.java:679)
Retrying after 10 seconds
hudson.util.IOException2: remote file operation failed: <https://builds.apache.org/job/Karaf-2.2.x/ws/> at hudson.remoting.Channel@65fd2b3f:ubuntu1
at hudson.FilePath.act(FilePath.java:838)
at hudson.FilePath.act(FilePath.java:824)
at hudson.scm.SubversionSCM.checkout(SubversionSCM.java:743)
at hudson.scm.SubversionSCM.checkout(SubversionSCM.java:685)
at hudson.model.AbstractProject.checkout(AbstractProject.java:1256)
at hudson.model.AbstractBuild$AbstractBuildExecution.defaultCheckout(AbstractBuild.java:589)
at jenkins.scm.SCMCheckoutStrategy.checkout(SCMCheckoutStrategy.java:88)
at hudson.model.AbstractBuild$AbstractBuildExecution.run(AbstractBuild.java:494)
at hudson.model.Run.execute(Run.java:1488)
at hudson.maven.MavenModuleSetBuild.run(MavenModuleSetBuild.java:477)
at hudson.model.ResourceController.execute(ResourceController.java:88)
at hudson.model.Executor.run(Executor.java:236)
Caused by: java.io.IOException: Remote call on ubuntu1 failed
at hudson.remoting.Channel.call(Channel.java:672)
at hudson.FilePath.act(FilePath.java:831)
... 11 more
Caused by: java.lang.LinkageError: loader (instance of hudson/remoting/RemoteClassLoader): attempted duplicate class definition for name: "hudson/model/Descriptor"
at java.lang.ClassLoader.defineClass1(Native Method)
at java.lang.ClassLoader.defineClass(ClassLoader.java:634)
at java.lang.ClassLoader.defineClass(ClassLoader.java:480)
at hudson.remoting.RemoteClassLoader.loadClassFile(RemoteClassLoader.java:152)
at hudson.remoting.RemoteClassLoader.findClass(RemoteClassLoader.java:131)
at java.lang.ClassLoader.loadClass(ClassLoader.java:321)
at java.lang.ClassLoader.loadClass(ClassLoader.java:266)
at java.lang.Class.getDeclaredFields0(Native Method)
at java.lang.Class.privateGetDeclaredFields(Class.java:2308)
at java.lang.Class.getDeclaredField(Class.java:1897)
at java.io.ObjectStreamClass.getDeclaredSUID(ObjectStreamClass.java:1624)
at java.io.ObjectStreamClass.access$700(ObjectStreamClass.java:69)
at java.io.ObjectStreamClass$2.run(ObjectStreamClass.java:442)
at java.security.AccessController.doPrivileged(Native Method)
at java.io.ObjectStreamClass.<init>(ObjectStreamClass.java:430)
at java.io.ObjectStreamClass.lookup(ObjectStreamClass.java:327)
at java.io.ObjectStreamClass.initNonProxy(ObjectStreamClass.java:564)
at java.io.ObjectInputStream.readNonProxyDesc(ObjectInputStream.java:1600)
at java.io.ObjectInputStream.readClassDesc(ObjectInputStream.java:1513)
at java.io.ObjectInputStream.readNonProxyDesc(ObjectInputStream.java:1600)
at java.io.ObjectInputStream.readClassDesc(ObjectInputStream.java:1513)
at java.io.ObjectInputStream.readOrdinaryObject(ObjectInputStream.java:1749)
at java.io.ObjectInputStream.readObject0(ObjectInputStream.java:1346)
at java.io.ObjectInputStream.defaultReadFields(ObjectInputStream.java:1963)
at java.io.ObjectInputStream.readSerialData(ObjectInputStream.java:1887)
at java.io.ObjectInputStream.readOrdinaryObject(ObjectInputStream.java:1770)
at java.io.ObjectInputStream.readObject0(ObjectInputStream.java:1346)
at java.io.ObjectInputStream.defaultReadFields(ObjectInputStream.java:1963)
at java.io.ObjectInputStream.readSerialData(ObjectInputStream.java:1887)
at java.io.ObjectInputStream.readOrdinaryObject(ObjectInputStream.java:1770)
at java.io.ObjectInputStream.readObject0(ObjectInputStream.java:1346)
at java.io.ObjectInputStream.defaultReadFields(ObjectInputStream.java:1963)
at java.io.ObjectInputStream.readSerialData(ObjectInputStream.java:1887)
at java.io.ObjectInputStream.readOrdinaryObject(ObjectInputStream.java:1770)
at java.io.ObjectInputStream.readObject0(ObjectInputStream.java:1346)
at java.io.ObjectInputStream.readObject(ObjectInputStream.java:368)
at hudson.remoting.UserRequest.deserialize(UserRequest.java:182)
at hudson.remoting.UserRequest.perform(UserRequest.java:98)
at hudson.remoting.UserRequest.perform(UserRequest.java:48)
at hudson.remoting.Request$2.run(Request.java:326)
at hudson.remoting.InterceptingExecutorService$1.call(InterceptingExecutorService.java:72)
at java.util.concurrent.FutureTask$Sync.innerRun(FutureTask.java:334)
at java.util.concurrent.FutureTask.run(FutureTask.java:166)
at java.util.concurrent.ThreadPoolExecutor.runWorker(ThreadPoolExecutor.java:1110)
at java.util.concurrent.ThreadPoolExecutor$Worker.run(ThreadPoolExecutor.java:603)
at java.lang.Thread.run(Thread.java:679)
Retrying after 10 seconds
hudson.util.IOException2: remote file operation failed: <https://builds.apache.org/job/Karaf-2.2.x/ws/> at hudson.remoting.Channel@65fd2b3f:ubuntu1
at hudson.FilePath.act(FilePath.java:838)
at hudson.FilePath.act(FilePath.java:824)
at hudson.scm.SubversionSCM.checkout(SubversionSCM.java:743)
at hudson.scm.SubversionSCM.checkout(SubversionSCM.java:685)
at hudson.model.AbstractProject.checkout(AbstractProject.java:1256)
at hudson.model.AbstractBuild$AbstractBuildExecution.defaultCheckout(AbstractBuild.java:589)
at jenkins.scm.SCMCheckoutStrategy.checkout(SCMCheckoutStrategy.java:88)
at hudson.model.AbstractBuild$AbstractBuildExecution.run(AbstractBuild.java:494)
at hudson.model.Run.execute(Run.java:1488)
at hudson.maven.MavenModuleSetBuild.run(MavenModuleSetBuild.java:477)
at hudson.model.ResourceController.execute(ResourceController.java:88)
at hudson.model.Executor.run(Executor.java:236)
Caused by: java.io.IOException: Remote call on ubuntu1 failed
at hudson.remoting.Channel.call(Channel.java:672)
at hudson.FilePath.act(FilePath.java:831)
... 11 more
Caused by: java.lang.LinkageError: loader (instance of hudson/remoting/RemoteClassLoader): attempted duplicate class definition for name: "hudson/model/Descriptor"
at java.lang.ClassLoader.defineClass1(Native Method)
at java.lang.ClassLoader.defineClass(ClassLoader.java:634)
at java.lang.ClassLoader.defineClass(ClassLoader.java:480)
at hudson.remoting.RemoteClassLoader.loadClassFile(RemoteClassLoader.java:152)
at hudson.remoting.RemoteClassLoader.findClass(RemoteClassLoader.java:131)
at java.lang.ClassLoader.loadClass(ClassLoader.java:321)
at java.lang.ClassLoader.loadClass(ClassLoader.java:266)
at java.lang.Class.getDeclaredFields0(Native Method)
at java.lang.Class.privateGetDeclaredFields(Class.java:2308)
at java.lang.Class.getDeclaredField(Class.java:1897)
at java.io.ObjectStreamClass.getDeclaredSUID(ObjectStreamClass.java:1624)
at java.io.ObjectStreamClass.access$700(ObjectStreamClass.java:69)
at java.io.ObjectStreamClass$2.run(ObjectStreamClass.java:442)
at java.security.AccessController.doPrivileged(Native Method)
at java.io.ObjectStreamClass.<init>(ObjectStreamClass.java:430)
at java.io.ObjectStreamClass.lookup(ObjectStreamClass.java:327)
at java.io.ObjectStreamClass.initNonProxy(ObjectStreamClass.java:564)
at java.io.ObjectInputStream.readNonProxyDesc(ObjectInputStream.java:1600)
at java.io.ObjectInputStream.readClassDesc(ObjectInputStream.java:1513)
at java.io.ObjectInputStream.readNonProxyDesc(ObjectInputStream.java:1600)
at java.io.ObjectInputStream.readClassDesc(ObjectInputStream.java:1513)
at java.io.ObjectInputStream.readOrdinaryObject(ObjectInputStream.java:1749)
at java.io.ObjectInputStream.readObject0(ObjectInputStream.java:1346)
at java.io.ObjectInputStream.defaultReadFields(ObjectInputStream.java:1963)
at java.io.ObjectInputStream.readSerialData(ObjectInputStream.java:1887)
at java.io.ObjectInputStream.readOrdinaryObject(ObjectInputStream.java:1770)
at java.io.ObjectInputStream.readObject0(ObjectInputStream.java:1346)
at java.io.ObjectInputStream.defaultReadFields(ObjectInputStream.java:1963)
at java.io.ObjectInputStream.readSerialData(ObjectInputStream.java:1887)
at java.io.ObjectInputStream.readOrdinaryObject(ObjectInputStream.java:1770)
at java.io.ObjectInputStream.readObject0(ObjectInputStream.java:1346)
at java.io.ObjectInputStream.defaultReadFields(ObjectInputStream.java:1963)
at java.io.ObjectInputStream.readSerialData(ObjectInputStream.java:1887)
at java.io.ObjectInputStream.readOrdinaryObject(ObjectInputStream.java:1770)
at java.io.ObjectInputStream.readObject0(ObjectInputStream.java:1346)
at java.io.ObjectInputStream.readObject(ObjectInputStream.java:368)
at hudson.remoting.UserRequest.deserialize(UserRequest.java:182)
at hudson.remoting.UserRequest.perform(UserRequest.java:98)
at hudson.remoting.UserRequest.perform(UserRequest.java:48)
at hudson.remoting.Request$2.run(Request.java:326)
at hudson.remoting.InterceptingExecutorService$1.call(InterceptingExecutorService.java:72)
at java.util.concurrent.FutureTask$Sync.innerRun(FutureTask.java:334)
at java.util.concurrent.FutureTask.run(FutureTask.java:166)
at java.util.concurrent.ThreadPoolExecutor.runWorker(ThreadPoolExecutor.java:1110)
at java.util.concurrent.ThreadPoolExecutor$Worker.run(ThreadPoolExecutor.java:603)
at java.lang.Thread.run(Thread.java:679)
Jenkins build is back to normal : Karaf-2.2.x #661
Posted by Apache Jenkins Server <je...@builds.apache.org>.
See <https://builds.apache.org/job/Karaf-2.2.x/661/>
Build failed in Jenkins: Karaf-2.2.x #660
Posted by Apache Jenkins Server <je...@builds.apache.org>.
See <https://builds.apache.org/job/Karaf-2.2.x/660/>
------------------------------------------
[...truncated 5160 lines...]
[INFO] Building Apache Karaf :: Management :: MBeans :: Config
[INFO] task-segment: [clean, install]
[INFO] ------------------------------------------------------------------------
[INFO] [clean:clean {execution: default-clean}]
[INFO] [bundle:cleanVersions {execution: cleanVersions}]
[WARNING] The parameter expression: 'project.build.resources' used in mojo: 'process' has been deprecated. Use 'project.resources' instead.
[INFO] [remote-resources:process {execution: default}]
[INFO] [antrun:run {execution: copy-notice}]
[INFO] Executing tasks
main:
[copy] Copying 1 file to <https://builds.apache.org/job/Karaf-2.2.x/ws/karaf/management/mbeans/config/target/maven-shared-archive-resources/META-INF>
[INFO] Executed tasks
[debug] execute contextualize
[INFO] [resources:resources {execution: default-resources}]
[INFO] Using 'UTF-8' encoding to copy filtered resources.
[INFO] Copying 2 resources
[INFO] Copying 1 resource
[INFO] Copying 3 resources
[INFO] [compiler:compile {execution: default-compile}]
[INFO] Compiling 2 source files to <https://builds.apache.org/job/Karaf-2.2.x/ws/karaf/management/mbeans/config/target/classes>
[debug] execute contextualize
[INFO] [resources:testResources {execution: default-testResources}]
[INFO] Using 'UTF-8' encoding to copy filtered resources.
[INFO] skip non existing resourceDirectory <https://builds.apache.org/job/Karaf-2.2.x/ws/karaf/management/mbeans/config/src/test/resources>
[INFO] Copying 3 resources
[INFO] [compiler:testCompile {execution: default-testCompile}]
[INFO] No sources to compile
[INFO] [surefire:test {execution: default-test}]
[INFO] Surefire report directory: <https://builds.apache.org/job/Karaf-2.2.x/ws/karaf/management/mbeans/config/target/surefire-reports>
-------------------------------------------------------
T E S T S
-------------------------------------------------------
Results :
Tests run: 0, Failures: 0, Errors: 0, Skipped: 0
[JENKINS] Recording test results[INFO] [bundle:bundle {execution: default-bundle}]
[INFO] [install:install {execution: default-install}]
[INFO] Installing <https://builds.apache.org/job/Karaf-2.2.x/ws/karaf/management/mbeans/config/target/org.apache.karaf.management.mbeans.config-2.2.9-SNAPSHOT.jar> to <https://builds.apache.org/job/Karaf-2.2.x/ws/.repository/org/apache/karaf/management/mbeans/org.apache.karaf.management.mbeans.config/2.2.9-SNAPSHOT/org.apache.karaf.management.mbeans.config-2.2.9-SNAPSHOT.jar>
[INFO] [bundle:install {execution: default-install}]
[INFO] Installing org/apache/karaf/management/mbeans/org.apache.karaf.management.mbeans.config/2.2.9-SNAPSHOT/org.apache.karaf.management.mbeans.config-2.2.9-SNAPSHOT.jar
[INFO] Writing OBR metadata
[JENKINS] Archiving <https://builds.apache.org/job/Karaf-2.2.x/ws/karaf/management/mbeans/config/pom.xml> to /home/hudson/hudson/jobs/Karaf-2.2.x/modules/org.apache.karaf.management.mbeans$org.apache.karaf.management.mbeans.config/builds/2012-07-29_20-07-17/archive/org.apache.karaf.management.mbeans/org.apache.karaf.management.mbeans.config/2.2.9-SNAPSHOT/org.apache.karaf.management.mbeans.config-2.2.9-SNAPSHOT.pom
[JENKINS] Archiving <https://builds.apache.org/job/Karaf-2.2.x/ws/karaf/management/mbeans/config/target/org.apache.karaf.management.mbeans.config-2.2.9-SNAPSHOT.jar> to /home/hudson/hudson/jobs/Karaf-2.2.x/modules/org.apache.karaf.management.mbeans$org.apache.karaf.management.mbeans.config/builds/2012-07-29_20-07-17/archive/org.apache.karaf.management.mbeans/org.apache.karaf.management.mbeans.config/2.2.9-SNAPSHOT/org.apache.karaf.management.mbeans.config-2.2.9-SNAPSHOT.jar
[INFO] ------------------------------------------------------------------------
[INFO] Building Apache Karaf :: Management :: MBeans :: Dev
[INFO] task-segment: [clean, install]
[INFO] ------------------------------------------------------------------------
[INFO] [clean:clean {execution: default-clean}]
[INFO] [bundle:cleanVersions {execution: cleanVersions}]
[WARNING] The parameter expression: 'project.build.resources' used in mojo: 'process' has been deprecated. Use 'project.resources' instead.
[INFO] [remote-resources:process {execution: default}]
[INFO] [antrun:run {execution: copy-notice}]
[INFO] Executing tasks
main:
[copy] Copying 1 file to <https://builds.apache.org/job/Karaf-2.2.x/ws/karaf/management/mbeans/dev/target/maven-shared-archive-resources/META-INF>
[INFO] Executed tasks
[debug] execute contextualize
[INFO] [resources:resources {execution: default-resources}]
[INFO] Using 'UTF-8' encoding to copy filtered resources.
[INFO] Copying 2 resources
[INFO] Copying 1 resource
[INFO] Copying 3 resources
[INFO] [compiler:compile {execution: default-compile}]
[INFO] Compiling 2 source files to <https://builds.apache.org/job/Karaf-2.2.x/ws/karaf/management/mbeans/dev/target/classes>
[debug] execute contextualize
[INFO] [resources:testResources {execution: default-testResources}]
[INFO] Using 'UTF-8' encoding to copy filtered resources.
[INFO] skip non existing resourceDirectory <https://builds.apache.org/job/Karaf-2.2.x/ws/karaf/management/mbeans/dev/src/test/resources>
[INFO] Copying 3 resources
[INFO] [compiler:testCompile {execution: default-testCompile}]
[INFO] No sources to compile
[INFO] [surefire:test {execution: default-test}]
[INFO] Surefire report directory: <https://builds.apache.org/job/Karaf-2.2.x/ws/karaf/management/mbeans/dev/target/surefire-reports>
-------------------------------------------------------
T E S T S
-------------------------------------------------------
Results :
Tests run: 0, Failures: 0, Errors: 0, Skipped: 0
[JENKINS] Recording test results[INFO] [bundle:bundle {execution: default-bundle}]
[INFO] [install:install {execution: default-install}]
[INFO] Installing <https://builds.apache.org/job/Karaf-2.2.x/ws/karaf/management/mbeans/dev/target/org.apache.karaf.management.mbeans.dev-2.2.9-SNAPSHOT.jar> to <https://builds.apache.org/job/Karaf-2.2.x/ws/.repository/org/apache/karaf/management/mbeans/org.apache.karaf.management.mbeans.dev/2.2.9-SNAPSHOT/org.apache.karaf.management.mbeans.dev-2.2.9-SNAPSHOT.jar>
[INFO] [bundle:install {execution: default-install}]
[INFO] Installing org/apache/karaf/management/mbeans/org.apache.karaf.management.mbeans.dev/2.2.9-SNAPSHOT/org.apache.karaf.management.mbeans.dev-2.2.9-SNAPSHOT.jar
[INFO] Writing OBR metadata
[JENKINS] Archiving <https://builds.apache.org/job/Karaf-2.2.x/ws/karaf/management/mbeans/dev/pom.xml> to /home/hudson/hudson/jobs/Karaf-2.2.x/modules/org.apache.karaf.management.mbeans$org.apache.karaf.management.mbeans.dev/builds/2012-07-29_20-07-17/archive/org.apache.karaf.management.mbeans/org.apache.karaf.management.mbeans.dev/2.2.9-SNAPSHOT/org.apache.karaf.management.mbeans.dev-2.2.9-SNAPSHOT.pom
[JENKINS] Archiving <https://builds.apache.org/job/Karaf-2.2.x/ws/karaf/management/mbeans/dev/target/org.apache.karaf.management.mbeans.dev-2.2.9-SNAPSHOT.jar> to /home/hudson/hudson/jobs/Karaf-2.2.x/modules/org.apache.karaf.management.mbeans$org.apache.karaf.management.mbeans.dev/builds/2012-07-29_20-07-17/archive/org.apache.karaf.management.mbeans/org.apache.karaf.management.mbeans.dev/2.2.9-SNAPSHOT/org.apache.karaf.management.mbeans.dev-2.2.9-SNAPSHOT.jar
[INFO] ------------------------------------------------------------------------
[INFO] Building Apache Karaf :: Management :: MBeans :: Log
[INFO] task-segment: [clean, install]
[INFO] ------------------------------------------------------------------------
[INFO] [clean:clean {execution: default-clean}]
[INFO] [bundle:cleanVersions {execution: cleanVersions}]
[WARNING] The parameter expression: 'project.build.resources' used in mojo: 'process' has been deprecated. Use 'project.resources' instead.
[INFO] [remote-resources:process {execution: default}]
[INFO] [antrun:run {execution: copy-notice}]
[INFO] Executing tasks
main:
[copy] Copying 1 file to <https://builds.apache.org/job/Karaf-2.2.x/ws/karaf/management/mbeans/log/target/maven-shared-archive-resources/META-INF>
[INFO] Executed tasks
[debug] execute contextualize
[INFO] [resources:resources {execution: default-resources}]
[INFO] Using 'UTF-8' encoding to copy filtered resources.
[INFO] Copying 2 resources
[INFO] Copying 1 resource
[INFO] Copying 3 resources
[INFO] [compiler:compile {execution: default-compile}]
[INFO] Compiling 2 source files to <https://builds.apache.org/job/Karaf-2.2.x/ws/karaf/management/mbeans/log/target/classes>
[debug] execute contextualize
[INFO] [resources:testResources {execution: default-testResources}]
[INFO] Using 'UTF-8' encoding to copy filtered resources.
[INFO] skip non existing resourceDirectory <https://builds.apache.org/job/Karaf-2.2.x/ws/karaf/management/mbeans/log/src/test/resources>
[INFO] Copying 3 resources
[INFO] [compiler:testCompile {execution: default-testCompile}]
[INFO] No sources to compile
[INFO] [surefire:test {execution: default-test}]
[INFO] Surefire report directory: <https://builds.apache.org/job/Karaf-2.2.x/ws/karaf/management/mbeans/log/target/surefire-reports>
-------------------------------------------------------
T E S T S
-------------------------------------------------------
Results :
Tests run: 0, Failures: 0, Errors: 0, Skipped: 0
[JENKINS] Recording test results[INFO] [bundle:bundle {execution: default-bundle}]
[INFO] [install:install {execution: default-install}]
[INFO] Installing <https://builds.apache.org/job/Karaf-2.2.x/ws/karaf/management/mbeans/log/target/org.apache.karaf.management.mbeans.log-2.2.9-SNAPSHOT.jar> to <https://builds.apache.org/job/Karaf-2.2.x/ws/.repository/org/apache/karaf/management/mbeans/org.apache.karaf.management.mbeans.log/2.2.9-SNAPSHOT/org.apache.karaf.management.mbeans.log-2.2.9-SNAPSHOT.jar>
[INFO] [bundle:install {execution: default-install}]
[INFO] Installing org/apache/karaf/management/mbeans/org.apache.karaf.management.mbeans.log/2.2.9-SNAPSHOT/org.apache.karaf.management.mbeans.log-2.2.9-SNAPSHOT.jar
[INFO] Writing OBR metadata
[JENKINS] Archiving <https://builds.apache.org/job/Karaf-2.2.x/ws/karaf/management/mbeans/log/pom.xml> to /home/hudson/hudson/jobs/Karaf-2.2.x/modules/org.apache.karaf.management.mbeans$org.apache.karaf.management.mbeans.log/builds/2012-07-29_20-07-17/archive/org.apache.karaf.management.mbeans/org.apache.karaf.management.mbeans.log/2.2.9-SNAPSHOT/org.apache.karaf.management.mbeans.log-2.2.9-SNAPSHOT.pom
[JENKINS] Archiving <https://builds.apache.org/job/Karaf-2.2.x/ws/karaf/management/mbeans/log/target/org.apache.karaf.management.mbeans.log-2.2.9-SNAPSHOT.jar> to /home/hudson/hudson/jobs/Karaf-2.2.x/modules/org.apache.karaf.management.mbeans$org.apache.karaf.management.mbeans.log/builds/2012-07-29_20-07-17/archive/org.apache.karaf.management.mbeans/org.apache.karaf.management.mbeans.log/2.2.9-SNAPSHOT/org.apache.karaf.management.mbeans.log-2.2.9-SNAPSHOT.jar
[INFO] ------------------------------------------------------------------------
[INFO] Building Apache Karaf :: Management :: MBeans :: OBR
[INFO] task-segment: [clean, install]
[INFO] ------------------------------------------------------------------------
[INFO] [clean:clean {execution: default-clean}]
[INFO] [bundle:cleanVersions {execution: cleanVersions}]
[WARNING] The parameter expression: 'project.build.resources' used in mojo: 'process' has been deprecated. Use 'project.resources' instead.
[INFO] [remote-resources:process {execution: default}]
[INFO] [antrun:run {execution: copy-notice}]
[INFO] Executing tasks
main:
[copy] Copying 1 file to <https://builds.apache.org/job/Karaf-2.2.x/ws/karaf/management/mbeans/obr/target/maven-shared-archive-resources/META-INF>
[INFO] Executed tasks
[debug] execute contextualize
[INFO] [resources:resources {execution: default-resources}]
[INFO] Using 'UTF-8' encoding to copy filtered resources.
[INFO] Copying 2 resources
[INFO] Copying 1 resource
[INFO] Copying 3 resources
[INFO] [compiler:compile {execution: default-compile}]
[INFO] Compiling 2 source files to <https://builds.apache.org/job/Karaf-2.2.x/ws/karaf/management/mbeans/obr/target/classes>
[debug] execute contextualize
[INFO] [resources:testResources {execution: default-testResources}]
[INFO] Using 'UTF-8' encoding to copy filtered resources.
[INFO] skip non existing resourceDirectory <https://builds.apache.org/job/Karaf-2.2.x/ws/karaf/management/mbeans/obr/src/test/resources>
[INFO] Copying 3 resources
[INFO] [compiler:testCompile {execution: default-testCompile}]
[INFO] No sources to compile
[INFO] [surefire:test {execution: default-test}]
[INFO] Surefire report directory: <https://builds.apache.org/job/Karaf-2.2.x/ws/karaf/management/mbeans/obr/target/surefire-reports>
-------------------------------------------------------
T E S T S
-------------------------------------------------------
Results :
Tests run: 0, Failures: 0, Errors: 0, Skipped: 0
[JENKINS] Recording test results[INFO] [bundle:bundle {execution: default-bundle}]
[INFO] [install:install {execution: default-install}]
[INFO] Installing <https://builds.apache.org/job/Karaf-2.2.x/ws/karaf/management/mbeans/obr/target/org.apache.karaf.management.mbeans.obr-2.2.9-SNAPSHOT.jar> to <https://builds.apache.org/job/Karaf-2.2.x/ws/.repository/org/apache/karaf/management/mbeans/org.apache.karaf.management.mbeans.obr/2.2.9-SNAPSHOT/org.apache.karaf.management.mbeans.obr-2.2.9-SNAPSHOT.jar>
[INFO] [bundle:install {execution: default-install}]
[INFO] Installing org/apache/karaf/management/mbeans/org.apache.karaf.management.mbeans.obr/2.2.9-SNAPSHOT/org.apache.karaf.management.mbeans.obr-2.2.9-SNAPSHOT.jar
[INFO] Writing OBR metadata
[JENKINS] Archiving <https://builds.apache.org/job/Karaf-2.2.x/ws/karaf/management/mbeans/obr/pom.xml> to /home/hudson/hudson/jobs/Karaf-2.2.x/modules/org.apache.karaf.management.mbeans$org.apache.karaf.management.mbeans.obr/builds/2012-07-29_20-07-17/archive/org.apache.karaf.management.mbeans/org.apache.karaf.management.mbeans.obr/2.2.9-SNAPSHOT/org.apache.karaf.management.mbeans.obr-2.2.9-SNAPSHOT.pom
[JENKINS] Archiving <https://builds.apache.org/job/Karaf-2.2.x/ws/karaf/management/mbeans/obr/target/org.apache.karaf.management.mbeans.obr-2.2.9-SNAPSHOT.jar> to /home/hudson/hudson/jobs/Karaf-2.2.x/modules/org.apache.karaf.management.mbeans$org.apache.karaf.management.mbeans.obr/builds/2012-07-29_20-07-17/archive/org.apache.karaf.management.mbeans/org.apache.karaf.management.mbeans.obr/2.2.9-SNAPSHOT/org.apache.karaf.management.mbeans.obr-2.2.9-SNAPSHOT.jar
[INFO] ------------------------------------------------------------------------
[INFO] Building Apache Karaf :: Management :: MBeans :: Web
[INFO] task-segment: [clean, install]
[INFO] ------------------------------------------------------------------------
[INFO] [clean:clean {execution: default-clean}]
[INFO] [bundle:cleanVersions {execution: cleanVersions}]
[WARNING] The parameter expression: 'project.build.resources' used in mojo: 'process' has been deprecated. Use 'project.resources' instead.
[INFO] [remote-resources:process {execution: default}]
[INFO] [antrun:run {execution: copy-notice}]
[INFO] Executing tasks
main:
[copy] Copying 1 file to <https://builds.apache.org/job/Karaf-2.2.x/ws/karaf/management/mbeans/web/target/maven-shared-archive-resources/META-INF>
[INFO] Executed tasks
[debug] execute contextualize
[INFO] [resources:resources {execution: default-resources}]
[INFO] Using 'UTF-8' encoding to copy filtered resources.
[INFO] Copying 2 resources
[INFO] Copying 1 resource
[INFO] Copying 3 resources
[INFO] [compiler:compile {execution: default-compile}]
[INFO] Compiling 2 source files to <https://builds.apache.org/job/Karaf-2.2.x/ws/karaf/management/mbeans/web/target/classes>
[debug] execute contextualize
[INFO] [resources:testResources {execution: default-testResources}]
[INFO] Using 'UTF-8' encoding to copy filtered resources.
[INFO] skip non existing resourceDirectory <https://builds.apache.org/job/Karaf-2.2.x/ws/karaf/management/mbeans/web/src/test/resources>
[INFO] Copying 3 resources
[INFO] [compiler:testCompile {execution: default-testCompile}]
[INFO] No sources to compile
[INFO] [surefire:test {execution: default-test}]
[INFO] Surefire report directory: <https://builds.apache.org/job/Karaf-2.2.x/ws/karaf/management/mbeans/web/target/surefire-reports>
-------------------------------------------------------
T E S T S
-------------------------------------------------------
Results :
Tests run: 0, Failures: 0, Errors: 0, Skipped: 0
[JENKINS] Recording test results[INFO] [bundle:bundle {execution: default-bundle}]
Jul 29, 2012 8:11:31 PM hudson.remoting.SynchronousCommandTransport$ReaderThread run
SEVERE: I/O error in channel channel
java.io.StreamCorruptedException
at java.io.ObjectInputStream.readObject0(ObjectInputStream.java:1332)
at java.io.ObjectInputStream.readObject(ObjectInputStream.java:348)
at hudson.remoting.Command.readFrom(Command.java:90)
at hudson.remoting.ClassicCommandTransport.read(ClassicCommandTransport.java:59)
at hudson.remoting.SynchronousCommandTransport$ReaderThread.run(SynchronousCommandTransport.java:48)
channel stopped
[WARNING] Bundle org.apache.karaf.management.mbeans:org.apache.karaf.management.mbeans.web:bundle:2.2.9-SNAPSHOT : Did not find matching referal for !org.apache.karaf.management.mbeans.system
ERROR: Maven JVM terminated unexpectedly with exit code 0