You are viewing a plain text version of this content. The canonical link for it is here.
Posted to dev@activemq.apache.org by Apache Jenkins Server <je...@builds.apache.org> on 2016/05/15 03:13:48 UTC

Build failed in Jenkins: ActiveMQ-Trunk-Deploy #1613

See <https://builds.apache.org/job/ActiveMQ-Trunk-Deploy/1613/changes>

Changes:

[christopher.l.shannon] https://issues.apache.org/jira/browse/AMQ-6293

------------------------------------------
[...truncated 220 lines...]
[INFO] Skipping ActiveMQ :: All JAR bundle
[INFO] This project has been banned from the build due to previous failures.
[INFO] ------------------------------------------------------------------------
[INFO]                                                                         
[INFO] ------------------------------------------------------------------------
[INFO] Skipping ActiveMQ :: Log4j Appender
[INFO] This project has been banned from the build due to previous failures.
[INFO] ------------------------------------------------------------------------
[INFO]                                                                         
[INFO] ------------------------------------------------------------------------
[INFO] Skipping ActiveMQ :: Apache Karaf
[INFO] This project has been banned from the build due to previous failures.
[INFO] ------------------------------------------------------------------------
[INFO]                                                                         
[INFO] ------------------------------------------------------------------------
[INFO] Skipping ActiveMQ :: RAR
[INFO] This project has been banned from the build due to previous failures.
[INFO] ------------------------------------------------------------------------
[INFO]                                                                         
[INFO] ------------------------------------------------------------------------
[INFO] Skipping ActiveMQ :: Run Jar
[INFO] This project has been banned from the build due to previous failures.
[INFO] ------------------------------------------------------------------------
[INFO]                                                                         
[INFO] ------------------------------------------------------------------------
[INFO] Skipping ActiveMQ :: Shiro
[INFO] This project has been banned from the build due to previous failures.
[INFO] ------------------------------------------------------------------------
[INFO]                                                                         
[INFO] ------------------------------------------------------------------------
[INFO] Skipping ActiveMQ :: Memory Usage Test Plugin
[INFO] This project has been banned from the build due to previous failures.
[INFO] ------------------------------------------------------------------------
[INFO]                                                                         
[INFO] ------------------------------------------------------------------------
[INFO] Skipping ActiveMQ :: Performance Test Plugin
[INFO] This project has been banned from the build due to previous failures.
[INFO] ------------------------------------------------------------------------
[INFO]                                                                         
[INFO] ------------------------------------------------------------------------
[INFO] Skipping ActiveMQ :: StartUp/Stop Plugin
[INFO] This project has been banned from the build due to previous failures.
[INFO] ------------------------------------------------------------------------
[INFO]                                                                         
[INFO] ------------------------------------------------------------------------
[INFO] Skipping ActiveMQ :: Web
[INFO] This project has been banned from the build due to previous failures.
[INFO] ------------------------------------------------------------------------
[INFO]                                                                         
[INFO] ------------------------------------------------------------------------
[INFO] Skipping ActiveMQ :: OSGi bundle
[INFO] This project has been banned from the build due to previous failures.
[INFO] ------------------------------------------------------------------------
[INFO]                                                                         
[INFO] ------------------------------------------------------------------------
[INFO] Skipping ActiveMQ :: Blueprint
[INFO] This project has been banned from the build due to previous failures.
[INFO] ------------------------------------------------------------------------
[INFO]                                                                         
[INFO] ------------------------------------------------------------------------
[INFO] Skipping ActiveMQ :: Web Demo
[INFO] This project has been banned from the build due to previous failures.
[INFO] ------------------------------------------------------------------------
[INFO]                                                                         
[INFO] ------------------------------------------------------------------------
[INFO] Skipping ActiveMQ :: Web Console
[INFO] This project has been banned from the build due to previous failures.
[INFO] ------------------------------------------------------------------------
[INFO]                                                                         
[INFO] ------------------------------------------------------------------------
[INFO] Skipping ActiveMQ :: Karaf Integration Tests
[INFO] This project has been banned from the build due to previous failures.
[INFO] ------------------------------------------------------------------------
[INFO]                                                                         
[INFO] ------------------------------------------------------------------------
[INFO] Skipping ActiveMQ :: Integration Test :: Spring 3.1
[INFO] This project has been banned from the build due to previous failures.
[INFO] ------------------------------------------------------------------------
[INFO]                                                                         
[INFO] ------------------------------------------------------------------------
[INFO] Skipping ActiveMQ :: Assembly
[INFO] This project has been banned from the build due to previous failures.
[INFO] ------------------------------------------------------------------------
[INFO] ------------------------------------------------------------------------
[INFO] Reactor Summary:
[INFO] 
[INFO] ActiveMQ .......................................... FAILURE [10.152s]
[INFO] ActiveMQ :: Openwire Generator .................... SKIPPED
[INFO] ActiveMQ :: Client ................................ SKIPPED
[INFO] ActiveMQ :: Openwire Legacy Support ............... SKIPPED
[INFO] ActiveMQ :: JAAS .................................. SKIPPED
[INFO] ActiveMQ :: Broker ................................ SKIPPED
[INFO] ActiveMQ :: KahaDB Store .......................... SKIPPED
[INFO] ActiveMQ :: STOMP Protocol ........................ SKIPPED
[INFO] ActiveMQ :: MQTT Protocol ......................... SKIPPED
[INFO] ActiveMQ :: JDBC Store ............................ SKIPPED
[INFO] ActiveMQ :: LevelDB Store ......................... SKIPPED
[INFO] ActiveMQ :: Generic JMS Pool ...................... SKIPPED
[INFO] ActiveMQ :: Pool .................................. SKIPPED
[INFO] ActiveMQ :: RA .................................... SKIPPED
[INFO] ActiveMQ :: Spring ................................ SKIPPED
[INFO] ActiveMQ :: AMQP .................................. SKIPPED
[INFO] ActiveMQ :: Console ............................... SKIPPED
[INFO] ActiveMQ :: Partition Management .................. SKIPPED
[INFO] ActiveMQ :: Runtime Configuration ................. SKIPPED
[INFO] ActiveMQ :: Tooling ............................... SKIPPED
[INFO] ActiveMQ :: JUnit Rule ............................ SKIPPED
[INFO] ActiveMQ :: Unit Tests ............................ SKIPPED
[INFO] ActiveMQ :: Camel ................................. SKIPPED
[INFO] ActiveMQ :: HTTP Protocol Support ................. SKIPPED
[INFO] ActiveMQ :: All JAR bundle ........................ SKIPPED
[INFO] ActiveMQ :: Log4j Appender ........................ SKIPPED
[INFO] ActiveMQ :: Apache Karaf .......................... SKIPPED
[INFO] ActiveMQ :: RAR ................................... SKIPPED
[INFO] ActiveMQ :: Run Jar ............................... SKIPPED
[INFO] ActiveMQ :: Shiro ................................. SKIPPED
[INFO] ActiveMQ :: Memory Usage Test Plugin .............. SKIPPED
[INFO] ActiveMQ :: Performance Test Plugin ............... SKIPPED
[INFO] ActiveMQ :: StartUp/Stop Plugin ................... SKIPPED
[INFO] ActiveMQ :: Web ................................... SKIPPED
[INFO] ActiveMQ :: OSGi bundle ........................... SKIPPED
[INFO] ActiveMQ :: Blueprint ............................. SKIPPED
[INFO] ActiveMQ :: Web Demo .............................. SKIPPED
[INFO] ActiveMQ :: Web Console ........................... SKIPPED
[INFO] ActiveMQ :: Karaf Integration Tests ............... SKIPPED
[INFO] ActiveMQ :: Integration Test :: Spring 3.1 ........ SKIPPED
[INFO] ActiveMQ :: Assembly .............................. SKIPPED
[INFO] ------------------------------------------------------------------------
[INFO] BUILD FAILURE
[INFO] ------------------------------------------------------------------------
[INFO] Total time: 12.660s
[INFO] Finished at: Sun May 15 03:13:47 UTC 2016
[INFO] Final Memory: 38M/982M
[INFO] ------------------------------------------------------------------------
Waiting for Jenkins to finish collecting data
[ERROR] Failed to execute goal org.apache.maven.plugins:maven-deploy-plugin:2.8.2:deploy (default-deploy) on project activemq-parent: Failed to retrieve remote metadata org.apache.activemq:activemq-parent:5.14.0-SNAPSHOT/maven-metadata.xml: Could not transfer metadata org.apache.activemq:activemq-parent:5.14.0-SNAPSHOT/maven-metadata.xml from/to apache.snapshots.https (https://repository.apache.org/content/repositories/snapshots): Failed to transfer file: https://repository.apache.org/content/repositories/snapshots/org/apache/activemq/activemq-parent/5.14.0-SNAPSHOT/maven-metadata.xml. Return code is: 503, ReasonPhrase:Service Unavailable. -> [Help 1]
org.apache.maven.lifecycle.LifecycleExecutionException: Failed to execute goal org.apache.maven.plugins:maven-deploy-plugin:2.8.2:deploy (default-deploy) on project activemq-parent: Failed to retrieve remote metadata org.apache.activemq:activemq-parent:5.14.0-SNAPSHOT/maven-metadata.xml: Could not transfer metadata org.apache.activemq:activemq-parent:5.14.0-SNAPSHOT/maven-metadata.xml from/to apache.snapshots.https (https://repository.apache.org/content/repositories/snapshots): Failed to transfer file: https://repository.apache.org/content/repositories/snapshots/org/apache/activemq/activemq-parent/5.14.0-SNAPSHOT/maven-metadata.xml. Return code is: 503, ReasonPhrase:Service Unavailable.
	at org.apache.maven.lifecycle.internal.MojoExecutor.execute(MojoExecutor.java:217)
	at org.apache.maven.lifecycle.internal.MojoExecutor.execute(MojoExecutor.java:153)
	at org.apache.maven.lifecycle.internal.MojoExecutor.execute(MojoExecutor.java:145)
	at org.apache.maven.lifecycle.internal.LifecycleModuleBuilder.buildProject(LifecycleModuleBuilder.java:84)
	at org.apache.maven.lifecycle.internal.LifecycleModuleBuilder.buildProject(LifecycleModuleBuilder.java:59)
	at org.apache.maven.lifecycle.internal.LifecycleStarter.singleThreadedBuild(LifecycleStarter.java:183)
	at org.apache.maven.lifecycle.internal.LifecycleStarter.execute(LifecycleStarter.java:161)
	at org.apache.maven.DefaultMaven.doExecute(DefaultMaven.java:320)
	at org.apache.maven.DefaultMaven.execute(DefaultMaven.java:156)
	at org.jvnet.hudson.maven3.launcher.Maven3Launcher.main(Maven3Launcher.java:117)
	at sun.reflect.NativeMethodAccessorImpl.invoke0(Native Method)
	at sun.reflect.NativeMethodAccessorImpl.invoke(NativeMethodAccessorImpl.java:57)
	at sun.reflect.DelegatingMethodAccessorImpl.invoke(DelegatingMethodAccessorImpl.java:43)
	at java.lang.reflect.Method.invoke(Method.java:606)
	at org.codehaus.plexus.classworlds.launcher.Launcher.launchStandard(Launcher.java:329)
	at org.codehaus.plexus.classworlds.launcher.Launcher.launch(Launcher.java:239)
	at org.jvnet.hudson.maven3.agent.Maven3Main.launch(Maven3Main.java:181)
	at sun.reflect.NativeMethodAccessorImpl.invoke0(Native Method)
	at sun.reflect.NativeMethodAccessorImpl.invoke(NativeMethodAccessorImpl.java:57)
	at sun.reflect.DelegatingMethodAccessorImpl.invoke(DelegatingMethodAccessorImpl.java:43)
	at java.lang.reflect.Method.invoke(Method.java:606)
	at hudson.maven.Maven3Builder.call(Maven3Builder.java:136)
	at hudson.maven.Maven3Builder.call(Maven3Builder.java:71)
	at hudson.remoting.UserRequest.perform(UserRequest.java:120)
	at hudson.remoting.UserRequest.perform(UserRequest.java:48)
	at hudson.remoting.Request$2.run(Request.java:326)
	at hudson.remoting.InterceptingExecutorService$1.call(InterceptingExecutorService.java:68)
	at java.util.concurrent.FutureTask.run(FutureTask.java:262)
	at java.util.concurrent.ThreadPoolExecutor.runWorker(ThreadPoolExecutor.java:1145)
	at java.util.concurrent.ThreadPoolExecutor$Worker.run(ThreadPoolExecutor.java:615)
	at java.lang.Thread.run(Thread.java:745)
Caused by: org.apache.maven.plugin.MojoExecutionException: Failed to retrieve remote metadata org.apache.activemq:activemq-parent:5.14.0-SNAPSHOT/maven-metadata.xml: Could not transfer metadata org.apache.activemq:activemq-parent:5.14.0-SNAPSHOT/maven-metadata.xml from/to apache.snapshots.https (https://repository.apache.org/content/repositories/snapshots): Failed to transfer file: https://repository.apache.org/content/repositories/snapshots/org/apache/activemq/activemq-parent/5.14.0-SNAPSHOT/maven-metadata.xml. Return code is: 503, ReasonPhrase:Service Unavailable.
	at org.apache.maven.plugin.deploy.DeployMojo.deployProject(DeployMojo.java:284)
	at org.apache.maven.plugin.deploy.DeployMojo.execute(DeployMojo.java:169)
	at org.apache.maven.plugin.DefaultBuildPluginManager.executeMojo(DefaultBuildPluginManager.java:101)
	at org.apache.maven.lifecycle.internal.MojoExecutor.execute(MojoExecutor.java:209)
	... 30 more
Caused by: org.apache.maven.artifact.deployer.ArtifactDeploymentException: Failed to retrieve remote metadata org.apache.activemq:activemq-parent:5.14.0-SNAPSHOT/maven-metadata.xml: Could not transfer metadata org.apache.activemq:activemq-parent:5.14.0-SNAPSHOT/maven-metadata.xml from/to apache.snapshots.https (https://repository.apache.org/content/repositories/snapshots): Failed to transfer file: https://repository.apache.org/content/repositories/snapshots/org/apache/activemq/activemq-parent/5.14.0-SNAPSHOT/maven-metadata.xml. Return code is: 503, ReasonPhrase:Service Unavailable.
	at org.apache.maven.artifact.deployer.DefaultArtifactDeployer.deploy(DefaultArtifactDeployer.java:141)
	at org.apache.maven.plugin.deploy.AbstractDeployMojo.deploy(AbstractDeployMojo.java:171)
	at org.apache.maven.plugin.deploy.DeployMojo.deployProject(DeployMojo.java:242)
	... 33 more
Caused by: org.sonatype.aether.deployment.DeploymentException: Failed to retrieve remote metadata org.apache.activemq:activemq-parent:5.14.0-SNAPSHOT/maven-metadata.xml: Could not transfer metadata org.apache.activemq:activemq-parent:5.14.0-SNAPSHOT/maven-metadata.xml from/to apache.snapshots.https (https://repository.apache.org/content/repositories/snapshots): Failed to transfer file: https://repository.apache.org/content/repositories/snapshots/org/apache/activemq/activemq-parent/5.14.0-SNAPSHOT/maven-metadata.xml. Return code is: 503, ReasonPhrase:Service Unavailable.
	at org.sonatype.aether.impl.internal.DefaultDeployer.upload(DefaultDeployer.java:403)
	at org.sonatype.aether.impl.internal.DefaultDeployer.deploy(DefaultDeployer.java:256)
	at org.sonatype.aether.impl.internal.DefaultDeployer.deploy(DefaultDeployer.java:211)
	at org.sonatype.aether.impl.internal.DefaultRepositorySystem.deploy(DefaultRepositorySystem.java:443)
	at org.apache.maven.artifact.deployer.DefaultArtifactDeployer.deploy(DefaultArtifactDeployer.java:137)
	... 35 more
Caused by: org.sonatype.aether.transfer.MetadataTransferException: Could not transfer metadata org.apache.activemq:activemq-parent:5.14.0-SNAPSHOT/maven-metadata.xml from/to apache.snapshots.https (https://repository.apache.org/content/repositories/snapshots): Failed to transfer file: https://repository.apache.org/content/repositories/snapshots/org/apache/activemq/activemq-parent/5.14.0-SNAPSHOT/maven-metadata.xml. Return code is: 503, ReasonPhrase:Service Unavailable.
	at org.sonatype.aether.connector.wagon.WagonRepositoryConnector$3.wrap(WagonRepositoryConnector.java:930)
	at org.sonatype.aether.connector.wagon.WagonRepositoryConnector$3.wrap(WagonRepositoryConnector.java:920)
	at org.sonatype.aether.connector.wagon.WagonRepositoryConnector$GetTask.run(WagonRepositoryConnector.java:669)
	at org.sonatype.aether.util.concurrency.RunnableErrorForwarder$1.run(RunnableErrorForwarder.java:60)
	... 3 more
Caused by: org.apache.maven.wagon.TransferFailedException: Failed to transfer file: https://repository.apache.org/content/repositories/snapshots/org/apache/activemq/activemq-parent/5.14.0-SNAPSHOT/maven-metadata.xml. Return code is: 503, ReasonPhrase:Service Unavailable.
	at org.apache.maven.wagon.shared.http4.AbstractHttpClientWagon.fillInputData(AbstractHttpClientWagon.java:852)
	at org.apache.maven.wagon.StreamWagon.getInputStream(StreamWagon.java:116)
	at org.apache.maven.wagon.StreamWagon.getIfNewer(StreamWagon.java:88)
	at org.apache.maven.wagon.StreamWagon.get(StreamWagon.java:61)
	at org.sonatype.aether.connector.wagon.WagonRepositoryConnector$GetTask.run(WagonRepositoryConnector.java:601)
	... 4 more
[ERROR] 
[ERROR] Re-run Maven using the -X switch to enable full debug logging.
[ERROR] 
[ERROR] For more information about the errors and possible solutions, please read the following articles:
[ERROR] [Help 1] http://cwiki.apache.org/confluence/display/MAVEN/MojoExecutionException
[JENKINS] Archiving <https://builds.apache.org/job/ActiveMQ-Trunk-Deploy/ws/activemq-unit-tests/pom.xml> to org.apache.activemq/activemq-unit-tests/5.14.0-SNAPSHOT/activemq-unit-tests-5.14.0-SNAPSHOT.pom
Compressed 71.40 KB of artifacts by 89.6% relative to #1612
[JENKINS] Archiving <https://builds.apache.org/job/ActiveMQ-Trunk-Deploy/ws/activemq-openwire-legacy/pom.xml> to org.apache.activemq/activemq-openwire-legacy/5.14.0-SNAPSHOT/activemq-openwire-legacy-5.14.0-SNAPSHOT.pom
[JENKINS] Archiving <https://builds.apache.org/job/ActiveMQ-Trunk-Deploy/ws/activemq-web-console/pom.xml> to org.apache.activemq/activemq-web-console/5.14.0-SNAPSHOT/activemq-web-console-5.14.0-SNAPSHOT.pom
[JENKINS] Archiving <https://builds.apache.org/job/ActiveMQ-Trunk-Deploy/ws/activemq-web-demo/pom.xml> to org.apache.activemq/activemq-web-demo/5.14.0-SNAPSHOT/activemq-web-demo-5.14.0-SNAPSHOT.pom
[JENKINS] Archiving <https://builds.apache.org/job/ActiveMQ-Trunk-Deploy/ws/activemq-osgi/pom.xml> to org.apache.activemq/activemq-osgi/5.14.0-SNAPSHOT/activemq-osgi-5.14.0-SNAPSHOT.pom
[JENKINS] Archiving <https://builds.apache.org/job/ActiveMQ-Trunk-Deploy/ws/activemq-tooling/activemq-maven-plugin/pom.xml> to org.apache.activemq.tooling/activemq-maven-plugin/5.14.0-SNAPSHOT/activemq-maven-plugin-5.14.0-SNAPSHOT.pom
[JENKINS] Archiving <https://builds.apache.org/job/ActiveMQ-Trunk-Deploy/ws/activemq-openwire-generator/pom.xml> to org.apache.activemq/activemq-openwire-generator/5.14.0-SNAPSHOT/activemq-openwire-generator-5.14.0-SNAPSHOT.pom
[JENKINS] Archiving <https://builds.apache.org/job/ActiveMQ-Trunk-Deploy/ws/activemq-jdbc-store/pom.xml> to org.apache.activemq/activemq-jdbc-store/5.14.0-SNAPSHOT/activemq-jdbc-store-5.14.0-SNAPSHOT.pom
[JENKINS] Archiving <https://builds.apache.org/job/ActiveMQ-Trunk-Deploy/ws/activemq-rar/pom.xml> to org.apache.activemq/activemq-rar/5.14.0-SNAPSHOT/activemq-rar-5.14.0-SNAPSHOT.pom
[JENKINS] Archiving <https://builds.apache.org/job/ActiveMQ-Trunk-Deploy/ws/activemq-tooling/activemq-memtest-maven-plugin/pom.xml> to org.apache.activemq.tooling/activemq-memtest-maven-plugin/5.14.0-SNAPSHOT/activemq-memtest-maven-plugin-5.14.0-SNAPSHOT.pom
[JENKINS] Archiving <https://builds.apache.org/job/ActiveMQ-Trunk-Deploy/ws/activemq-tooling/activemq-perf-maven-plugin/pom.xml> to org.apache.activemq.tooling/activemq-perf-maven-plugin/5.14.0-SNAPSHOT/activemq-perf-maven-plugin-5.14.0-SNAPSHOT.pom
[JENKINS] Archiving <https://builds.apache.org/job/ActiveMQ-Trunk-Deploy/ws/activemq-amqp/pom.xml> to org.apache.activemq/activemq-amqp/5.14.0-SNAPSHOT/activemq-amqp-5.14.0-SNAPSHOT.pom
[JENKINS] Archiving <https://builds.apache.org/job/ActiveMQ-Trunk-Deploy/ws/activemq-itests-spring31/pom.xml> to org.apache.activemq/activemq-itests-spring31/5.14.0-SNAPSHOT/activemq-itests-spring31-5.14.0-SNAPSHOT.pom
[JENKINS] Archiving <https://builds.apache.org/job/ActiveMQ-Trunk-Deploy/ws/assembly/pom.xml> to org.apache.activemq/apache-activemq/5.14.0-SNAPSHOT/apache-activemq-5.14.0-SNAPSHOT.pom
[JENKINS] Archiving <https://builds.apache.org/job/ActiveMQ-Trunk-Deploy/ws/activemq-jms-pool/pom.xml> to org.apache.activemq/activemq-jms-pool/5.14.0-SNAPSHOT/activemq-jms-pool-5.14.0-SNAPSHOT.pom
[JENKINS] Archiving <https://builds.apache.org/job/ActiveMQ-Trunk-Deploy/ws/activemq-log4j-appender/pom.xml> to org.apache.activemq/activemq-log4j-appender/5.14.0-SNAPSHOT/activemq-log4j-appender-5.14.0-SNAPSHOT.pom
[JENKINS] Archiving <https://builds.apache.org/job/ActiveMQ-Trunk-Deploy/ws/activemq-tooling/activemq-junit/pom.xml> to org.apache.activemq.tooling/activemq-junit/5.14.0-SNAPSHOT/activemq-junit-5.14.0-SNAPSHOT.pom
[JENKINS] Archiving <https://builds.apache.org/job/ActiveMQ-Trunk-Deploy/ws/activemq-runtime-config/pom.xml> to org.apache.activemq/activemq-runtime-config/5.14.0-SNAPSHOT/activemq-runtime-config-5.14.0-SNAPSHOT.pom
[JENKINS] Archiving <https://builds.apache.org/job/ActiveMQ-Trunk-Deploy/ws/activemq-pool/pom.xml> to org.apache.activemq/activemq-pool/5.14.0-SNAPSHOT/activemq-pool-5.14.0-SNAPSHOT.pom
[JENKINS] Archiving <https://builds.apache.org/job/ActiveMQ-Trunk-Deploy/ws/activemq-stomp/pom.xml> to org.apache.activemq/activemq-stomp/5.14.0-SNAPSHOT/activemq-stomp-5.14.0-SNAPSHOT.pom
[JENKINS] Archiving <https://builds.apache.org/job/ActiveMQ-Trunk-Deploy/ws/activemq-run/pom.xml> to org.apache.activemq/activemq-run/5.14.0-SNAPSHOT/activemq-run-5.14.0-SNAPSHOT.pom
[JENKINS] Archiving <https://builds.apache.org/job/ActiveMQ-Trunk-Deploy/ws/activemq-mqtt/pom.xml> to org.apache.activemq/activemq-mqtt/5.14.0-SNAPSHOT/activemq-mqtt-5.14.0-SNAPSHOT.pom
[JENKINS] Archiving <https://builds.apache.org/job/ActiveMQ-Trunk-Deploy/ws/activemq-shiro/pom.xml> to org.apache.activemq/activemq-shiro/5.14.0-SNAPSHOT/activemq-shiro-5.14.0-SNAPSHOT.pom
[JENKINS] Archiving <https://builds.apache.org/job/ActiveMQ-Trunk-Deploy/ws/activemq-console/pom.xml> to org.apache.activemq/activemq-console/5.14.0-SNAPSHOT/activemq-console-5.14.0-SNAPSHOT.pom
[JENKINS] Archiving <https://builds.apache.org/job/ActiveMQ-Trunk-Deploy/ws/activemq-camel/pom.xml> to org.apache.activemq/activemq-camel/5.14.0-SNAPSHOT/activemq-camel-5.14.0-SNAPSHOT.pom
[JENKINS] Archiving <https://builds.apache.org/job/ActiveMQ-Trunk-Deploy/ws/activemq-blueprint/pom.xml> to org.apache.activemq/activemq-blueprint/5.14.0-SNAPSHOT/activemq-blueprint-5.14.0-SNAPSHOT.pom
[JENKINS] Archiving <https://builds.apache.org/job/ActiveMQ-Trunk-Deploy/ws/activemq-client/pom.xml> to org.apache.activemq/activemq-client/5.14.0-SNAPSHOT/activemq-client-5.14.0-SNAPSHOT.pom
[JENKINS] Archiving <https://builds.apache.org/job/ActiveMQ-Trunk-Deploy/ws/pom.xml> to org.apache.activemq/activemq-parent/5.14.0-SNAPSHOT/activemq-parent-5.14.0-SNAPSHOT.pom
Compressed 59.36 KB of artifacts by 53.9% relative to #1612
[JENKINS] Archiving <https://builds.apache.org/job/ActiveMQ-Trunk-Deploy/ws/activemq-karaf-itest/pom.xml> to org.apache.activemq/activemq-karaf-itest/5.14.0-SNAPSHOT/activemq-karaf-itest-5.14.0-SNAPSHOT.pom
[JENKINS] Archiving <https://builds.apache.org/job/ActiveMQ-Trunk-Deploy/ws/activemq-broker/pom.xml> to org.apache.activemq/activemq-broker/5.14.0-SNAPSHOT/activemq-broker-5.14.0-SNAPSHOT.pom
[JENKINS] Archiving <https://builds.apache.org/job/ActiveMQ-Trunk-Deploy/ws/activemq-ra/pom.xml> to org.apache.activemq/activemq-ra/5.14.0-SNAPSHOT/activemq-ra-5.14.0-SNAPSHOT.pom
[JENKINS] Archiving <https://builds.apache.org/job/ActiveMQ-Trunk-Deploy/ws/activemq-spring/pom.xml> to org.apache.activemq/activemq-spring/5.14.0-SNAPSHOT/activemq-spring-5.14.0-SNAPSHOT.pom
[JENKINS] Archiving <https://builds.apache.org/job/ActiveMQ-Trunk-Deploy/ws/activemq-all/pom.xml> to org.apache.activemq/activemq-all/5.14.0-SNAPSHOT/activemq-all-5.14.0-SNAPSHOT.pom
[JENKINS] Archiving <https://builds.apache.org/job/ActiveMQ-Trunk-Deploy/ws/activemq-kahadb-store/pom.xml> to org.apache.activemq/activemq-kahadb-store/5.14.0-SNAPSHOT/activemq-kahadb-store-5.14.0-SNAPSHOT.pom
[JENKINS] Archiving <https://builds.apache.org/job/ActiveMQ-Trunk-Deploy/ws/activemq-jaas/pom.xml> to org.apache.activemq/activemq-jaas/5.14.0-SNAPSHOT/activemq-jaas-5.14.0-SNAPSHOT.pom
[JENKINS] Archiving <https://builds.apache.org/job/ActiveMQ-Trunk-Deploy/ws/activemq-tooling/pom.xml> to org.apache.activemq.tooling/activemq-tooling/5.14.0-SNAPSHOT/activemq-tooling-5.14.0-SNAPSHOT.pom
[JENKINS] Archiving <https://builds.apache.org/job/ActiveMQ-Trunk-Deploy/ws/activemq-partition/pom.xml> to org.apache.activemq/activemq-partition/5.14.0-SNAPSHOT/activemq-partition-5.14.0-SNAPSHOT.pom
[JENKINS] Archiving <https://builds.apache.org/job/ActiveMQ-Trunk-Deploy/ws/activemq-web/pom.xml> to org.apache.activemq/activemq-web/5.14.0-SNAPSHOT/activemq-web-5.14.0-SNAPSHOT.pom
[JENKINS] Archiving <https://builds.apache.org/job/ActiveMQ-Trunk-Deploy/ws/activemq-leveldb-store/pom.xml> to org.apache.activemq/activemq-leveldb-store/5.14.0-SNAPSHOT/activemq-leveldb-store-5.14.0-SNAPSHOT.pom
[JENKINS] Archiving <https://builds.apache.org/job/ActiveMQ-Trunk-Deploy/ws/activemq-karaf/pom.xml> to org.apache.activemq/activemq-karaf/5.14.0-SNAPSHOT/activemq-karaf-5.14.0-SNAPSHOT.pom
[JENKINS] Archiving <https://builds.apache.org/job/ActiveMQ-Trunk-Deploy/ws/activemq-http/pom.xml> to org.apache.activemq/activemq-http/5.14.0-SNAPSHOT/activemq-http-5.14.0-SNAPSHOT.pom
Sending e-mails to: dev@activemq.apache.org
channel stopped

Jenkins build is back to normal : ActiveMQ-Trunk-Deploy #1616

Posted by Apache Jenkins Server <je...@builds.apache.org>.
See <https://builds.apache.org/job/ActiveMQ-Trunk-Deploy/1616/changes>


Build failed in Jenkins: ActiveMQ-Trunk-Deploy #1615

Posted by Apache Jenkins Server <je...@builds.apache.org>.
See <https://builds.apache.org/job/ActiveMQ-Trunk-Deploy/1615/changes>

Changes:

[tabish121] Fix failing test in CI.  Subscribe should request receipts so that the

[tabish121] Fix test timing out on slow spinning disks.

------------------------------------------
[...truncated 220 lines...]
[INFO] Skipping ActiveMQ :: All JAR bundle
[INFO] This project has been banned from the build due to previous failures.
[INFO] ------------------------------------------------------------------------
[INFO]                                                                         
[INFO] ------------------------------------------------------------------------
[INFO] Skipping ActiveMQ :: Log4j Appender
[INFO] This project has been banned from the build due to previous failures.
[INFO] ------------------------------------------------------------------------
[INFO]                                                                         
[INFO] ------------------------------------------------------------------------
[INFO] Skipping ActiveMQ :: Apache Karaf
[INFO] This project has been banned from the build due to previous failures.
[INFO] ------------------------------------------------------------------------
[INFO]                                                                         
[INFO] ------------------------------------------------------------------------
[INFO] Skipping ActiveMQ :: RAR
[INFO] This project has been banned from the build due to previous failures.
[INFO] ------------------------------------------------------------------------
[INFO]                                                                         
[INFO] ------------------------------------------------------------------------
[INFO] Skipping ActiveMQ :: Run Jar
[INFO] This project has been banned from the build due to previous failures.
[INFO] ------------------------------------------------------------------------
[INFO]                                                                         
[INFO] ------------------------------------------------------------------------
[INFO] Skipping ActiveMQ :: Shiro
[INFO] This project has been banned from the build due to previous failures.
[INFO] ------------------------------------------------------------------------
[INFO]                                                                         
[INFO] ------------------------------------------------------------------------
[INFO] Skipping ActiveMQ :: Memory Usage Test Plugin
[INFO] This project has been banned from the build due to previous failures.
[INFO] ------------------------------------------------------------------------
[INFO]                                                                         
[INFO] ------------------------------------------------------------------------
[INFO] Skipping ActiveMQ :: Performance Test Plugin
[INFO] This project has been banned from the build due to previous failures.
[INFO] ------------------------------------------------------------------------
[INFO]                                                                         
[INFO] ------------------------------------------------------------------------
[INFO] Skipping ActiveMQ :: StartUp/Stop Plugin
[INFO] This project has been banned from the build due to previous failures.
[INFO] ------------------------------------------------------------------------
[INFO]                                                                         
[INFO] ------------------------------------------------------------------------
[INFO] Skipping ActiveMQ :: Web
[INFO] This project has been banned from the build due to previous failures.
[INFO] ------------------------------------------------------------------------
[INFO]                                                                         
[INFO] ------------------------------------------------------------------------
[INFO] Skipping ActiveMQ :: OSGi bundle
[INFO] This project has been banned from the build due to previous failures.
[INFO] ------------------------------------------------------------------------
[INFO]                                                                         
[INFO] ------------------------------------------------------------------------
[INFO] Skipping ActiveMQ :: Blueprint
[INFO] This project has been banned from the build due to previous failures.
[INFO] ------------------------------------------------------------------------
[INFO]                                                                         
[INFO] ------------------------------------------------------------------------
[INFO] Skipping ActiveMQ :: Web Demo
[INFO] This project has been banned from the build due to previous failures.
[INFO] ------------------------------------------------------------------------
[INFO]                                                                         
[INFO] ------------------------------------------------------------------------
[INFO] Skipping ActiveMQ :: Web Console
[INFO] This project has been banned from the build due to previous failures.
[INFO] ------------------------------------------------------------------------
[INFO]                                                                         
[INFO] ------------------------------------------------------------------------
[INFO] Skipping ActiveMQ :: Karaf Integration Tests
[INFO] This project has been banned from the build due to previous failures.
[INFO] ------------------------------------------------------------------------
[INFO]                                                                         
[INFO] ------------------------------------------------------------------------
[INFO] Skipping ActiveMQ :: Integration Test :: Spring 3.1
[INFO] This project has been banned from the build due to previous failures.
[INFO] ------------------------------------------------------------------------
[INFO]                                                                         
[INFO] ------------------------------------------------------------------------
[INFO] Skipping ActiveMQ :: Assembly
[INFO] This project has been banned from the build due to previous failures.
[INFO] ------------------------------------------------------------------------
[INFO] ------------------------------------------------------------------------
[INFO] Reactor Summary:
[INFO] 
[INFO] ActiveMQ .......................................... FAILURE [8.260s]
[INFO] ActiveMQ :: Openwire Generator .................... SKIPPED
[INFO] ActiveMQ :: Client ................................ SKIPPED
[INFO] ActiveMQ :: Openwire Legacy Support ............... SKIPPED
[INFO] ActiveMQ :: JAAS .................................. SKIPPED
[INFO] ActiveMQ :: Broker ................................ SKIPPED
[INFO] ActiveMQ :: KahaDB Store .......................... SKIPPED
[INFO] ActiveMQ :: STOMP Protocol ........................ SKIPPED
[INFO] ActiveMQ :: MQTT Protocol ......................... SKIPPED
[INFO] ActiveMQ :: JDBC Store ............................ SKIPPED
[INFO] ActiveMQ :: LevelDB Store ......................... SKIPPED
[INFO] ActiveMQ :: Generic JMS Pool ...................... SKIPPED
[INFO] ActiveMQ :: Pool .................................. SKIPPED
[INFO] ActiveMQ :: RA .................................... SKIPPED
[INFO] ActiveMQ :: Spring ................................ SKIPPED
[INFO] ActiveMQ :: AMQP .................................. SKIPPED
[INFO] ActiveMQ :: Console ............................... SKIPPED
[INFO] ActiveMQ :: Partition Management .................. SKIPPED
[INFO] ActiveMQ :: Runtime Configuration ................. SKIPPED
[INFO] ActiveMQ :: Tooling ............................... SKIPPED
[INFO] ActiveMQ :: JUnit Rule ............................ SKIPPED
[INFO] ActiveMQ :: Unit Tests ............................ SKIPPED
[INFO] ActiveMQ :: Camel ................................. SKIPPED
[INFO] ActiveMQ :: HTTP Protocol Support ................. SKIPPED
[INFO] ActiveMQ :: All JAR bundle ........................ SKIPPED
[INFO] ActiveMQ :: Log4j Appender ........................ SKIPPED
[INFO] ActiveMQ :: Apache Karaf .......................... SKIPPED
[INFO] ActiveMQ :: RAR ................................... SKIPPED
[INFO] ActiveMQ :: Run Jar ............................... SKIPPED
[INFO] ActiveMQ :: Shiro ................................. SKIPPED
[INFO] ActiveMQ :: Memory Usage Test Plugin .............. SKIPPED
[INFO] ActiveMQ :: Performance Test Plugin ............... SKIPPED
[INFO] ActiveMQ :: StartUp/Stop Plugin ................... SKIPPED
[INFO] ActiveMQ :: Web ................................... SKIPPED
[INFO] ActiveMQ :: OSGi bundle ........................... SKIPPED
[INFO] ActiveMQ :: Blueprint ............................. SKIPPED
[INFO] ActiveMQ :: Web Demo .............................. SKIPPED
[INFO] ActiveMQ :: Web Console ........................... SKIPPED
[INFO] ActiveMQ :: Karaf Integration Tests ............... SKIPPED
[INFO] ActiveMQ :: Integration Test :: Spring 3.1 ........ SKIPPED
[INFO] ActiveMQ :: Assembly .............................. SKIPPED
[INFO] ------------------------------------------------------------------------
[INFO] BUILD FAILURE
[INFO] ------------------------------------------------------------------------
[INFO] Total time: 12.971s
[INFO] Finished at: Wed May 18 03:14:16 UTC 2016
[INFO] Final Memory: 35M/982M
[INFO] ------------------------------------------------------------------------
Waiting for Jenkins to finish collecting data
[ERROR] Failed to execute goal org.apache.maven.plugins:maven-deploy-plugin:2.8.2:deploy (default-deploy) on project activemq-parent: Failed to retrieve remote metadata org.apache.activemq:activemq-parent:5.14.0-SNAPSHOT/maven-metadata.xml: Could not transfer metadata org.apache.activemq:activemq-parent:5.14.0-SNAPSHOT/maven-metadata.xml from/to apache.snapshots.https (https://repository.apache.org/content/repositories/snapshots): Failed to transfer file: https://repository.apache.org/content/repositories/snapshots/org/apache/activemq/activemq-parent/5.14.0-SNAPSHOT/maven-metadata.xml. Return code is: 503, ReasonPhrase:Service Unavailable. -> [Help 1]
org.apache.maven.lifecycle.LifecycleExecutionException: Failed to execute goal org.apache.maven.plugins:maven-deploy-plugin:2.8.2:deploy (default-deploy) on project activemq-parent: Failed to retrieve remote metadata org.apache.activemq:activemq-parent:5.14.0-SNAPSHOT/maven-metadata.xml: Could not transfer metadata org.apache.activemq:activemq-parent:5.14.0-SNAPSHOT/maven-metadata.xml from/to apache.snapshots.https (https://repository.apache.org/content/repositories/snapshots): Failed to transfer file: https://repository.apache.org/content/repositories/snapshots/org/apache/activemq/activemq-parent/5.14.0-SNAPSHOT/maven-metadata.xml. Return code is: 503, ReasonPhrase:Service Unavailable.
	at org.apache.maven.lifecycle.internal.MojoExecutor.execute(MojoExecutor.java:217)
	at org.apache.maven.lifecycle.internal.MojoExecutor.execute(MojoExecutor.java:153)
	at org.apache.maven.lifecycle.internal.MojoExecutor.execute(MojoExecutor.java:145)
	at org.apache.maven.lifecycle.internal.LifecycleModuleBuilder.buildProject(LifecycleModuleBuilder.java:84)
	at org.apache.maven.lifecycle.internal.LifecycleModuleBuilder.buildProject(LifecycleModuleBuilder.java:59)
	at org.apache.maven.lifecycle.internal.LifecycleStarter.singleThreadedBuild(LifecycleStarter.java:183)
	at org.apache.maven.lifecycle.internal.LifecycleStarter.execute(LifecycleStarter.java:161)
	at org.apache.maven.DefaultMaven.doExecute(DefaultMaven.java:320)
	at org.apache.maven.DefaultMaven.execute(DefaultMaven.java:156)
	at org.jvnet.hudson.maven3.launcher.Maven3Launcher.main(Maven3Launcher.java:117)
	at sun.reflect.NativeMethodAccessorImpl.invoke0(Native Method)
	at sun.reflect.NativeMethodAccessorImpl.invoke(NativeMethodAccessorImpl.java:57)
	at sun.reflect.DelegatingMethodAccessorImpl.invoke(DelegatingMethodAccessorImpl.java:43)
	at java.lang.reflect.Method.invoke(Method.java:606)
	at org.codehaus.plexus.classworlds.launcher.Launcher.launchStandard(Launcher.java:329)
	at org.codehaus.plexus.classworlds.launcher.Launcher.launch(Launcher.java:239)
	at org.jvnet.hudson.maven3.agent.Maven3Main.launch(Maven3Main.java:181)
	at sun.reflect.NativeMethodAccessorImpl.invoke0(Native Method)
	at sun.reflect.NativeMethodAccessorImpl.invoke(NativeMethodAccessorImpl.java:57)
	at sun.reflect.DelegatingMethodAccessorImpl.invoke(DelegatingMethodAccessorImpl.java:43)
	at java.lang.reflect.Method.invoke(Method.java:606)
	at hudson.maven.Maven3Builder.call(Maven3Builder.java:136)
	at hudson.maven.Maven3Builder.call(Maven3Builder.java:71)
	at hudson.remoting.UserRequest.perform(UserRequest.java:120)
	at hudson.remoting.UserRequest.perform(UserRequest.java:48)
	at hudson.remoting.Request$2.run(Request.java:326)
	at hudson.remoting.InterceptingExecutorService$1.call(InterceptingExecutorService.java:68)
	at java.util.concurrent.FutureTask.run(FutureTask.java:262)
	at java.util.concurrent.ThreadPoolExecutor.runWorker(ThreadPoolExecutor.java:1145)
	at java.util.concurrent.ThreadPoolExecutor$Worker.run(ThreadPoolExecutor.java:615)
	at java.lang.Thread.run(Thread.java:745)
Caused by: org.apache.maven.plugin.MojoExecutionException: Failed to retrieve remote metadata org.apache.activemq:activemq-parent:5.14.0-SNAPSHOT/maven-metadata.xml: Could not transfer metadata org.apache.activemq:activemq-parent:5.14.0-SNAPSHOT/maven-metadata.xml from/to apache.snapshots.https (https://repository.apache.org/content/repositories/snapshots): Failed to transfer file: https://repository.apache.org/content/repositories/snapshots/org/apache/activemq/activemq-parent/5.14.0-SNAPSHOT/maven-metadata.xml. Return code is: 503, ReasonPhrase:Service Unavailable.
	at org.apache.maven.plugin.deploy.DeployMojo.deployProject(DeployMojo.java:284)
	at org.apache.maven.plugin.deploy.DeployMojo.execute(DeployMojo.java:169)
	at org.apache.maven.plugin.DefaultBuildPluginManager.executeMojo(DefaultBuildPluginManager.java:101)
	at org.apache.maven.lifecycle.internal.MojoExecutor.execute(MojoExecutor.java:209)
	... 30 more
Caused by: org.apache.maven.artifact.deployer.ArtifactDeploymentException: Failed to retrieve remote metadata org.apache.activemq:activemq-parent:5.14.0-SNAPSHOT/maven-metadata.xml: Could not transfer metadata org.apache.activemq:activemq-parent:5.14.0-SNAPSHOT/maven-metadata.xml from/to apache.snapshots.https (https://repository.apache.org/content/repositories/snapshots): Failed to transfer file: https://repository.apache.org/content/repositories/snapshots/org/apache/activemq/activemq-parent/5.14.0-SNAPSHOT/maven-metadata.xml. Return code is: 503, ReasonPhrase:Service Unavailable.
	at org.apache.maven.artifact.deployer.DefaultArtifactDeployer.deploy(DefaultArtifactDeployer.java:141)
	at org.apache.maven.plugin.deploy.AbstractDeployMojo.deploy(AbstractDeployMojo.java:171)
	at org.apache.maven.plugin.deploy.DeployMojo.deployProject(DeployMojo.java:242)
	... 33 more
Caused by: org.sonatype.aether.deployment.DeploymentException: Failed to retrieve remote metadata org.apache.activemq:activemq-parent:5.14.0-SNAPSHOT/maven-metadata.xml: Could not transfer metadata org.apache.activemq:activemq-parent:5.14.0-SNAPSHOT/maven-metadata.xml from/to apache.snapshots.https (https://repository.apache.org/content/repositories/snapshots): Failed to transfer file: https://repository.apache.org/content/repositories/snapshots/org/apache/activemq/activemq-parent/5.14.0-SNAPSHOT/maven-metadata.xml. Return code is: 503, ReasonPhrase:Service Unavailable.
	at org.sonatype.aether.impl.internal.DefaultDeployer.upload(DefaultDeployer.java:403)
	at org.sonatype.aether.impl.internal.DefaultDeployer.deploy(DefaultDeployer.java:256)
	at org.sonatype.aether.impl.internal.DefaultDeployer.deploy(DefaultDeployer.java:211)
	at org.sonatype.aether.impl.internal.DefaultRepositorySystem.deploy(DefaultRepositorySystem.java:443)
	at org.apache.maven.artifact.deployer.DefaultArtifactDeployer.deploy(DefaultArtifactDeployer.java:137)
	... 35 more
Caused by: org.sonatype.aether.transfer.MetadataTransferException: Could not transfer metadata org.apache.activemq:activemq-parent:5.14.0-SNAPSHOT/maven-metadata.xml from/to apache.snapshots.https (https://repository.apache.org/content/repositories/snapshots): Failed to transfer file: https://repository.apache.org/content/repositories/snapshots/org/apache/activemq/activemq-parent/5.14.0-SNAPSHOT/maven-metadata.xml. Return code is: 503, ReasonPhrase:Service Unavailable.
	at org.sonatype.aether.connector.wagon.WagonRepositoryConnector$3.wrap(WagonRepositoryConnector.java:930)
	at org.sonatype.aether.connector.wagon.WagonRepositoryConnector$3.wrap(WagonRepositoryConnector.java:920)
	at org.sonatype.aether.connector.wagon.WagonRepositoryConnector$GetTask.run(WagonRepositoryConnector.java:669)
	at org.sonatype.aether.util.concurrency.RunnableErrorForwarder$1.run(RunnableErrorForwarder.java:60)
	... 3 more
Caused by: org.apache.maven.wagon.TransferFailedException: Failed to transfer file: https://repository.apache.org/content/repositories/snapshots/org/apache/activemq/activemq-parent/5.14.0-SNAPSHOT/maven-metadata.xml. Return code is: 503, ReasonPhrase:Service Unavailable.
	at org.apache.maven.wagon.shared.http4.AbstractHttpClientWagon.fillInputData(AbstractHttpClientWagon.java:852)
	at org.apache.maven.wagon.StreamWagon.getInputStream(StreamWagon.java:116)
	at org.apache.maven.wagon.StreamWagon.getIfNewer(StreamWagon.java:88)
	at org.apache.maven.wagon.StreamWagon.get(StreamWagon.java:61)
	at org.sonatype.aether.connector.wagon.WagonRepositoryConnector$GetTask.run(WagonRepositoryConnector.java:601)
	... 4 more
[ERROR] 
[ERROR] Re-run Maven using the -X switch to enable full debug logging.
[ERROR] 
[ERROR] For more information about the errors and possible solutions, please read the following articles:
[ERROR] [Help 1] http://cwiki.apache.org/confluence/display/MAVEN/MojoExecutionException
[JENKINS] Archiving <https://builds.apache.org/job/ActiveMQ-Trunk-Deploy/ws/activemq-unit-tests/pom.xml> to org.apache.activemq/activemq-unit-tests/5.14.0-SNAPSHOT/activemq-unit-tests-5.14.0-SNAPSHOT.pom
Compressed 71.40 KB of artifacts by 89.6% relative to #1612
[JENKINS] Archiving <https://builds.apache.org/job/ActiveMQ-Trunk-Deploy/ws/activemq-openwire-legacy/pom.xml> to org.apache.activemq/activemq-openwire-legacy/5.14.0-SNAPSHOT/activemq-openwire-legacy-5.14.0-SNAPSHOT.pom
[JENKINS] Archiving <https://builds.apache.org/job/ActiveMQ-Trunk-Deploy/ws/activemq-web-console/pom.xml> to org.apache.activemq/activemq-web-console/5.14.0-SNAPSHOT/activemq-web-console-5.14.0-SNAPSHOT.pom
[JENKINS] Archiving <https://builds.apache.org/job/ActiveMQ-Trunk-Deploy/ws/activemq-web-demo/pom.xml> to org.apache.activemq/activemq-web-demo/5.14.0-SNAPSHOT/activemq-web-demo-5.14.0-SNAPSHOT.pom
[JENKINS] Archiving <https://builds.apache.org/job/ActiveMQ-Trunk-Deploy/ws/activemq-osgi/pom.xml> to org.apache.activemq/activemq-osgi/5.14.0-SNAPSHOT/activemq-osgi-5.14.0-SNAPSHOT.pom
[JENKINS] Archiving <https://builds.apache.org/job/ActiveMQ-Trunk-Deploy/ws/activemq-tooling/activemq-maven-plugin/pom.xml> to org.apache.activemq.tooling/activemq-maven-plugin/5.14.0-SNAPSHOT/activemq-maven-plugin-5.14.0-SNAPSHOT.pom
[JENKINS] Archiving <https://builds.apache.org/job/ActiveMQ-Trunk-Deploy/ws/activemq-openwire-generator/pom.xml> to org.apache.activemq/activemq-openwire-generator/5.14.0-SNAPSHOT/activemq-openwire-generator-5.14.0-SNAPSHOT.pom
[JENKINS] Archiving <https://builds.apache.org/job/ActiveMQ-Trunk-Deploy/ws/activemq-jdbc-store/pom.xml> to org.apache.activemq/activemq-jdbc-store/5.14.0-SNAPSHOT/activemq-jdbc-store-5.14.0-SNAPSHOT.pom
[JENKINS] Archiving <https://builds.apache.org/job/ActiveMQ-Trunk-Deploy/ws/activemq-rar/pom.xml> to org.apache.activemq/activemq-rar/5.14.0-SNAPSHOT/activemq-rar-5.14.0-SNAPSHOT.pom
[JENKINS] Archiving <https://builds.apache.org/job/ActiveMQ-Trunk-Deploy/ws/activemq-tooling/activemq-memtest-maven-plugin/pom.xml> to org.apache.activemq.tooling/activemq-memtest-maven-plugin/5.14.0-SNAPSHOT/activemq-memtest-maven-plugin-5.14.0-SNAPSHOT.pom
[JENKINS] Archiving <https://builds.apache.org/job/ActiveMQ-Trunk-Deploy/ws/activemq-tooling/activemq-perf-maven-plugin/pom.xml> to org.apache.activemq.tooling/activemq-perf-maven-plugin/5.14.0-SNAPSHOT/activemq-perf-maven-plugin-5.14.0-SNAPSHOT.pom
[JENKINS] Archiving <https://builds.apache.org/job/ActiveMQ-Trunk-Deploy/ws/activemq-amqp/pom.xml> to org.apache.activemq/activemq-amqp/5.14.0-SNAPSHOT/activemq-amqp-5.14.0-SNAPSHOT.pom
[JENKINS] Archiving <https://builds.apache.org/job/ActiveMQ-Trunk-Deploy/ws/activemq-itests-spring31/pom.xml> to org.apache.activemq/activemq-itests-spring31/5.14.0-SNAPSHOT/activemq-itests-spring31-5.14.0-SNAPSHOT.pom
[JENKINS] Archiving <https://builds.apache.org/job/ActiveMQ-Trunk-Deploy/ws/assembly/pom.xml> to org.apache.activemq/apache-activemq/5.14.0-SNAPSHOT/apache-activemq-5.14.0-SNAPSHOT.pom
[JENKINS] Archiving <https://builds.apache.org/job/ActiveMQ-Trunk-Deploy/ws/activemq-jms-pool/pom.xml> to org.apache.activemq/activemq-jms-pool/5.14.0-SNAPSHOT/activemq-jms-pool-5.14.0-SNAPSHOT.pom
[JENKINS] Archiving <https://builds.apache.org/job/ActiveMQ-Trunk-Deploy/ws/activemq-log4j-appender/pom.xml> to org.apache.activemq/activemq-log4j-appender/5.14.0-SNAPSHOT/activemq-log4j-appender-5.14.0-SNAPSHOT.pom
[JENKINS] Archiving <https://builds.apache.org/job/ActiveMQ-Trunk-Deploy/ws/activemq-tooling/activemq-junit/pom.xml> to org.apache.activemq.tooling/activemq-junit/5.14.0-SNAPSHOT/activemq-junit-5.14.0-SNAPSHOT.pom
[JENKINS] Archiving <https://builds.apache.org/job/ActiveMQ-Trunk-Deploy/ws/activemq-runtime-config/pom.xml> to org.apache.activemq/activemq-runtime-config/5.14.0-SNAPSHOT/activemq-runtime-config-5.14.0-SNAPSHOT.pom
[JENKINS] Archiving <https://builds.apache.org/job/ActiveMQ-Trunk-Deploy/ws/activemq-pool/pom.xml> to org.apache.activemq/activemq-pool/5.14.0-SNAPSHOT/activemq-pool-5.14.0-SNAPSHOT.pom
[JENKINS] Archiving <https://builds.apache.org/job/ActiveMQ-Trunk-Deploy/ws/activemq-stomp/pom.xml> to org.apache.activemq/activemq-stomp/5.14.0-SNAPSHOT/activemq-stomp-5.14.0-SNAPSHOT.pom
[JENKINS] Archiving <https://builds.apache.org/job/ActiveMQ-Trunk-Deploy/ws/activemq-run/pom.xml> to org.apache.activemq/activemq-run/5.14.0-SNAPSHOT/activemq-run-5.14.0-SNAPSHOT.pom
[JENKINS] Archiving <https://builds.apache.org/job/ActiveMQ-Trunk-Deploy/ws/activemq-mqtt/pom.xml> to org.apache.activemq/activemq-mqtt/5.14.0-SNAPSHOT/activemq-mqtt-5.14.0-SNAPSHOT.pom
[JENKINS] Archiving <https://builds.apache.org/job/ActiveMQ-Trunk-Deploy/ws/activemq-shiro/pom.xml> to org.apache.activemq/activemq-shiro/5.14.0-SNAPSHOT/activemq-shiro-5.14.0-SNAPSHOT.pom
[JENKINS] Archiving <https://builds.apache.org/job/ActiveMQ-Trunk-Deploy/ws/activemq-console/pom.xml> to org.apache.activemq/activemq-console/5.14.0-SNAPSHOT/activemq-console-5.14.0-SNAPSHOT.pom
[JENKINS] Archiving <https://builds.apache.org/job/ActiveMQ-Trunk-Deploy/ws/activemq-camel/pom.xml> to org.apache.activemq/activemq-camel/5.14.0-SNAPSHOT/activemq-camel-5.14.0-SNAPSHOT.pom
[JENKINS] Archiving <https://builds.apache.org/job/ActiveMQ-Trunk-Deploy/ws/activemq-blueprint/pom.xml> to org.apache.activemq/activemq-blueprint/5.14.0-SNAPSHOT/activemq-blueprint-5.14.0-SNAPSHOT.pom
[JENKINS] Archiving <https://builds.apache.org/job/ActiveMQ-Trunk-Deploy/ws/activemq-client/pom.xml> to org.apache.activemq/activemq-client/5.14.0-SNAPSHOT/activemq-client-5.14.0-SNAPSHOT.pom
[JENKINS] Archiving <https://builds.apache.org/job/ActiveMQ-Trunk-Deploy/ws/pom.xml> to org.apache.activemq/activemq-parent/5.14.0-SNAPSHOT/activemq-parent-5.14.0-SNAPSHOT.pom
Compressed 59.36 KB of artifacts by 53.9% relative to #1614
[JENKINS] Archiving <https://builds.apache.org/job/ActiveMQ-Trunk-Deploy/ws/activemq-karaf-itest/pom.xml> to org.apache.activemq/activemq-karaf-itest/5.14.0-SNAPSHOT/activemq-karaf-itest-5.14.0-SNAPSHOT.pom
[JENKINS] Archiving <https://builds.apache.org/job/ActiveMQ-Trunk-Deploy/ws/activemq-broker/pom.xml> to org.apache.activemq/activemq-broker/5.14.0-SNAPSHOT/activemq-broker-5.14.0-SNAPSHOT.pom
[JENKINS] Archiving <https://builds.apache.org/job/ActiveMQ-Trunk-Deploy/ws/activemq-ra/pom.xml> to org.apache.activemq/activemq-ra/5.14.0-SNAPSHOT/activemq-ra-5.14.0-SNAPSHOT.pom
[JENKINS] Archiving <https://builds.apache.org/job/ActiveMQ-Trunk-Deploy/ws/activemq-spring/pom.xml> to org.apache.activemq/activemq-spring/5.14.0-SNAPSHOT/activemq-spring-5.14.0-SNAPSHOT.pom
[JENKINS] Archiving <https://builds.apache.org/job/ActiveMQ-Trunk-Deploy/ws/activemq-all/pom.xml> to org.apache.activemq/activemq-all/5.14.0-SNAPSHOT/activemq-all-5.14.0-SNAPSHOT.pom
[JENKINS] Archiving <https://builds.apache.org/job/ActiveMQ-Trunk-Deploy/ws/activemq-kahadb-store/pom.xml> to org.apache.activemq/activemq-kahadb-store/5.14.0-SNAPSHOT/activemq-kahadb-store-5.14.0-SNAPSHOT.pom
[JENKINS] Archiving <https://builds.apache.org/job/ActiveMQ-Trunk-Deploy/ws/activemq-jaas/pom.xml> to org.apache.activemq/activemq-jaas/5.14.0-SNAPSHOT/activemq-jaas-5.14.0-SNAPSHOT.pom
[JENKINS] Archiving <https://builds.apache.org/job/ActiveMQ-Trunk-Deploy/ws/activemq-tooling/pom.xml> to org.apache.activemq.tooling/activemq-tooling/5.14.0-SNAPSHOT/activemq-tooling-5.14.0-SNAPSHOT.pom
[JENKINS] Archiving <https://builds.apache.org/job/ActiveMQ-Trunk-Deploy/ws/activemq-partition/pom.xml> to org.apache.activemq/activemq-partition/5.14.0-SNAPSHOT/activemq-partition-5.14.0-SNAPSHOT.pom
[JENKINS] Archiving <https://builds.apache.org/job/ActiveMQ-Trunk-Deploy/ws/activemq-web/pom.xml> to org.apache.activemq/activemq-web/5.14.0-SNAPSHOT/activemq-web-5.14.0-SNAPSHOT.pom
[JENKINS] Archiving <https://builds.apache.org/job/ActiveMQ-Trunk-Deploy/ws/activemq-leveldb-store/pom.xml> to org.apache.activemq/activemq-leveldb-store/5.14.0-SNAPSHOT/activemq-leveldb-store-5.14.0-SNAPSHOT.pom
[JENKINS] Archiving <https://builds.apache.org/job/ActiveMQ-Trunk-Deploy/ws/activemq-karaf/pom.xml> to org.apache.activemq/activemq-karaf/5.14.0-SNAPSHOT/activemq-karaf-5.14.0-SNAPSHOT.pom
[JENKINS] Archiving <https://builds.apache.org/job/ActiveMQ-Trunk-Deploy/ws/activemq-http/pom.xml> to org.apache.activemq/activemq-http/5.14.0-SNAPSHOT/activemq-http-5.14.0-SNAPSHOT.pom
Sending e-mails to: dev@activemq.apache.org
channel stopped

Build failed in Jenkins: ActiveMQ-Trunk-Deploy #1614

Posted by Apache Jenkins Server <je...@builds.apache.org>.
See <https://builds.apache.org/job/ActiveMQ-Trunk-Deploy/1614/changes>

Changes:

[tabish121] https://issues.apache.org/jira/browse/AMQ-6293

[tabish121] Clean up and adjust test timeouts for CI

[tabish121] https://issues.apache.org/jira/browse/AMQ-5621

------------------------------------------
[...truncated 9867 lines...]
	at org.sonatype.aether.impl.internal.DefaultDeployer.deploy(DefaultDeployer.java:274)
	... 38 more
Caused by: org.apache.maven.wagon.TransferFailedException: Failed to transfer file: https://repository.apache.org/content/repositories/snapshots/org/apache/activemq/tooling/activemq-tooling/5.14.0-SNAPSHOT/activemq-tooling-5.14.0-20160517.040205-65.pom. Return code is: 502, ReasonPhrase:Proxy Error.
	at org.apache.maven.wagon.shared.http4.AbstractHttpClientWagon.put(AbstractHttpClientWagon.java:562)
	at org.apache.maven.wagon.shared.http4.AbstractHttpClientWagon.put(AbstractHttpClientWagon.java:471)
	at org.apache.maven.wagon.shared.http4.AbstractHttpClientWagon.put(AbstractHttpClientWagon.java:451)
	at org.sonatype.aether.connector.wagon.WagonRepositoryConnector$PutTask.run(WagonRepositoryConnector.java:811)
	... 40 more
[ERROR] Failed to execute goal org.apache.maven.plugins:maven-deploy-plugin:2.8.2:deploy (default-deploy) on project activemq-log4j-appender: Failed to retrieve remote metadata org.apache.activemq:activemq-log4j-appender:5.14.0-SNAPSHOT/maven-metadata.xml: Could not transfer metadata org.apache.activemq:activemq-log4j-appender:5.14.0-SNAPSHOT/maven-metadata.xml from/to apache.snapshots.https (https://repository.apache.org/content/repositories/snapshots): Failed to transfer file: https://repository.apache.org/content/repositories/snapshots/org/apache/activemq/activemq-log4j-appender/5.14.0-SNAPSHOT/maven-metadata.xml. Return code is: 502, ReasonPhrase:Proxy Error. -> [Help 1]
org.apache.maven.lifecycle.LifecycleExecutionException: Failed to execute goal org.apache.maven.plugins:maven-deploy-plugin:2.8.2:deploy (default-deploy) on project activemq-log4j-appender: Failed to retrieve remote metadata org.apache.activemq:activemq-log4j-appender:5.14.0-SNAPSHOT/maven-metadata.xml: Could not transfer metadata org.apache.activemq:activemq-log4j-appender:5.14.0-SNAPSHOT/maven-metadata.xml from/to apache.snapshots.https (https://repository.apache.org/content/repositories/snapshots): Failed to transfer file: https://repository.apache.org/content/repositories/snapshots/org/apache/activemq/activemq-log4j-appender/5.14.0-SNAPSHOT/maven-metadata.xml. Return code is: 502, ReasonPhrase:Proxy Error.
	at org.apache.maven.lifecycle.internal.MojoExecutor.execute(MojoExecutor.java:217)
	at org.apache.maven.lifecycle.internal.MojoExecutor.execute(MojoExecutor.java:153)
	at org.apache.maven.lifecycle.internal.MojoExecutor.execute(MojoExecutor.java:145)
	at org.apache.maven.lifecycle.internal.LifecycleModuleBuilder.buildProject(LifecycleModuleBuilder.java:84)
	at org.apache.maven.lifecycle.internal.LifecycleModuleBuilder.buildProject(LifecycleModuleBuilder.java:59)
	at org.apache.maven.lifecycle.internal.LifecycleStarter.singleThreadedBuild(LifecycleStarter.java:183)
	at org.apache.maven.lifecycle.internal.LifecycleStarter.execute(LifecycleStarter.java:161)
	at org.apache.maven.DefaultMaven.doExecute(DefaultMaven.java:320)
	at org.apache.maven.DefaultMaven.execute(DefaultMaven.java:156)
	at org.jvnet.hudson.maven3.launcher.Maven3Launcher.main(Maven3Launcher.java:117)
	at sun.reflect.NativeMethodAccessorImpl.invoke0(Native Method)
	at sun.reflect.NativeMethodAccessorImpl.invoke(NativeMethodAccessorImpl.java:57)
	at sun.reflect.DelegatingMethodAccessorImpl.invoke(DelegatingMethodAccessorImpl.java:43)
	at java.lang.reflect.Method.invoke(Method.java:606)
	at org.codehaus.plexus.classworlds.launcher.Launcher.launchStandard(Launcher.java:329)
	at org.codehaus.plexus.classworlds.launcher.Launcher.launch(Launcher.java:239)
	at org.jvnet.hudson.maven3.agent.Maven3Main.launch(Maven3Main.java:181)
	at sun.reflect.NativeMethodAccessorImpl.invoke0(Native Method)
	at sun.reflect.NativeMethodAccessorImpl.invoke(NativeMethodAccessorImpl.java:57)
	at sun.reflect.DelegatingMethodAccessorImpl.invoke(DelegatingMethodAccessorImpl.java:43)
	at java.lang.reflect.Method.invoke(Method.java:606)
	at hudson.maven.Maven3Builder.call(Maven3Builder.java:136)
	at hudson.maven.Maven3Builder.call(Maven3Builder.java:71)
	at hudson.remoting.UserRequest.perform(UserRequest.java:120)
	at hudson.remoting.UserRequest.perform(UserRequest.java:48)
	at hudson.remoting.Request$2.run(Request.java:326)
	at hudson.remoting.InterceptingExecutorService$1.call(InterceptingExecutorService.java:68)
	at java.util.concurrent.FutureTask.run(FutureTask.java:262)
	at java.util.concurrent.ThreadPoolExecutor.runWorker(ThreadPoolExecutor.java:1145)
	at java.util.concurrent.ThreadPoolExecutor$Worker.run(ThreadPoolExecutor.java:615)
	at java.lang.Thread.run(Thread.java:745)
Caused by: org.apache.maven.plugin.MojoExecutionException: Failed to retrieve remote metadata org.apache.activemq:activemq-log4j-appender:5.14.0-SNAPSHOT/maven-metadata.xml: Could not transfer metadata org.apache.activemq:activemq-log4j-appender:5.14.0-SNAPSHOT/maven-metadata.xml from/to apache.snapshots.https (https://repository.apache.org/content/repositories/snapshots): Failed to transfer file: https://repository.apache.org/content/repositories/snapshots/org/apache/activemq/activemq-log4j-appender/5.14.0-SNAPSHOT/maven-metadata.xml. Return code is: 502, ReasonPhrase:Proxy Error.
	at org.apache.maven.plugin.deploy.DeployMojo.deployProject(DeployMojo.java:284)
	at org.apache.maven.plugin.deploy.DeployMojo.execute(DeployMojo.java:169)
	at org.apache.maven.plugin.DefaultBuildPluginManager.executeMojo(DefaultBuildPluginManager.java:101)
	at org.apache.maven.lifecycle.internal.MojoExecutor.execute(MojoExecutor.java:209)
	... 30 more
Caused by: org.apache.maven.artifact.deployer.ArtifactDeploymentException: Failed to retrieve remote metadata org.apache.activemq:activemq-log4j-appender:5.14.0-SNAPSHOT/maven-metadata.xml: Could not transfer metadata org.apache.activemq:activemq-log4j-appender:5.14.0-SNAPSHOT/maven-metadata.xml from/to apache.snapshots.https (https://repository.apache.org/content/repositories/snapshots): Failed to transfer file: https://repository.apache.org/content/repositories/snapshots/org/apache/activemq/activemq-log4j-appender/5.14.0-SNAPSHOT/maven-metadata.xml. Return code is: 502, ReasonPhrase:Proxy Error.
	at org.apache.maven.artifact.deployer.DefaultArtifactDeployer.deploy(DefaultArtifactDeployer.java:141)
	at org.apache.maven.plugin.deploy.AbstractDeployMojo.deploy(AbstractDeployMojo.java:171)
	at org.apache.maven.plugin.deploy.DeployMojo.deployProject(DeployMojo.java:250)
	... 33 more
Caused by: org.sonatype.aether.deployment.DeploymentException: Failed to retrieve remote metadata org.apache.activemq:activemq-log4j-appender:5.14.0-SNAPSHOT/maven-metadata.xml: Could not transfer metadata org.apache.activemq:activemq-log4j-appender:5.14.0-SNAPSHOT/maven-metadata.xml from/to apache.snapshots.https (https://repository.apache.org/content/repositories/snapshots): Failed to transfer file: https://repository.apache.org/content/repositories/snapshots/org/apache/activemq/activemq-log4j-appender/5.14.0-SNAPSHOT/maven-metadata.xml. Return code is: 502, ReasonPhrase:Proxy Error.
	at org.sonatype.aether.impl.internal.DefaultDeployer.upload(DefaultDeployer.java:403)
	at org.sonatype.aether.impl.internal.DefaultDeployer.deploy(DefaultDeployer.java:256)
	at org.sonatype.aether.impl.internal.DefaultDeployer.deploy(DefaultDeployer.java:211)
	at org.sonatype.aether.impl.internal.DefaultRepositorySystem.deploy(DefaultRepositorySystem.java:443)
	at org.apache.maven.artifact.deployer.DefaultArtifactDeployer.deploy(DefaultArtifactDeployer.java:137)
	... 35 more
Caused by: org.sonatype.aether.transfer.MetadataTransferException: Could not transfer metadata org.apache.activemq:activemq-log4j-appender:5.14.0-SNAPSHOT/maven-metadata.xml from/to apache.snapshots.https (https://repository.apache.org/content/repositories/snapshots): Failed to transfer file: https://repository.apache.org/content/repositories/snapshots/org/apache/activemq/activemq-log4j-appender/5.14.0-SNAPSHOT/maven-metadata.xml. Return code is: 502, ReasonPhrase:Proxy Error.
	at org.sonatype.aether.connector.wagon.WagonRepositoryConnector$3.wrap(WagonRepositoryConnector.java:930)
	at org.sonatype.aether.connector.wagon.WagonRepositoryConnector$3.wrap(WagonRepositoryConnector.java:920)
	at org.sonatype.aether.connector.wagon.WagonRepositoryConnector$GetTask.run(WagonRepositoryConnector.java:669)
	at org.sonatype.aether.util.concurrency.RunnableErrorForwarder$1.run(RunnableErrorForwarder.java:60)
	... 3 more
Caused by: org.apache.maven.wagon.TransferFailedException: Failed to transfer file: https://repository.apache.org/content/repositories/snapshots/org/apache/activemq/activemq-log4j-appender/5.14.0-SNAPSHOT/maven-metadata.xml. Return code is: 502, ReasonPhrase:Proxy Error.
	at org.apache.maven.wagon.shared.http4.AbstractHttpClientWagon.fillInputData(AbstractHttpClientWagon.java:852)
	at org.apache.maven.wagon.StreamWagon.getInputStream(StreamWagon.java:116)
	at org.apache.maven.wagon.StreamWagon.getIfNewer(StreamWagon.java:88)
	at org.apache.maven.wagon.StreamWagon.get(StreamWagon.java:61)
	at org.sonatype.aether.connector.wagon.WagonRepositoryConnector$GetTask.run(WagonRepositoryConnector.java:601)
	... 4 more
[ERROR] Failed to execute goal org.apache.maven.plugins:maven-deploy-plugin:2.8.2:deploy (default-deploy) on project activemq-blueprint: Failed to retrieve remote metadata org.apache.activemq:activemq-blueprint:5.14.0-SNAPSHOT/maven-metadata.xml: Could not transfer metadata org.apache.activemq:activemq-blueprint:5.14.0-SNAPSHOT/maven-metadata.xml from/to apache.snapshots.https (https://repository.apache.org/content/repositories/snapshots): Failed to transfer file: https://repository.apache.org/content/repositories/snapshots/org/apache/activemq/activemq-blueprint/5.14.0-SNAPSHOT/maven-metadata.xml. Return code is: 502, ReasonPhrase:Proxy Error. -> [Help 1]
org.apache.maven.lifecycle.LifecycleExecutionException: Failed to execute goal org.apache.maven.plugins:maven-deploy-plugin:2.8.2:deploy (default-deploy) on project activemq-blueprint: Failed to retrieve remote metadata org.apache.activemq:activemq-blueprint:5.14.0-SNAPSHOT/maven-metadata.xml: Could not transfer metadata org.apache.activemq:activemq-blueprint:5.14.0-SNAPSHOT/maven-metadata.xml from/to apache.snapshots.https (https://repository.apache.org/content/repositories/snapshots): Failed to transfer file: https://repository.apache.org/content/repositories/snapshots/org/apache/activemq/activemq-blueprint/5.14.0-SNAPSHOT/maven-metadata.xml. Return code is: 502, ReasonPhrase:Proxy Error.
	at org.apache.maven.lifecycle.internal.MojoExecutor.execute(MojoExecutor.java:217)
	at org.apache.maven.lifecycle.internal.MojoExecutor.execute(MojoExecutor.java:153)
	at org.apache.maven.lifecycle.internal.MojoExecutor.execute(MojoExecutor.java:145)
	at org.apache.maven.lifecycle.internal.LifecycleModuleBuilder.buildProject(LifecycleModuleBuilder.java:84)
	at org.apache.maven.lifecycle.internal.LifecycleModuleBuilder.buildProject(LifecycleModuleBuilder.java:59)
	at org.apache.maven.lifecycle.internal.LifecycleStarter.singleThreadedBuild(LifecycleStarter.java:183)
	at org.apache.maven.lifecycle.internal.LifecycleStarter.execute(LifecycleStarter.java:161)
	at org.apache.maven.DefaultMaven.doExecute(DefaultMaven.java:320)
	at org.apache.maven.DefaultMaven.execute(DefaultMaven.java:156)
	at org.jvnet.hudson.maven3.launcher.Maven3Launcher.main(Maven3Launcher.java:117)
	at sun.reflect.NativeMethodAccessorImpl.invoke0(Native Method)
	at sun.reflect.NativeMethodAccessorImpl.invoke(NativeMethodAccessorImpl.java:57)
	at sun.reflect.DelegatingMethodAccessorImpl.invoke(DelegatingMethodAccessorImpl.java:43)
	at java.lang.reflect.Method.invoke(Method.java:606)
	at org.codehaus.plexus.classworlds.launcher.Launcher.launchStandard(Launcher.java:329)
	at org.codehaus.plexus.classworlds.launcher.Launcher.launch(Launcher.java:239)
	at org.jvnet.hudson.maven3.agent.Maven3Main.launch(Maven3Main.java:181)
	at sun.reflect.NativeMethodAccessorImpl.invoke0(Native Method)
	at sun.reflect.NativeMethodAccessorImpl.invoke(NativeMethodAccessorImpl.java:57)
	at sun.reflect.DelegatingMethodAccessorImpl.invoke(DelegatingMethodAccessorImpl.java:43)
	at java.lang.reflect.Method.invoke(Method.java:606)
	at hudson.maven.Maven3Builder.call(Maven3Builder.java:136)
	at hudson.maven.Maven3Builder.call(Maven3Builder.java:71)
	at hudson.remoting.UserRequest.perform(UserRequest.java:120)
	at hudson.remoting.UserRequest.perform(UserRequest.java:48)
	at hudson.remoting.Request$2.run(Request.java:326)
	at hudson.remoting.InterceptingExecutorService$1.call(InterceptingExecutorService.java:68)
	at java.util.concurrent.FutureTask.run(FutureTask.java:262)
	at java.util.concurrent.ThreadPoolExecutor.runWorker(ThreadPoolExecutor.java:1145)
	at java.util.concurrent.ThreadPoolExecutor$Worker.run(ThreadPoolExecutor.java:615)
	at java.lang.Thread.run(Thread.java:745)
Caused by: org.apache.maven.plugin.MojoExecutionException: Failed to retrieve remote metadata org.apache.activemq:activemq-blueprint:5.14.0-SNAPSHOT/maven-metadata.xml: Could not transfer metadata org.apache.activemq:activemq-blueprint:5.14.0-SNAPSHOT/maven-metadata.xml from/to apache.snapshots.https (https://repository.apache.org/content/repositories/snapshots): Failed to transfer file: https://repository.apache.org/content/repositories/snapshots/org/apache/activemq/activemq-blueprint/5.14.0-SNAPSHOT/maven-metadata.xml. Return code is: 502, ReasonPhrase:Proxy Error.
	at org.apache.maven.plugin.deploy.DeployMojo.deployProject(DeployMojo.java:284)
	at org.apache.maven.plugin.deploy.DeployMojo.execute(DeployMojo.java:169)
	at org.apache.maven.plugin.DefaultBuildPluginManager.executeMojo(DefaultBuildPluginManager.java:101)
	at org.apache.maven.lifecycle.internal.MojoExecutor.execute(MojoExecutor.java:209)
	... 30 more
Caused by: org.apache.maven.artifact.deployer.ArtifactDeploymentException: Failed to retrieve remote metadata org.apache.activemq:activemq-blueprint:5.14.0-SNAPSHOT/maven-metadata.xml: Could not transfer metadata org.apache.activemq:activemq-blueprint:5.14.0-SNAPSHOT/maven-metadata.xml from/to apache.snapshots.https (https://repository.apache.org/content/repositories/snapshots): Failed to transfer file: https://repository.apache.org/content/repositories/snapshots/org/apache/activemq/activemq-blueprint/5.14.0-SNAPSHOT/maven-metadata.xml. Return code is: 502, ReasonPhrase:Proxy Error.
	at org.apache.maven.artifact.deployer.DefaultArtifactDeployer.deploy(DefaultArtifactDeployer.java:141)
	at org.apache.maven.plugin.deploy.AbstractDeployMojo.deploy(AbstractDeployMojo.java:171)
	at org.apache.maven.plugin.deploy.DeployMojo.deployProject(DeployMojo.java:250)
	... 33 more
Caused by: org.sonatype.aether.deployment.DeploymentException: Failed to retrieve remote metadata org.apache.activemq:activemq-blueprint:5.14.0-SNAPSHOT/maven-metadata.xml: Could not transfer metadata org.apache.activemq:activemq-blueprint:5.14.0-SNAPSHOT/maven-metadata.xml from/to apache.snapshots.https (https://repository.apache.org/content/repositories/snapshots): Failed to transfer file: https://repository.apache.org/content/repositories/snapshots/org/apache/activemq/activemq-blueprint/5.14.0-SNAPSHOT/maven-metadata.xml. Return code is: 502, ReasonPhrase:Proxy Error.
	at org.sonatype.aether.impl.internal.DefaultDeployer.upload(DefaultDeployer.java:403)
	at org.sonatype.aether.impl.internal.DefaultDeployer.deploy(DefaultDeployer.java:256)
	at org.sonatype.aether.impl.internal.DefaultDeployer.deploy(DefaultDeployer.java:211)
	at org.sonatype.aether.impl.internal.DefaultRepositorySystem.deploy(DefaultRepositorySystem.java:443)
	at org.apache.maven.artifact.deployer.DefaultArtifactDeployer.deploy(DefaultArtifactDeployer.java:137)
	... 35 more
Caused by: org.sonatype.aether.transfer.MetadataTransferException: Could not transfer metadata org.apache.activemq:activemq-blueprint:5.14.0-SNAPSHOT/maven-metadata.xml from/to apache.snapshots.https (https://repository.apache.org/content/repositories/snapshots): Failed to transfer file: https://repository.apache.org/content/repositories/snapshots/org/apache/activemq/activemq-blueprint/5.14.0-SNAPSHOT/maven-metadata.xml. Return code is: 502, ReasonPhrase:Proxy Error.
	at org.sonatype.aether.connector.wagon.WagonRepositoryConnector$3.wrap(WagonRepositoryConnector.java:930)
	at org.sonatype.aether.connector.wagon.WagonRepositoryConnector$3.wrap(WagonRepositoryConnector.java:920)
	at org.sonatype.aether.connector.wagon.WagonRepositoryConnector$GetTask.run(WagonRepositoryConnector.java:669)
	at org.sonatype.aether.util.concurrency.RunnableErrorForwarder$1.run(RunnableErrorForwarder.java:60)
	... 3 more
Caused by: org.apache.maven.wagon.TransferFailedException: Failed to transfer file: https://repository.apache.org/content/repositories/snapshots/org/apache/activemq/activemq-blueprint/5.14.0-SNAPSHOT/maven-metadata.xml. Return code is: 502, ReasonPhrase:Proxy Error.
	at org.apache.maven.wagon.shared.http4.AbstractHttpClientWagon.fillInputData(AbstractHttpClientWagon.java:852)
	at org.apache.maven.wagon.StreamWagon.getInputStream(StreamWagon.java:116)
	at org.apache.maven.wagon.StreamWagon.getIfNewer(StreamWagon.java:88)
	at org.apache.maven.wagon.StreamWagon.get(StreamWagon.java:61)
	at org.sonatype.aether.connector.wagon.WagonRepositoryConnector$GetTask.run(WagonRepositoryConnector.java:601)
	... 4 more
[ERROR] 
[ERROR] Re-run Maven using the -X switch to enable full debug logging.
[ERROR] 
[ERROR] For more information about the errors and possible solutions, please read the following articles:
[ERROR] [Help 1] http://cwiki.apache.org/confluence/display/MAVEN/MojoExecutionException
[ERROR] 
[ERROR] After correcting the problems, you can resume the build with the command
[ERROR]   mvn <goals> -rf :activemq-ra
[JENKINS] Archiving <https://builds.apache.org/job/ActiveMQ-Trunk-Deploy/ws/activemq-unit-tests/pom.xml> to org.apache.activemq/activemq-unit-tests/5.14.0-SNAPSHOT/activemq-unit-tests-5.14.0-SNAPSHOT.pom
Compressed 71.40 KB of artifacts by 89.6% relative to #1612
[JENKINS] Archiving <https://builds.apache.org/job/ActiveMQ-Trunk-Deploy/ws/activemq-openwire-legacy/pom.xml> to org.apache.activemq/activemq-openwire-legacy/5.14.0-SNAPSHOT/activemq-openwire-legacy-5.14.0-SNAPSHOT.pom
[JENKINS] Archiving <https://builds.apache.org/job/ActiveMQ-Trunk-Deploy/ws/activemq-openwire-legacy/target/activemq-openwire-legacy-5.14.0-SNAPSHOT.jar> to org.apache.activemq/activemq-openwire-legacy/5.14.0-20160517.031928-64/activemq-openwire-legacy-5.14.0-20160517.031928-64.jar
[JENKINS] Archiving <https://builds.apache.org/job/ActiveMQ-Trunk-Deploy/ws/activemq-openwire-legacy/target/activemq-openwire-legacy-5.14.0-SNAPSHOT-sources.jar> to org.apache.activemq/activemq-openwire-legacy/5.14.0-20160517.031928-64/activemq-openwire-legacy-5.14.0-20160517.031928-64-sources.jar
[JENKINS] Archiving <https://builds.apache.org/job/ActiveMQ-Trunk-Deploy/ws/activemq-openwire-legacy/target/activemq-openwire-legacy-5.14.0-SNAPSHOT-javadoc.jar> to org.apache.activemq/activemq-openwire-legacy/5.14.0-20160517.031928-64/activemq-openwire-legacy-5.14.0-20160517.031928-64-javadoc.jar
[JENKINS] Archiving <https://builds.apache.org/job/ActiveMQ-Trunk-Deploy/ws/activemq-web-console/pom.xml> to org.apache.activemq/activemq-web-console/5.14.0-SNAPSHOT/activemq-web-console-5.14.0-SNAPSHOT.pom
[JENKINS] Archiving <https://builds.apache.org/job/ActiveMQ-Trunk-Deploy/ws/activemq-web-demo/pom.xml> to org.apache.activemq/activemq-web-demo/5.14.0-SNAPSHOT/activemq-web-demo-5.14.0-SNAPSHOT.pom
[JENKINS] Archiving <https://builds.apache.org/job/ActiveMQ-Trunk-Deploy/ws/activemq-osgi/pom.xml> to org.apache.activemq/activemq-osgi/5.14.0-SNAPSHOT/activemq-osgi-5.14.0-SNAPSHOT.pom
[JENKINS] Archiving <https://builds.apache.org/job/ActiveMQ-Trunk-Deploy/ws/activemq-tooling/activemq-maven-plugin/pom.xml> to org.apache.activemq.tooling/activemq-maven-plugin/5.14.0-SNAPSHOT/activemq-maven-plugin-5.14.0-SNAPSHOT.pom
[JENKINS] Archiving <https://builds.apache.org/job/ActiveMQ-Trunk-Deploy/ws/activemq-openwire-generator/pom.xml> to org.apache.activemq/activemq-openwire-generator/5.14.0-SNAPSHOT/activemq-openwire-generator-5.14.0-SNAPSHOT.pom
[JENKINS] Archiving <https://builds.apache.org/job/ActiveMQ-Trunk-Deploy/ws/activemq-openwire-generator/target/activemq-openwire-generator-5.14.0-SNAPSHOT.jar> to org.apache.activemq/activemq-openwire-generator/5.14.0-20160517.031439-65/activemq-openwire-generator-5.14.0-20160517.031439-65.jar
[JENKINS] Archiving <https://builds.apache.org/job/ActiveMQ-Trunk-Deploy/ws/activemq-openwire-generator/target/activemq-openwire-generator-5.14.0-SNAPSHOT-sources.jar> to org.apache.activemq/activemq-openwire-generator/5.14.0-20160517.031439-65/activemq-openwire-generator-5.14.0-20160517.031439-65-sources.jar
[JENKINS] Archiving <https://builds.apache.org/job/ActiveMQ-Trunk-Deploy/ws/activemq-openwire-generator/target/activemq-openwire-generator-5.14.0-SNAPSHOT-javadoc.jar> to org.apache.activemq/activemq-openwire-generator/5.14.0-20160517.031439-65/activemq-openwire-generator-5.14.0-20160517.031439-65-javadoc.jar
[JENKINS] Archiving <https://builds.apache.org/job/ActiveMQ-Trunk-Deploy/ws/activemq-jdbc-store/pom.xml> to org.apache.activemq/activemq-jdbc-store/5.14.0-SNAPSHOT/activemq-jdbc-store-5.14.0-SNAPSHOT.pom
[JENKINS] Archiving <https://builds.apache.org/job/ActiveMQ-Trunk-Deploy/ws/activemq-jdbc-store/target/activemq-jdbc-store-5.14.0-SNAPSHOT.jar> to org.apache.activemq/activemq-jdbc-store/5.14.0-20160517.033431-64/activemq-jdbc-store-5.14.0-20160517.033431-64.jar
[JENKINS] Archiving <https://builds.apache.org/job/ActiveMQ-Trunk-Deploy/ws/activemq-jdbc-store/target/activemq-jdbc-store-5.14.0-SNAPSHOT-sources.jar> to org.apache.activemq/activemq-jdbc-store/5.14.0-20160517.033431-64/activemq-jdbc-store-5.14.0-20160517.033431-64-sources.jar
[JENKINS] Archiving <https://builds.apache.org/job/ActiveMQ-Trunk-Deploy/ws/activemq-jdbc-store/target/activemq-jdbc-store-5.14.0-SNAPSHOT-javadoc.jar> to org.apache.activemq/activemq-jdbc-store/5.14.0-20160517.033431-64/activemq-jdbc-store-5.14.0-20160517.033431-64-javadoc.jar
[JENKINS] Archiving <https://builds.apache.org/job/ActiveMQ-Trunk-Deploy/ws/activemq-rar/pom.xml> to org.apache.activemq/activemq-rar/5.14.0-SNAPSHOT/activemq-rar-5.14.0-SNAPSHOT.pom
[JENKINS] Archiving <https://builds.apache.org/job/ActiveMQ-Trunk-Deploy/ws/activemq-tooling/activemq-memtest-maven-plugin/pom.xml> to org.apache.activemq.tooling/activemq-memtest-maven-plugin/5.14.0-SNAPSHOT/activemq-memtest-maven-plugin-5.14.0-SNAPSHOT.pom
[JENKINS] Archiving <https://builds.apache.org/job/ActiveMQ-Trunk-Deploy/ws/activemq-tooling/activemq-perf-maven-plugin/pom.xml> to org.apache.activemq.tooling/activemq-perf-maven-plugin/5.14.0-SNAPSHOT/activemq-perf-maven-plugin-5.14.0-SNAPSHOT.pom
[JENKINS] Archiving <https://builds.apache.org/job/ActiveMQ-Trunk-Deploy/ws/activemq-amqp/pom.xml> to org.apache.activemq/activemq-amqp/5.14.0-SNAPSHOT/activemq-amqp-5.14.0-SNAPSHOT.pom
[JENKINS] Archiving <https://builds.apache.org/job/ActiveMQ-Trunk-Deploy/ws/activemq-itests-spring31/pom.xml> to org.apache.activemq/activemq-itests-spring31/5.14.0-SNAPSHOT/activemq-itests-spring31-5.14.0-SNAPSHOT.pom
[JENKINS] Archiving <https://builds.apache.org/job/ActiveMQ-Trunk-Deploy/ws/assembly/pom.xml> to org.apache.activemq/apache-activemq/5.14.0-SNAPSHOT/apache-activemq-5.14.0-SNAPSHOT.pom
[JENKINS] Archiving <https://builds.apache.org/job/ActiveMQ-Trunk-Deploy/ws/activemq-jms-pool/pom.xml> to org.apache.activemq/activemq-jms-pool/5.14.0-SNAPSHOT/activemq-jms-pool-5.14.0-SNAPSHOT.pom
[JENKINS] Archiving <https://builds.apache.org/job/ActiveMQ-Trunk-Deploy/ws/activemq-jms-pool/target/activemq-jms-pool-5.14.0-SNAPSHOT.jar> to org.apache.activemq/activemq-jms-pool/5.14.0-20160517.033702-64/activemq-jms-pool-5.14.0-20160517.033702-64.jar
[JENKINS] Archiving <https://builds.apache.org/job/ActiveMQ-Trunk-Deploy/ws/activemq-jms-pool/target/activemq-jms-pool-5.14.0-SNAPSHOT-sources.jar> to org.apache.activemq/activemq-jms-pool/5.14.0-20160517.033702-64/activemq-jms-pool-5.14.0-20160517.033702-64-sources.jar
[JENKINS] Archiving <https://builds.apache.org/job/ActiveMQ-Trunk-Deploy/ws/activemq-jms-pool/target/activemq-jms-pool-5.14.0-SNAPSHOT-javadoc.jar> to org.apache.activemq/activemq-jms-pool/5.14.0-20160517.033702-64/activemq-jms-pool-5.14.0-20160517.033702-64-javadoc.jar
[JENKINS] Archiving <https://builds.apache.org/job/ActiveMQ-Trunk-Deploy/ws/activemq-log4j-appender/pom.xml> to org.apache.activemq/activemq-log4j-appender/5.14.0-SNAPSHOT/activemq-log4j-appender-5.14.0-SNAPSHOT.pom
[JENKINS] Archiving <https://builds.apache.org/job/ActiveMQ-Trunk-Deploy/ws/activemq-log4j-appender/target/activemq-log4j-appender-5.14.0-SNAPSHOT.jar> to org.apache.activemq/activemq-log4j-appender/5.14.0-SNAPSHOT/activemq-log4j-appender-5.14.0-SNAPSHOT.jar
[JENKINS] Archiving <https://builds.apache.org/job/ActiveMQ-Trunk-Deploy/ws/activemq-log4j-appender/target/activemq-log4j-appender-5.14.0-SNAPSHOT-sources.jar> to org.apache.activemq/activemq-log4j-appender/5.14.0-SNAPSHOT/activemq-log4j-appender-5.14.0-SNAPSHOT-sources.jar
[JENKINS] Archiving <https://builds.apache.org/job/ActiveMQ-Trunk-Deploy/ws/activemq-log4j-appender/target/activemq-log4j-appender-5.14.0-SNAPSHOT-javadoc.jar> to org.apache.activemq/activemq-log4j-appender/5.14.0-SNAPSHOT/activemq-log4j-appender-5.14.0-SNAPSHOT-javadoc.jar
[JENKINS] Archiving <https://builds.apache.org/job/ActiveMQ-Trunk-Deploy/ws/activemq-tooling/activemq-junit/pom.xml> to org.apache.activemq.tooling/activemq-junit/5.14.0-SNAPSHOT/activemq-junit-5.14.0-SNAPSHOT.pom
[JENKINS] Archiving <https://builds.apache.org/job/ActiveMQ-Trunk-Deploy/ws/activemq-runtime-config/pom.xml> to org.apache.activemq/activemq-runtime-config/5.14.0-SNAPSHOT/activemq-runtime-config-5.14.0-SNAPSHOT.pom
[JENKINS] Archiving <https://builds.apache.org/job/ActiveMQ-Trunk-Deploy/ws/activemq-pool/pom.xml> to org.apache.activemq/activemq-pool/5.14.0-SNAPSHOT/activemq-pool-5.14.0-SNAPSHOT.pom
[JENKINS] Archiving <https://builds.apache.org/job/ActiveMQ-Trunk-Deploy/ws/activemq-pool/target/activemq-pool-5.14.0-SNAPSHOT.jar> to org.apache.activemq/activemq-pool/5.14.0-20160517.034057-64/activemq-pool-5.14.0-20160517.034057-64.jar
[JENKINS] Archiving <https://builds.apache.org/job/ActiveMQ-Trunk-Deploy/ws/activemq-pool/target/activemq-pool-5.14.0-SNAPSHOT-sources.jar> to org.apache.activemq/activemq-pool/5.14.0-20160517.034057-64/activemq-pool-5.14.0-20160517.034057-64-sources.jar
[JENKINS] Archiving <https://builds.apache.org/job/ActiveMQ-Trunk-Deploy/ws/activemq-pool/target/activemq-pool-5.14.0-SNAPSHOT-javadoc.jar> to org.apache.activemq/activemq-pool/5.14.0-20160517.034057-64/activemq-pool-5.14.0-20160517.034057-64-javadoc.jar
[JENKINS] Archiving <https://builds.apache.org/job/ActiveMQ-Trunk-Deploy/ws/activemq-stomp/pom.xml> to org.apache.activemq/activemq-stomp/5.14.0-SNAPSHOT/activemq-stomp-5.14.0-SNAPSHOT.pom
[JENKINS] Archiving <https://builds.apache.org/job/ActiveMQ-Trunk-Deploy/ws/activemq-stomp/target/activemq-stomp-5.14.0-SNAPSHOT.jar> to org.apache.activemq/activemq-stomp/5.14.0-20160517.032715-64/activemq-stomp-5.14.0-20160517.032715-64.jar
[JENKINS] Archiving <https://builds.apache.org/job/ActiveMQ-Trunk-Deploy/ws/activemq-stomp/target/activemq-stomp-5.14.0-SNAPSHOT-sources.jar> to org.apache.activemq/activemq-stomp/5.14.0-20160517.032715-64/activemq-stomp-5.14.0-20160517.032715-64-sources.jar
[JENKINS] Archiving <https://builds.apache.org/job/ActiveMQ-Trunk-Deploy/ws/activemq-stomp/target/activemq-stomp-5.14.0-SNAPSHOT-javadoc.jar> to org.apache.activemq/activemq-stomp/5.14.0-20160517.032715-64/activemq-stomp-5.14.0-20160517.032715-64-javadoc.jar
[JENKINS] Archiving <https://builds.apache.org/job/ActiveMQ-Trunk-Deploy/ws/activemq-run/pom.xml> to org.apache.activemq/activemq-run/5.14.0-SNAPSHOT/activemq-run-5.14.0-SNAPSHOT.pom
[JENKINS] Archiving <https://builds.apache.org/job/ActiveMQ-Trunk-Deploy/ws/activemq-mqtt/pom.xml> to org.apache.activemq/activemq-mqtt/5.14.0-SNAPSHOT/activemq-mqtt-5.14.0-SNAPSHOT.pom
[JENKINS] Archiving <https://builds.apache.org/job/ActiveMQ-Trunk-Deploy/ws/activemq-mqtt/target/activemq-mqtt-5.14.0-SNAPSHOT.jar> to org.apache.activemq/activemq-mqtt/5.14.0-20160517.032923-64/activemq-mqtt-5.14.0-20160517.032923-64.jar
[JENKINS] Archiving <https://builds.apache.org/job/ActiveMQ-Trunk-Deploy/ws/activemq-mqtt/target/activemq-mqtt-5.14.0-SNAPSHOT-sources.jar> to org.apache.activemq/activemq-mqtt/5.14.0-20160517.032923-64/activemq-mqtt-5.14.0-20160517.032923-64-sources.jar
[JENKINS] Archiving <https://builds.apache.org/job/ActiveMQ-Trunk-Deploy/ws/activemq-mqtt/target/activemq-mqtt-5.14.0-SNAPSHOT-javadoc.jar> to org.apache.activemq/activemq-mqtt/5.14.0-20160517.032923-64/activemq-mqtt-5.14.0-20160517.032923-64-javadoc.jar
[JENKINS] Archiving <https://builds.apache.org/job/ActiveMQ-Trunk-Deploy/ws/activemq-shiro/pom.xml> to org.apache.activemq/activemq-shiro/5.14.0-SNAPSHOT/activemq-shiro-5.14.0-SNAPSHOT.pom
[JENKINS] Archiving <https://builds.apache.org/job/ActiveMQ-Trunk-Deploy/ws/activemq-console/pom.xml> to org.apache.activemq/activemq-console/5.14.0-SNAPSHOT/activemq-console-5.14.0-SNAPSHOT.pom
[JENKINS] Archiving <https://builds.apache.org/job/ActiveMQ-Trunk-Deploy/ws/activemq-console/target/activemq-console-5.14.0-SNAPSHOT.jar> to org.apache.activemq/activemq-console/5.14.0-SNAPSHOT/activemq-console-5.14.0-SNAPSHOT.jar
[JENKINS] Archiving <https://builds.apache.org/job/ActiveMQ-Trunk-Deploy/ws/activemq-console/target/activemq-console-5.14.0-SNAPSHOT-sources.jar> to org.apache.activemq/activemq-console/5.14.0-SNAPSHOT/activemq-console-5.14.0-SNAPSHOT-sources.jar
[JENKINS] Archiving <https://builds.apache.org/job/ActiveMQ-Trunk-Deploy/ws/activemq-console/target/activemq-console-5.14.0-SNAPSHOT-javadoc.jar> to org.apache.activemq/activemq-console/5.14.0-SNAPSHOT/activemq-console-5.14.0-SNAPSHOT-javadoc.jar
[JENKINS] Archiving <https://builds.apache.org/job/ActiveMQ-Trunk-Deploy/ws/activemq-camel/pom.xml> to org.apache.activemq/activemq-camel/5.14.0-SNAPSHOT/activemq-camel-5.14.0-SNAPSHOT.pom
[JENKINS] Archiving <https://builds.apache.org/job/ActiveMQ-Trunk-Deploy/ws/activemq-blueprint/pom.xml> to org.apache.activemq/activemq-blueprint/5.14.0-SNAPSHOT/activemq-blueprint-5.14.0-SNAPSHOT.pom
[JENKINS] Archiving <https://builds.apache.org/job/ActiveMQ-Trunk-Deploy/ws/activemq-blueprint/target/activemq-blueprint-5.14.0-SNAPSHOT.jar> to org.apache.activemq/activemq-blueprint/5.14.0-SNAPSHOT/activemq-blueprint-5.14.0-SNAPSHOT.jar
[JENKINS] Archiving <https://builds.apache.org/job/ActiveMQ-Trunk-Deploy/ws/activemq-blueprint/target/activemq-blueprint-5.14.0-SNAPSHOT-sources.jar> to org.apache.activemq/activemq-blueprint/5.14.0-SNAPSHOT/activemq-blueprint-5.14.0-SNAPSHOT-sources.jar
[JENKINS] Archiving <https://builds.apache.org/job/ActiveMQ-Trunk-Deploy/ws/activemq-client/pom.xml> to org.apache.activemq/activemq-client/5.14.0-SNAPSHOT/activemq-client-5.14.0-SNAPSHOT.pom
[JENKINS] Archiving <https://builds.apache.org/job/ActiveMQ-Trunk-Deploy/ws/activemq-client/target/activemq-client-5.14.0-SNAPSHOT.jar> to org.apache.activemq/activemq-client/5.14.0-20160517.031737-65/activemq-client-5.14.0-20160517.031737-65.jar
[JENKINS] Archiving <https://builds.apache.org/job/ActiveMQ-Trunk-Deploy/ws/activemq-client/target/activemq-client-5.14.0-SNAPSHOT-sources.jar> to org.apache.activemq/activemq-client/5.14.0-20160517.031737-65/activemq-client-5.14.0-20160517.031737-65-sources.jar
[JENKINS] Archiving <https://builds.apache.org/job/ActiveMQ-Trunk-Deploy/ws/activemq-client/target/activemq-client-5.14.0-SNAPSHOT-javadoc.jar> to org.apache.activemq/activemq-client/5.14.0-20160517.031737-65/activemq-client-5.14.0-20160517.031737-65-javadoc.jar
[JENKINS] Archiving <https://builds.apache.org/job/ActiveMQ-Trunk-Deploy/ws/pom.xml> to org.apache.activemq/activemq-parent/5.14.0-SNAPSHOT/activemq-parent-5.14.0-SNAPSHOT.pom
Compressed 59.36 KB of artifacts by 53.9% relative to #1612
[JENKINS] Archiving <https://builds.apache.org/job/ActiveMQ-Trunk-Deploy/ws/activemq-karaf-itest/pom.xml> to org.apache.activemq/activemq-karaf-itest/5.14.0-SNAPSHOT/activemq-karaf-itest-5.14.0-SNAPSHOT.pom
[JENKINS] Archiving <https://builds.apache.org/job/ActiveMQ-Trunk-Deploy/ws/activemq-broker/pom.xml> to org.apache.activemq/activemq-broker/5.14.0-SNAPSHOT/activemq-broker-5.14.0-SNAPSHOT.pom
[JENKINS] Archiving <https://builds.apache.org/job/ActiveMQ-Trunk-Deploy/ws/activemq-broker/target/activemq-broker-5.14.0-SNAPSHOT.jar> to org.apache.activemq/activemq-broker/5.14.0-20160517.032145-64/activemq-broker-5.14.0-20160517.032145-64.jar
[JENKINS] Archiving <https://builds.apache.org/job/ActiveMQ-Trunk-Deploy/ws/activemq-broker/target/activemq-broker-5.14.0-SNAPSHOT-sources.jar> to org.apache.activemq/activemq-broker/5.14.0-20160517.032145-64/activemq-broker-5.14.0-20160517.032145-64-sources.jar
[JENKINS] Archiving <https://builds.apache.org/job/ActiveMQ-Trunk-Deploy/ws/activemq-broker/target/activemq-broker-5.14.0-SNAPSHOT-javadoc.jar> to org.apache.activemq/activemq-broker/5.14.0-20160517.032145-64/activemq-broker-5.14.0-20160517.032145-64-javadoc.jar
[JENKINS] Archiving <https://builds.apache.org/job/ActiveMQ-Trunk-Deploy/ws/activemq-broker/target/activemq-broker-5.14.0-SNAPSHOT-tests.jar> to org.apache.activemq/activemq-broker/5.14.0-20160517.032145-64/activemq-broker-5.14.0-20160517.032145-64-tests.jar
[JENKINS] Archiving <https://builds.apache.org/job/ActiveMQ-Trunk-Deploy/ws/activemq-ra/pom.xml> to org.apache.activemq/activemq-ra/5.14.0-SNAPSHOT/activemq-ra-5.14.0-SNAPSHOT.pom
[JENKINS] Archiving <https://builds.apache.org/job/ActiveMQ-Trunk-Deploy/ws/activemq-ra/target/activemq-ra-5.14.0-SNAPSHOT.jar> to org.apache.activemq/activemq-ra/5.14.0-20160517.034526-64/activemq-ra-5.14.0-20160517.034526-64.jar
[JENKINS] Archiving <https://builds.apache.org/job/ActiveMQ-Trunk-Deploy/ws/activemq-ra/target/xbean/activemq-ra.xsd> to org.apache.activemq/activemq-ra/5.14.0-20160517.034526-64/activemq-ra-5.14.0-20160517.034526-64.xsd
[JENKINS] Archiving <https://builds.apache.org/job/ActiveMQ-Trunk-Deploy/ws/activemq-ra/target/xbean/activemq-ra.xsd.html> to org.apache.activemq/activemq-ra/5.14.0-20160517.034526-64/activemq-ra-5.14.0-20160517.034526-64-schema.html
[JENKINS] Archiving <https://builds.apache.org/job/ActiveMQ-Trunk-Deploy/ws/activemq-ra/target/activemq-ra-5.14.0-SNAPSHOT-sources.jar> to org.apache.activemq/activemq-ra/5.14.0-20160517.034526-64/activemq-ra-5.14.0-20160517.034526-64-sources.jar
[JENKINS] Archiving <https://builds.apache.org/job/ActiveMQ-Trunk-Deploy/ws/activemq-ra/target/activemq-ra-5.14.0-SNAPSHOT-javadoc.jar> to org.apache.activemq/activemq-ra/5.14.0-20160517.034526-64/activemq-ra-5.14.0-20160517.034526-64-javadoc.jar
[JENKINS] Archiving <https://builds.apache.org/job/ActiveMQ-Trunk-Deploy/ws/activemq-ra/target/xbean/activemq-ra.xsd.html> to org.apache.activemq/activemq-ra/5.14.0-20160517.034526-64/activemq-ra-5.14.0-20160517.034526-64.xsd.html
[JENKINS] Archiving <https://builds.apache.org/job/ActiveMQ-Trunk-Deploy/ws/activemq-spring/pom.xml> to org.apache.activemq/activemq-spring/5.14.0-SNAPSHOT/activemq-spring-5.14.0-SNAPSHOT.pom
[JENKINS] Archiving <https://builds.apache.org/job/ActiveMQ-Trunk-Deploy/ws/activemq-all/pom.xml> to org.apache.activemq/activemq-all/5.14.0-SNAPSHOT/activemq-all-5.14.0-SNAPSHOT.pom
[JENKINS] Archiving <https://builds.apache.org/job/ActiveMQ-Trunk-Deploy/ws/activemq-kahadb-store/pom.xml> to org.apache.activemq/activemq-kahadb-store/5.14.0-SNAPSHOT/activemq-kahadb-store-5.14.0-SNAPSHOT.pom
[JENKINS] Archiving <https://builds.apache.org/job/ActiveMQ-Trunk-Deploy/ws/activemq-kahadb-store/target/activemq-kahadb-store-5.14.0-SNAPSHOT.jar> to org.apache.activemq/activemq-kahadb-store/5.14.0-20160517.032603-64/activemq-kahadb-store-5.14.0-20160517.032603-64.jar
[JENKINS] Archiving <https://builds.apache.org/job/ActiveMQ-Trunk-Deploy/ws/activemq-kahadb-store/target/activemq-kahadb-store-5.14.0-SNAPSHOT-sources.jar> to org.apache.activemq/activemq-kahadb-store/5.14.0-20160517.032603-64/activemq-kahadb-store-5.14.0-20160517.032603-64-sources.jar
[JENKINS] Archiving <https://builds.apache.org/job/ActiveMQ-Trunk-Deploy/ws/activemq-kahadb-store/target/activemq-kahadb-store-5.14.0-SNAPSHOT-javadoc.jar> to org.apache.activemq/activemq-kahadb-store/5.14.0-20160517.032603-64/activemq-kahadb-store-5.14.0-20160517.032603-64-javadoc.jar
[JENKINS] Archiving <https://builds.apache.org/job/ActiveMQ-Trunk-Deploy/ws/activemq-jaas/pom.xml> to org.apache.activemq/activemq-jaas/5.14.0-SNAPSHOT/activemq-jaas-5.14.0-SNAPSHOT.pom
[JENKINS] Archiving <https://builds.apache.org/job/ActiveMQ-Trunk-Deploy/ws/activemq-jaas/target/activemq-jaas-5.14.0-SNAPSHOT.jar> to org.apache.activemq/activemq-jaas/5.14.0-20160517.032041-65/activemq-jaas-5.14.0-20160517.032041-65.jar
[JENKINS] Archiving <https://builds.apache.org/job/ActiveMQ-Trunk-Deploy/ws/activemq-jaas/target/activemq-jaas-5.14.0-SNAPSHOT-sources.jar> to org.apache.activemq/activemq-jaas/5.14.0-20160517.032041-65/activemq-jaas-5.14.0-20160517.032041-65-sources.jar
[JENKINS] Archiving <https://builds.apache.org/job/ActiveMQ-Trunk-Deploy/ws/activemq-jaas/target/activemq-jaas-5.14.0-SNAPSHOT-javadoc.jar> to org.apache.activemq/activemq-jaas/5.14.0-20160517.032041-65/activemq-jaas-5.14.0-20160517.032041-65-javadoc.jar
[JENKINS] Archiving <https://builds.apache.org/job/ActiveMQ-Trunk-Deploy/ws/activemq-tooling/pom.xml> to org.apache.activemq.tooling/activemq-tooling/5.14.0-SNAPSHOT/activemq-tooling-5.14.0-SNAPSHOT.pom
[JENKINS] Archiving <https://builds.apache.org/job/ActiveMQ-Trunk-Deploy/ws/activemq-partition/pom.xml> to org.apache.activemq/activemq-partition/5.14.0-SNAPSHOT/activemq-partition-5.14.0-SNAPSHOT.pom
[JENKINS] Archiving <https://builds.apache.org/job/ActiveMQ-Trunk-Deploy/ws/activemq-partition/target/activemq-partition-5.14.0-SNAPSHOT.jar> to org.apache.activemq/activemq-partition/5.14.0-SNAPSHOT/activemq-partition-5.14.0-SNAPSHOT.jar
[JENKINS] Archiving <https://builds.apache.org/job/ActiveMQ-Trunk-Deploy/ws/activemq-partition/target/activemq-partition-5.14.0-SNAPSHOT-sources.jar> to org.apache.activemq/activemq-partition/5.14.0-SNAPSHOT/activemq-partition-5.14.0-SNAPSHOT-sources.jar
[JENKINS] Archiving <https://builds.apache.org/job/ActiveMQ-Trunk-Deploy/ws/activemq-partition/target/activemq-partition-5.14.0-SNAPSHOT-javadoc.jar> to org.apache.activemq/activemq-partition/5.14.0-SNAPSHOT/activemq-partition-5.14.0-SNAPSHOT-javadoc.jar
[JENKINS] Archiving <https://builds.apache.org/job/ActiveMQ-Trunk-Deploy/ws/activemq-web/pom.xml> to org.apache.activemq/activemq-web/5.14.0-SNAPSHOT/activemq-web-5.14.0-SNAPSHOT.pom
[JENKINS] Archiving <https://builds.apache.org/job/ActiveMQ-Trunk-Deploy/ws/activemq-leveldb-store/pom.xml> to org.apache.activemq/activemq-leveldb-store/5.14.0-SNAPSHOT/activemq-leveldb-store-5.14.0-SNAPSHOT.pom
[JENKINS] Archiving <https://builds.apache.org/job/ActiveMQ-Trunk-Deploy/ws/activemq-leveldb-store/target/activemq-leveldb-store-5.14.0-SNAPSHOT.jar> to org.apache.activemq/activemq-leveldb-store/5.14.0-20160517.033634-63/activemq-leveldb-store-5.14.0-20160517.033634-63.jar
[JENKINS] Archiving <https://builds.apache.org/job/ActiveMQ-Trunk-Deploy/ws/activemq-leveldb-store/target/activemq-leveldb-store-5.14.0-SNAPSHOT-sources.jar> to org.apache.activemq/activemq-leveldb-store/5.14.0-20160517.033634-63/activemq-leveldb-store-5.14.0-20160517.033634-63-sources.jar
[JENKINS] Archiving <https://builds.apache.org/job/ActiveMQ-Trunk-Deploy/ws/activemq-leveldb-store/target/activemq-leveldb-store-5.14.0-SNAPSHOT-javadoc.jar> to org.apache.activemq/activemq-leveldb-store/5.14.0-20160517.033634-63/activemq-leveldb-store-5.14.0-20160517.033634-63-javadoc.jar
[JENKINS] Archiving <https://builds.apache.org/job/ActiveMQ-Trunk-Deploy/ws/activemq-karaf/pom.xml> to org.apache.activemq/activemq-karaf/5.14.0-SNAPSHOT/activemq-karaf-5.14.0-SNAPSHOT.pom
[JENKINS] Archiving <https://builds.apache.org/job/ActiveMQ-Trunk-Deploy/ws/activemq-http/pom.xml> to org.apache.activemq/activemq-http/5.14.0-SNAPSHOT/activemq-http-5.14.0-SNAPSHOT.pom
Sending e-mails to: dev@activemq.apache.org
Sending e-mails to: dev@activemq.apache.org
Sending e-mails to: dev@activemq.apache.org
Sending e-mails to: dev@activemq.apache.org
Sending e-mails to: dev@activemq.apache.org
Sending e-mails to: dev@activemq.apache.org
Sending e-mails to: dev@activemq.apache.org
channel stopped