You are viewing a plain text version of this content. The canonical link for it is here.
Posted to dev@lucene.apache.org by Apache Jenkins Server <je...@builds.apache.org> on 2015/01/09 17:57:10 UTC

[JENKINS-MAVEN] Lucene-Solr-Maven-trunk #1316: POMs out of sync

Build: https://builds.apache.org/job/Lucene-Solr-Maven-trunk/1316/

No tests ran.

Build Log:
[...truncated 39090 lines...]
      [mvn] [INFO] -------------------------------------------------------------
      [mvn] [INFO] -------------------------------------------------------------
      [mvn] [ERROR] COMPILATION ERROR : 
      [mvn] [INFO] -------------------------------------------------------------

[...truncated 696 lines...]
BUILD FAILED
/usr/home/jenkins/jenkins-slave/workspace/Lucene-Solr-Maven-trunk/build.xml:542: The following error occurred while executing this line:
/usr/home/jenkins/jenkins-slave/workspace/Lucene-Solr-Maven-trunk/build.xml:204: The following error occurred while executing this line:
: Java returned: 1

Total time: 20 minutes 28 seconds
Build step 'Invoke Ant' marked build as failure
Email was triggered for: Failure
Sending email for trigger: Failure



[JENKINS-MAVEN] Lucene-Solr-Maven-trunk #1320: POMs out of sync

Posted by Apache Jenkins Server <je...@builds.apache.org>.
Build: https://builds.apache.org/job/Lucene-Solr-Maven-trunk/1320/

No tests ran.

Build Log:
[...truncated 39159 lines...]
      [mvn] [INFO] -------------------------------------------------------------
      [mvn] [INFO] -------------------------------------------------------------
      [mvn] [ERROR] COMPILATION ERROR : 
      [mvn] [INFO] -------------------------------------------------------------

[...truncated 696 lines...]
BUILD FAILED
/usr/home/jenkins/jenkins-slave/workspace/Lucene-Solr-Maven-trunk/build.xml:542: The following error occurred while executing this line:
/usr/home/jenkins/jenkins-slave/workspace/Lucene-Solr-Maven-trunk/build.xml:204: The following error occurred while executing this line:
: Java returned: 1

Total time: 20 minutes 55 seconds
Build step 'Invoke Ant' marked build as failure
Email was triggered for: Failure
Sending email for trigger: Failure



Re: [JENKINS-MAVEN] Lucene-Solr-Maven-trunk #1319: POMs out of sync

Posted by Mark Miller <ma...@gmail.com>.
Ah, thanks Steve. When I looked a while back, it looked like it was failing
with the same Jetty compile issues as we were seeing in the Jetty 9 upgrade
issue.

- Mark

On Tue Jan 13 2015 at 12:48:56 PM Steve Rowe <sa...@gmail.com> wrote:

> Maven doesn’t use the .ivy caches.
>
> I’m looking into the problem, and I’ve traced it to something to do with
> moving example/ivy.xml to server/ivy.xml - these are used to build the
> dependencies sections in the Maven POMs.
>
> Steve
>
> > On Jan 13, 2015, at 12:41 PM, Mark Miller <ma...@gmail.com> wrote:
> >
> > I don't currently have the ability to log into these 3 jenkins machines.
> Can someone that does please nuke the .ivy caches? See SOLR-4839.
> >
> > On Mon Jan 12 2015 at 1:44:18 PM Apache Jenkins Server <
> jenkins@builds.apache.org> wrote:
> > Build: https://builds.apache.org/job/Lucene-Solr-Maven-trunk/1319/
> >
> > No tests ran.
> >
> > Build Log:
> > [...truncated 39089 lines...]
> >       [mvn] [INFO] ------------------------------
> -------------------------------
> >       [mvn] [INFO] ------------------------------
> -------------------------------
> >       [mvn] [ERROR] COMPILATION ERROR :
> >       [mvn] [INFO] ------------------------------
> -------------------------------
> >
> > [...truncated 696 lines...]
> > BUILD FAILED
> > /usr/home/jenkins/jenkins-slave/workspace/Lucene-Solr-Maven-trunk/build.xml:542:
> The following error occurred while executing this line:
> > /usr/home/jenkins/jenkins-slave/workspace/Lucene-Solr-Maven-trunk/build.xml:204:
> The following error occurred while executing this line:
> > : Java returned: 1
> >
> > Total time: 20 minutes 1 second
> > Build step 'Invoke Ant' marked build as failure
> > Email was triggered for: Failure
> > Sending email for trigger: Failure
> >
> >
> >
> > ---------------------------------------------------------------------
> > To unsubscribe, e-mail: dev-unsubscribe@lucene.apache.org
> > For additional commands, e-mail: dev-help@lucene.apache.org
>
>
> ---------------------------------------------------------------------
> To unsubscribe, e-mail: dev-unsubscribe@lucene.apache.org
> For additional commands, e-mail: dev-help@lucene.apache.org
>
>

Re: [JENKINS-MAVEN] Lucene-Solr-Maven-trunk #1319: POMs out of sync

Posted by Steve Rowe <sa...@gmail.com>.
Maven doesn’t use the .ivy caches.

I’m looking into the problem, and I’ve traced it to something to do with moving example/ivy.xml to server/ivy.xml - these are used to build the dependencies sections in the Maven POMs.

Steve

> On Jan 13, 2015, at 12:41 PM, Mark Miller <ma...@gmail.com> wrote:
> 
> I don't currently have the ability to log into these 3 jenkins machines. Can someone that does please nuke the .ivy caches? See SOLR-4839.
> 
> On Mon Jan 12 2015 at 1:44:18 PM Apache Jenkins Server <je...@builds.apache.org> wrote:
> Build: https://builds.apache.org/job/Lucene-Solr-Maven-trunk/1319/
> 
> No tests ran.
> 
> Build Log:
> [...truncated 39089 lines...]
>       [mvn] [INFO] -------------------------------------------------------------
>       [mvn] [INFO] -------------------------------------------------------------
>       [mvn] [ERROR] COMPILATION ERROR :
>       [mvn] [INFO] -------------------------------------------------------------
> 
> [...truncated 696 lines...]
> BUILD FAILED
> /usr/home/jenkins/jenkins-slave/workspace/Lucene-Solr-Maven-trunk/build.xml:542: The following error occurred while executing this line:
> /usr/home/jenkins/jenkins-slave/workspace/Lucene-Solr-Maven-trunk/build.xml:204: The following error occurred while executing this line:
> : Java returned: 1
> 
> Total time: 20 minutes 1 second
> Build step 'Invoke Ant' marked build as failure
> Email was triggered for: Failure
> Sending email for trigger: Failure
> 
> 
> 
> ---------------------------------------------------------------------
> To unsubscribe, e-mail: dev-unsubscribe@lucene.apache.org
> For additional commands, e-mail: dev-help@lucene.apache.org


---------------------------------------------------------------------
To unsubscribe, e-mail: dev-unsubscribe@lucene.apache.org
For additional commands, e-mail: dev-help@lucene.apache.org


Re: [JENKINS-MAVEN] Lucene-Solr-Maven-trunk #1319: POMs out of sync

Posted by Mark Miller <ma...@gmail.com>.
I don't currently have the ability to log into these 3 jenkins machines.
Can someone that does please nuke the .ivy caches? See SOLR-4839.

On Mon Jan 12 2015 at 1:44:18 PM Apache Jenkins Server <
jenkins@builds.apache.org> wrote:

> Build: https://builds.apache.org/job/Lucene-Solr-Maven-trunk/1319/
>
> No tests ran.
>
> Build Log:
> [...truncated 39089 lines...]
>       [mvn] [INFO] ------------------------------
> -------------------------------
>       [mvn] [INFO] ------------------------------
> -------------------------------
>       [mvn] [ERROR] COMPILATION ERROR :
>       [mvn] [INFO] ------------------------------
> -------------------------------
>
> [...truncated 696 lines...]
> BUILD FAILED
> /usr/home/jenkins/jenkins-slave/workspace/Lucene-Solr-Maven-trunk/build.xml:542:
> The following error occurred while executing this line:
> /usr/home/jenkins/jenkins-slave/workspace/Lucene-Solr-Maven-trunk/build.xml:204:
> The following error occurred while executing this line:
> : Java returned: 1
>
> Total time: 20 minutes 1 second
> Build step 'Invoke Ant' marked build as failure
> Email was triggered for: Failure
> Sending email for trigger: Failure
>
>
>
> ---------------------------------------------------------------------
> To unsubscribe, e-mail: dev-unsubscribe@lucene.apache.org
> For additional commands, e-mail: dev-help@lucene.apache.org

Re: [JENKINS-MAVEN] Lucene-Solr-Maven-trunk #1319: POMs out of sync

Posted by Chris Hostetter <ho...@fucit.org>.

the maven build has had failed comilation on trunk since Jan-8 due to the
"Filter" class not being found when compiling JettySolrRunner...

      [mvn] /usr/home/jenkins/jenkins-slave/workspace/Lucene-Solr-Maven-trunk/solr/core/src/java/org/apache/solr/client$
      [mvn]   class file for javax.servlet.Servlet not found
      [mvn] /usr/home/jenkins/jenkins-slave/workspace/Lucene-Solr-Maven-trunk/solr/core/src/java/org/apache/solr/client$
      [mvn]   symbol:   class Filter
      [mvn]   location: class org.apache.solr.client.solrj.embedded.JettySolrRunner

Since there is no similar compilation failure with ant, this smells like a
maven dependency problem.


first maven build with these broken compilation was #1315 @ r1650301 ...
 
https://builds.apache.org/job/Lucene-Solr-Maven-trunk/1315/

Previous (successful) maven build was #1314  @ r1650132

Commits in between...

    LUCENE-6165: Change merging APIs from LeafReader to CodecReader (detail/ViewSVN)
    SOLR-4839: fix licensing metadata. PLEASE RUN PRECOMMIT BEFORE COMMITTING. (detail/ViewSVN)
    SOLR-6787 more logging (detail/ViewSVN)
    SOLR-6787 commit right away instead of waiting (detail/ViewSVN)
    SOLR-6925: Back out changes having to do with SOLR-5287 (editing configs from admin UI) (detail/ViewSVN)
    SOLR-4839: Remove dependency to jetty.orbit (detail/ViewSVN)
 

...perhaps the reason jetty.orbit was included before was to satisfy the 
javax.servlet.Filter import? ... why isn't the Servlet dependency handling 
that?



On Mon, 12 Jan 2015, Apache Jenkins Server wrote:

: Date: Mon, 12 Jan 2015 18:44:02 +0000 (UTC)
: From: Apache Jenkins Server <je...@builds.apache.org>
: Reply-To: dev@lucene.apache.org
: To: dev@lucene.apache.org
: Subject: [JENKINS-MAVEN] Lucene-Solr-Maven-trunk #1319: POMs out of sync
: 
: Build: https://builds.apache.org/job/Lucene-Solr-Maven-trunk/1319/
: 
: No tests ran.
: 
: Build Log:
: [...truncated 39089 lines...]
:       [mvn] [INFO] -------------------------------------------------------------
:       [mvn] [INFO] -------------------------------------------------------------
:       [mvn] [ERROR] COMPILATION ERROR : 
:       [mvn] [INFO] -------------------------------------------------------------
: 
: [...truncated 696 lines...]
: BUILD FAILED
: /usr/home/jenkins/jenkins-slave/workspace/Lucene-Solr-Maven-trunk/build.xml:542: The following error occurred while executing this line:
: /usr/home/jenkins/jenkins-slave/workspace/Lucene-Solr-Maven-trunk/build.xml:204: The following error occurred while executing this line:
: : Java returned: 1
: 
: Total time: 20 minutes 1 second
: Build step 'Invoke Ant' marked build as failure
: Email was triggered for: Failure
: Sending email for trigger: Failure
: 
: 
: 

-Hoss
http://www.lucidworks.com/

---------------------------------------------------------------------
To unsubscribe, e-mail: dev-unsubscribe@lucene.apache.org
For additional commands, e-mail: dev-help@lucene.apache.org


[JENKINS-MAVEN] Lucene-Solr-Maven-trunk #1319: POMs out of sync

Posted by Apache Jenkins Server <je...@builds.apache.org>.
Build: https://builds.apache.org/job/Lucene-Solr-Maven-trunk/1319/

No tests ran.

Build Log:
[...truncated 39089 lines...]
      [mvn] [INFO] -------------------------------------------------------------
      [mvn] [INFO] -------------------------------------------------------------
      [mvn] [ERROR] COMPILATION ERROR : 
      [mvn] [INFO] -------------------------------------------------------------

[...truncated 696 lines...]
BUILD FAILED
/usr/home/jenkins/jenkins-slave/workspace/Lucene-Solr-Maven-trunk/build.xml:542: The following error occurred while executing this line:
/usr/home/jenkins/jenkins-slave/workspace/Lucene-Solr-Maven-trunk/build.xml:204: The following error occurred while executing this line:
: Java returned: 1

Total time: 20 minutes 1 second
Build step 'Invoke Ant' marked build as failure
Email was triggered for: Failure
Sending email for trigger: Failure



[JENKINS-MAVEN] Lucene-Solr-Maven-trunk #1318: POMs out of sync

Posted by Apache Jenkins Server <je...@builds.apache.org>.
Build: https://builds.apache.org/job/Lucene-Solr-Maven-trunk/1318/

No tests ran.

Build Log:
[...truncated 39082 lines...]
      [mvn] [INFO] -------------------------------------------------------------
      [mvn] [INFO] -------------------------------------------------------------
      [mvn] [ERROR] COMPILATION ERROR : 
      [mvn] [INFO] -------------------------------------------------------------

[...truncated 696 lines...]
BUILD FAILED
/usr/home/jenkins/jenkins-slave/workspace/Lucene-Solr-Maven-trunk/build.xml:542: The following error occurred while executing this line:
/usr/home/jenkins/jenkins-slave/workspace/Lucene-Solr-Maven-trunk/build.xml:204: The following error occurred while executing this line:
: Java returned: 1

Total time: 20 minutes 15 seconds
Build step 'Invoke Ant' marked build as failure
Email was triggered for: Failure
Sending email for trigger: Failure



[JENKINS-MAVEN] Lucene-Solr-Maven-trunk #1317: POMs out of sync

Posted by Apache Jenkins Server <je...@builds.apache.org>.
Build: https://builds.apache.org/job/Lucene-Solr-Maven-trunk/1317/

No tests ran.

Build Log:
[...truncated 39245 lines...]
      [mvn] [INFO] -------------------------------------------------------------
      [mvn] [INFO] -------------------------------------------------------------
      [mvn] [ERROR] COMPILATION ERROR : 
      [mvn] [INFO] -------------------------------------------------------------

[...truncated 696 lines...]
BUILD FAILED
/usr/home/jenkins/jenkins-slave/workspace/Lucene-Solr-Maven-trunk/build.xml:542: The following error occurred while executing this line:
/usr/home/jenkins/jenkins-slave/workspace/Lucene-Solr-Maven-trunk/build.xml:204: The following error occurred while executing this line:
: Java returned: 1

Total time: 23 minutes 17 seconds
Build step 'Invoke Ant' marked build as failure
Email was triggered for: Failure
Sending email for trigger: Failure



Re: [JENKINS-MAVEN] Lucene-Solr-Maven-trunk #1316: POMs out of sync

Posted by Mark Miller <ma...@gmail.com>.
Hopefully this is now fixed and we won't have to manually clean anything
up. You can find background on the Jetty 9 update JIRA issue.

- Mark

On Fri Jan 09 2015 at 11:57:24 AM Apache Jenkins Server <
jenkins@builds.apache.org> wrote:

> Build: https://builds.apache.org/job/Lucene-Solr-Maven-trunk/1316/
>
> No tests ran.
>
> Build Log:
> [...truncated 39090 lines...]
>       [mvn] [INFO] ------------------------------
> -------------------------------
>       [mvn] [INFO] ------------------------------
> -------------------------------
>       [mvn] [ERROR] COMPILATION ERROR :
>       [mvn] [INFO] ------------------------------
> -------------------------------
>
> [...truncated 696 lines...]
> BUILD FAILED
> /usr/home/jenkins/jenkins-slave/workspace/Lucene-Solr-Maven-trunk/build.xml:542:
> The following error occurred while executing this line:
> /usr/home/jenkins/jenkins-slave/workspace/Lucene-Solr-Maven-trunk/build.xml:204:
> The following error occurred while executing this line:
> : Java returned: 1
>
> Total time: 20 minutes 28 seconds
> Build step 'Invoke Ant' marked build as failure
> Email was triggered for: Failure
> Sending email for trigger: Failure
>
>
>
> ---------------------------------------------------------------------
> To unsubscribe, e-mail: dev-unsubscribe@lucene.apache.org
> For additional commands, e-mail: dev-help@lucene.apache.org