You are viewing a plain text version of this content. The canonical link for it is here.
Posted to builds@beam.apache.org by Apache Jenkins Server <je...@builds.apache.org> on 2023/05/29 22:45:58 UTC

Build failed in Jenkins: beam_PostCommit_Go #11347

See <https://ci-beam.apache.org/job/beam_PostCommit_Go/11347/display/redirect>

Changes:


------------------------------------------
[...truncated 1.09 MB...]
      capabilities: "beam:coder:row:v1"
      capabilities: "beam:coder:nullable:v1"
      capabilities: "beam:coder:timer:v1"
      dependencies: <
        type_urn: "beam:artifact:type:url:v1"
        type_payload: "\nngs://temp-storage-for-end-to-end-tests/staging-validatesrunner-test/test12019/go-13-1685396213391241265/worker\022@941cb9fa8cf79159b6be632ff77730a4f30b67abb74702e7d5a988c6aafd9a50"
        role_urn: "beam:artifact:role:go_worker_binary:v1"
      >
    >
  >
>
root_transform_ids: "e1"
root_transform_ids: "e2"
root_transform_ids: "e3"
root_transform_ids: "e4"
root_transform_ids: "e5"
root_transform_ids: "e6"
root_transform_ids: "e7"
root_transform_ids: "s1"
2023/05/29 21:36:56 Staged model pipeline: gs://temp-storage-for-end-to-end-tests/staging-validatesrunner-test/test12019/go-13-1685396213391241265/model
2023/05/29 21:36:56 {
  "environment": {
    "debugOptions": {},
    "experiments": [
      "beam_fn_api",
      "use_runner_v2",
      "use_unified_worker",
      "use_portable_job_submission"
    ],
    "sdkPipelineOptions": {
      "display_data": [
        {
          "key": "name",
          "namespace": "options",
          "type": "STRING",
          "value": "go-testemitpardoaftergbk-267"
        },
        {
          "key": "experiments",
          "namespace": "options",
          "type": "STRING",
          "value": "beam_fn_api,use_runner_v2,use_unified_worker,use_portable_job_submission"
        },
        {
          "key": "project",
          "namespace": "options",
          "type": "STRING",
          "value": "apache-beam-testing"
        },
        {
          "key": "region",
          "namespace": "options",
          "type": "STRING",
          "value": "us-central1"
        },
        {
          "key": "container_images",
          "namespace": "options",
          "type": "STRING",
          "value": "us.gcr.io/apache-beam-testing/jenkins/beam_go_sdk:20230529-203456"
        },
        {
          "key": "temp_location",
          "namespace": "options",
          "type": "STRING",
          "value": "gs://temp-storage-for-end-to-end-tests/temp-validatesrunner-test/test12019"
        },
        {
          "key": "test.v",
          "namespace": "go_options",
          "type": "STRING",
          "value": "true"
        },
        {
          "key": "hooks",
          "namespace": "go_options",
          "type": "STRING",
          "value": "{\"default_remote_logging\":null}"
        },
        {
          "key": "hookOrder",
          "namespace": "go_options",
          "type": "STRING",
          "value": "[\"default_remote_logging\"]"
        },
        {
          "key": "temp_location",
          "namespace": "go_options",
          "type": "STRING",
          "value": "gs://temp-storage-for-end-to-end-tests/temp-validatesrunner-test/test12019"
        },
        {
          "key": "test.paniconexit0",
          "namespace": "go_options",
          "type": "STRING",
          "value": "true"
        },
        {
          "key": "test.timeout",
          "namespace": "go_options",
          "type": "STRING",
          "value": "3h0m0s"
        }
      ],
      "options": {
        "experiments": [
          "beam_fn_api",
          "use_runner_v2",
          "use_unified_worker",
          "use_portable_job_submission"
        ],
        "pipelineUrl": "gs://temp-storage-for-end-to-end-tests/staging-validatesrunner-test/test12019/go-13-1685396213391241265/model",
        "region": "us-central1",
        "tempLocation": "gs://temp-storage-for-end-to-end-tests/temp-validatesrunner-test/test12019"
      },
      "beam:option:go_options:v1": {
        "options": {
          "hookOrder": "[\"default_remote_logging\"]",
          "hooks": "{\"default_remote_logging\":null}",
          "temp_location": "gs://temp-storage-for-end-to-end-tests/temp-validatesrunner-test/test12019",
          "test.paniconexit0": "true",
          "test.timeout": "3h0m0s",
          "test.v": "true"
        }
      }
    },
    "tempStoragePrefix": "gs://temp-storage-for-end-to-end-tests/temp-validatesrunner-test/test12019",
    "userAgent": {
      "name": "Apache Beam SDK for Go",
      "version": "2.49.0.dev"
    },
    "version": {
      "job_type": "FNAPI_BATCH",
      "major": "6"
    },
    "workerPools": [
      {
        "autoscalingSettings": {},
        "ipConfiguration": "WORKER_IP_UNSPECIFIED",
        "kind": "harness",
        "numWorkers": 1,
        "packages": [
          {
            "location": "gs://temp-storage-for-end-to-end-tests/staging-validatesrunner-test/test12019/go-13-1685396213391241265/worker",
            "name": "worker"
          }
        ],
        "sdkHarnessContainerImages": [
          {
            "capabilities": [
              "beam:protocol:progress_reporting:v1",
              "beam:protocol:multi_core_bundle_processing:v1",
              "beam:transform:sdf_truncate_sized_restrictions:v1",
              "beam:protocol:worker_status:v1",
              "beam:protocol:monitoring_info_short_ids:v1",
              "beam:version:sdk_base:go:apache/beam_go_sdk:2.49.0.dev",
              "beam:coder:bytes:v1",
              "beam:coder:bool:v1",
              "beam:coder:varint:v1",
              "beam:coder:double:v1",
              "beam:coder:string_utf8:v1",
              "beam:coder:length_prefix:v1",
              "beam:coder:kv:v1",
              "beam:coder:iterable:v1",
              "beam:coder:state_backed_iterable:v1",
              "beam:coder:windowed_value:v1",
              "beam:coder:global_window:v1",
              "beam:coder:interval_window:v1",
              "beam:coder:row:v1",
              "beam:coder:nullable:v1",
              "beam:coder:timer:v1"
            ],
            "containerImage": "us.gcr.io/apache-beam-testing/jenkins/beam_go_sdk:20230529-203456",
            "environmentId": "go"
          }
        ],
        "workerHarnessContainerImage": "us.gcr.io/apache-beam-testing/jenkins/beam_go_sdk:20230529-203456"
      }
    ]
  },
  "name": "go-testemitpardoaftergbk-267",
  "projectId": "apache-beam-testing",
  "type": "JOB_TYPE_BATCH"
}
2023/05/29 21:36:56 Submitted job: 2023-05-29_14_36_56-11988011054737769267
2023/05/29 21:36:56 Console: https://console.cloud.google.com/dataflow/jobs/us-central1/2023-05-29_14_36_56-11988011054737769267?project=apache-beam-testing
2023/05/29 21:36:56 Logs: https://console.cloud.google.com/logs/viewer?project=apache-beam-testing&resource=dataflow_step%2Fjob_id%2F2023-05-29_14_36_56-11988011054737769267
2023/05/29 21:36:56 Job state: JOB_STATE_PENDING ...
2023/05/29 21:37:26 Job still running ...
2023/05/29 21:37:56 Job still running ...
2023/05/29 21:38:26 Job still running ...
2023/05/29 21:38:56 Job still running ...
2023/05/29 21:39:26 Job still running ...
2023/05/29 21:39:56 Job still running ...
2023/05/29 21:40:26 Job still running ...
2023/05/29 21:40:56 Job still running ...
2023/05/29 21:41:26 Job 2023-05-29_14_36_56-11988011054737769267 succeeded!
--- PASS: TestEmitParDoAfterGBK (273.54s)
FAIL
FAIL	github.com/apache/beam/sdks/v2/go/test/regression	3390.514s
FAIL
$ TEST_EXIT_CODE=0
$ cd ../..
$ docker rmi us.gcr.io/apache-beam-testing/jenkins/beam_go_sdk:20230529-203456
Untagged: us.gcr.io/apache-beam-testing/jenkins/beam_go_sdk:20230529-203456
Untagged: us.gcr.io/apache-beam-testing/jenkins/beam_go_sdk@sha256:bec55651497d39cae3a4fbaadf6392309a05f5a38c34356416672a874c1ceb7e
Deleted: sha256:d5dff6428379f3019aeb4cab212df58d91ba596dfb49bfdc774eef10afd4b78a
$ gcloud --quiet container images delete us.gcr.io/apache-beam-testing/jenkins/beam_go_sdk:20230529-203456
WARNING: Successfully resolved tag to sha256, but it is recommended to use sha256 directly.
Digests:
- us.gcr.io/apache-beam-testing/jenkins/beam_go_sdk@sha256:bec55651497d39cae3a4fbaadf6392309a05f5a38c34356416672a874c1ceb7e
  Associated tags:
 - 20230529-203456
Tags:
- us.gcr.io/apache-beam-testing/jenkins/beam_go_sdk:20230529-203456
Deleted [us.gcr.io/apache-beam-testing/jenkins/beam_go_sdk:20230529-203456].
Deleted [us.gcr.io/apache-beam-testing/jenkins/beam_go_sdk@sha256:bec55651497d39cae3a4fbaadf6392309a05f5a38c34356416672a874c1ceb7e].
$ rm -rf /tmp/tmp.GIc9myV8Er
$ exit 1
$ exit 1

> Task :goIntegrationTests FAILED

FAILURE: Build failed with an exception.

* What went wrong:
Execution failed for task ':goIntegrationTests'.
> Process 'command 'sh'' finished with non-zero exit value 1

* Try:
> Run with --stacktrace option to get the stack trace.
> Run with --info or --debug option to get more log output.

* Get more help at https://help.gradle.org

Deprecated Gradle features were used in this build, making it incompatible with Gradle 8.0.

You can use '--warning-mode all' to show the individual deprecation warnings and determine if they come from your own scripts or plugins.

See https://docs.gradle.org/7.5.1/userguide/command_line_interface.html#sec:command_line_warnings

BUILD FAILED in 2h 11m 29s
91 actionable tasks: 55 executed, 34 from cache, 2 up-to-date

Publishing build scan...
https://ge.apache.org/s/3tfb7ilzwrcfu

Build step 'Invoke Gradle script' changed build result to FAILURE
Build step 'Invoke Gradle script' marked build as failure

---------------------------------------------------------------------
To unsubscribe, e-mail: builds-unsubscribe@beam.apache.org
For additional commands, e-mail: builds-help@beam.apache.org


Jenkins build is back to normal : beam_PostCommit_Go #11348

Posted by Apache Jenkins Server <je...@builds.apache.org>.
See <https://ci-beam.apache.org/job/beam_PostCommit_Go/11348/display/redirect>


---------------------------------------------------------------------
To unsubscribe, e-mail: builds-unsubscribe@beam.apache.org
For additional commands, e-mail: builds-help@beam.apache.org