You are viewing a plain text version of this content. The canonical link for it is here.
Posted to dev@zookeeper.apache.org by Apache Jenkins Server <je...@builds.apache.org> on 2014/03/02 22:11:37 UTC

Failed: ZOOKEEPER-1888 PreCommit Build #1940

Jira: https://issues.apache.org/jira/browse/ZOOKEEPER-1888
Build: https://builds.apache.org/job/PreCommit-ZOOKEEPER-Build/1940/

###################################################################################
########################## LAST 60 LINES OF THE CONSOLE ###########################
[...truncated 73 lines...]
     [exec] (Stripping trailing CRs from patch.)
     [exec] patching file bin/zkEnv.cmd
     [exec] Hunk #1 FAILED at 32.
     [exec] 1 out of 1 hunk FAILED -- saving rejects to file bin/zkEnv.cmd.rej
     [exec] (Stripping trailing CRs from patch.)
     [exec] patching file bin/zkServer.cmd
     [exec] Hunk #1 FAILED at 19.
     [exec] 1 out of 1 hunk FAILED -- saving rejects to file bin/zkServer.cmd.rej
     [exec] PATCH APPLICATION FAILED
     [exec] 
     [exec] 
     [exec] 
     [exec] 
     [exec] -1 overall.  Here are the results of testing the latest attachment 
     [exec]   http://issues.apache.org/jira/secure/attachment/12632076/ZOOKEEPER-1888.2.patch
     [exec]   against trunk revision 1569590.
     [exec] 
     [exec]     +1 @author.  The patch does not contain any @author tags.
     [exec] 
     [exec]     -1 tests included.  The patch doesn't appear to include any new or modified tests.
     [exec]                         Please justify why no new tests are needed for this patch.
     [exec]                         Also please list what manual steps were performed to verify this patch.
     [exec] 
     [exec]     -1 patch.  The patch command could not apply the patch.
     [exec] 
     [exec] Console output: https://builds.apache.org/job/PreCommit-ZOOKEEPER-Build/1940//console
     [exec] 
     [exec] This message is automatically generated.
     [exec] 
     [exec] 
     [exec] ======================================================================
     [exec] ======================================================================
     [exec]     Adding comment to Jira.
     [exec] ======================================================================
     [exec] ======================================================================
     [exec] 
     [exec] 
     [exec] Comment added.
     [exec] d3e57297d5c4d5e48aab9b2b281e33510970e1b5 logged out
     [exec] 
     [exec] 
     [exec] ======================================================================
     [exec] ======================================================================
     [exec]     Finished build.
     [exec] ======================================================================
     [exec] ======================================================================
     [exec] 
     [exec] 

BUILD FAILED
/home/jenkins/jenkins-slave/workspace/PreCommit-ZOOKEEPER-Build/trunk/build.xml:1674: exec returned: 1

Total time: 43 seconds
Build step 'Execute shell' marked build as failure
Archiving artifacts
Recording test results
Description set: ZOOKEEPER-1888
Email was triggered for: Failure
Sending email for trigger: Failure



###################################################################################
############################## FAILED TESTS (if any) ##############################
No tests ran.

Success: ZOOKEEPER-1810 PreCommit Build #1941

Posted by Apache Jenkins Server <je...@builds.apache.org>.
Jira: https://issues.apache.org/jira/browse/ZOOKEEPER-1810
Build: https://builds.apache.org/job/PreCommit-ZOOKEEPER-Build/1941/

###################################################################################
########################## LAST 60 LINES OF THE CONSOLE ###########################
[...truncated 294702 lines...]
     [exec] BUILD SUCCESSFUL
     [exec] Total time: 0 seconds
     [exec] 
     [exec] 
     [exec] 
     [exec] 
     [exec] +1 overall.  Here are the results of testing the latest attachment 
     [exec]   http://issues.apache.org/jira/secure/attachment/12632841/ZOOKEEPER-1810.patch
     [exec]   against trunk revision 1569590.
     [exec] 
     [exec]     +1 @author.  The patch does not contain any @author tags.
     [exec] 
     [exec]     +1 tests included.  The patch appears to include 24 new or modified tests.
     [exec] 
     [exec]     +1 javadoc.  The javadoc tool did not generate any warning messages.
     [exec] 
     [exec]     +1 javac.  The applied patch does not increase the total number of javac compiler warnings.
     [exec] 
     [exec]     +1 findbugs.  The patch does not introduce any new Findbugs (version 1.3.9) warnings.
     [exec] 
     [exec]     +1 release audit.  The applied patch does not increase the total number of release audit warnings.
     [exec] 
     [exec]     +1 core tests.  The patch passed core unit tests.
     [exec] 
     [exec]     +1 contrib tests.  The patch passed contrib unit tests.
     [exec] 
     [exec] Test results: https://builds.apache.org/job/PreCommit-ZOOKEEPER-Build/1941//testReport/
     [exec] Findbugs warnings: https://builds.apache.org/job/PreCommit-ZOOKEEPER-Build/1941//artifact/trunk/build/test/findbugs/newPatchFindbugsWarnings.html
     [exec] Console output: https://builds.apache.org/job/PreCommit-ZOOKEEPER-Build/1941//console
     [exec] 
     [exec] This message is automatically generated.
     [exec] 
     [exec] 
     [exec] ======================================================================
     [exec] ======================================================================
     [exec]     Adding comment to Jira.
     [exec] ======================================================================
     [exec] ======================================================================
     [exec] 
     [exec] 
     [exec] Comment added.
     [exec] f078d9fc4da296de50e29d66bdcc1dad32f14864 logged out
     [exec] 
     [exec] 
     [exec] ======================================================================
     [exec] ======================================================================
     [exec]     Finished build.
     [exec] ======================================================================
     [exec] ======================================================================
     [exec] 
     [exec] 

BUILD SUCCESSFUL
Total time: 36 minutes 1 second
Archiving artifacts
Recording test results
Description set: ZOOKEEPER-1810
Email was triggered for: Success
Sending email for trigger: Success



###################################################################################
############################## FAILED TESTS (if any) ##############################
All tests passed