You are viewing a plain text version of this content. The canonical link for it is here.
Posted to dev@pulsar.apache.org by Apache Jenkins Server <je...@builds.apache.org> on 2020/06/02 12:53:30 UTC
Build failed in Jenkins: pulsar_release_nightly_snapshot #832
See <https://builds.apache.org/job/pulsar_release_nightly_snapshot/832/display/redirect?page=changes>
Changes:
[github] MockZooKeeper#failNow is unreliable (#7109)
[github] Change the default value of maxLookupRedirects of Java client (#7126)
[github] MockZooKeeper shouldn't 'execute' while holding lock (#7130)
[github] Allow to grant permissions when the authorization is disabled (#7074)
[github] [PIP-39] Introduce system topic and topic policies service (#4955)
[github] [PIP-54] Support acknowledgment at batch index level (#6052)
[github] Allow to delete topics that are failing to recover (#7131)
[github] [pulsar-broker] Extend REST API for resource quotas with swagger
[github] Add a new api to get information about config definition of builtin
[github] Update the function CLI description (#6980)
[github] Fix NPE on opening non-durable cursors on an empty managed ledger
[github] Introduce precise topic publish rate limiting (#7078)
[github] PIP 37: [pulsar-client] support large message size (#4400)
[github] fix NullPointerException with SubscriptionMode.NonDurable (#7118)
[github] Fix typos and remove unused import (#7129)
[github] Correct tokenSecretKey base64 inline description. (#6959)
------------------------------------------
[...truncated 983.75 KB...]
[JENKINS] Archiving disabled
[JENKINS] Archiving disabled
[JENKINS] Archiving disabled
[JENKINS] Archiving disabled
[JENKINS] Archiving disabled
[JENKINS] Archiving disabled
[JENKINS] Archiving disabled
[JENKINS] Archiving disabled
[JENKINS] Archiving disabled
[JENKINS] Archiving disabled
[JENKINS] Archiving disabled
[JENKINS] Archiving disabled
[JENKINS] Archiving disabled
[JENKINS] Archiving disabled
[JENKINS] Archiving disabled
[JENKINS] Archiving disabled
[JENKINS] Archiving disabled
[JENKINS] Archiving disabled
[JENKINS] Archiving disabled
[JENKINS] Archiving disabled
[JENKINS] Archiving disabled
[JENKINS] Archiving disabled
[JENKINS] Archiving disabled
[JENKINS] Archiving disabled
[JENKINS] Archiving disabled
[JENKINS] Archiving disabled
[JENKINS] Archiving disabled
[JENKINS] Archiving disabled
[JENKINS] Archiving disabled
[JENKINS] Archiving disabled
[JENKINS] Archiving disabled
[JENKINS] Archiving disabled
[JENKINS] Archiving disabled
[JENKINS] Archiving disabled
[JENKINS] Archiving disabled
[JENKINS] Archiving disabled
[JENKINS] Archiving disabled
[JENKINS] Archiving disabled
[JENKINS] Archiving disabled
[JENKINS] Archiving disabled
[JENKINS] Archiving disabled
[JENKINS] Archiving disabled
[JENKINS] Archiving disabled
[JENKINS] Archiving disabled
[JENKINS] Archiving disabled
[JENKINS] Archiving disabled
[JENKINS] Archiving disabled
[JENKINS] Archiving disabled
[JENKINS] Archiving disabled
[JENKINS] Archiving disabled
[JENKINS] Archiving disabled
[JENKINS] Archiving disabled
[JENKINS] Archiving disabled
[JENKINS] Archiving disabled
[JENKINS] Archiving disabled
[JENKINS] Archiving disabled
[JENKINS] Archiving disabled
[JENKINS] Archiving disabled
[JENKINS] Archiving disabled
[JENKINS] Archiving disabled
[JENKINS] Archiving disabled
[JENKINS] Archiving disabled
[JENKINS] Archiving disabled
[JENKINS] Archiving disabled
[JENKINS] Archiving disabled
[JENKINS] Archiving disabled
[JENKINS] Archiving disabled
[JENKINS] Archiving disabled
[JENKINS] Archiving disabled
[JENKINS] Archiving disabled
[JENKINS] Archiving disabled
[JENKINS] Archiving disabled
[JENKINS] Archiving disabled
[JENKINS] Archiving disabled
[JENKINS] Archiving disabled
[JENKINS] Archiving disabled
[JENKINS] Archiving disabled
[JENKINS] Archiving disabled
[JENKINS] Archiving disabled
[JENKINS] Archiving disabled
[JENKINS] Archiving disabled
[JENKINS] Archiving disabled
[JENKINS] Archiving disabled
2020-06-02T12:50:40.299 [INFO] ------------------------------------------------------------------------
2020-06-02T12:50:40.299 [INFO] Reactor Summary:
2020-06-02T12:50:40.299 [INFO]
2020-06-02T12:50:40.300 [INFO] Pulsar Build Tools ................................. SUCCESS [ 11.883 s]
2020-06-02T12:50:40.300 [INFO] Pulsar 2.6.0-SNAPSHOT .............................. SUCCESS [ 6.873 s]
2020-06-02T12:50:40.300 [INFO] Pulsar Test Mocks .................................. SUCCESS [ 9.552 s]
2020-06-02T12:50:40.300 [INFO] Pulsar Transaction :: Parent ....................... SUCCESS [ 1.265 s]
2020-06-02T12:50:40.300 [INFO] Pulsar Transaction :: Common ....................... SUCCESS [ 5.238 s]
2020-06-02T12:50:40.300 [INFO] Pulsar Client :: API ............................... SUCCESS [ 5.432 s]
2020-06-02T12:50:40.300 [INFO] Pulsar Common ...................................... SUCCESS [ 24.541 s]
2020-06-02T12:50:40.301 [INFO] Pulsar Metadata .................................... SUCCESS [ 5.993 s]
2020-06-02T12:50:40.301 [INFO] Managed Ledger ..................................... SUCCESS [ 19.112 s]
2020-06-02T12:50:40.301 [INFO] Apache Pulsar :: Tiered Storage :: Parent .......... SUCCESS [ 1.259 s]
2020-06-02T12:50:40.301 [INFO] Apache Pulsar :: Tiered Storage :: JCloud .......... SUCCESS [ 13.394 s]
2020-06-02T12:50:40.301 [INFO] Apache Pulsar :: Tiered Storage :: File System ..... SUCCESS [ 20.750 s]
2020-06-02T12:50:40.301 [INFO] Pulsar ZooKeeper Utils ............................. SUCCESS [ 17.629 s]
2020-06-02T12:50:40.301 [INFO] pulsar-broker-common ............................... SUCCESS [ 9.234 s]
2020-06-02T12:50:40.301 [INFO] Apache Pulsar :: Bouncy Castle :: Parent ........... SUCCESS [ 1.408 s]
2020-06-02T12:50:40.301 [INFO] Apache Pulsar :: Bouncy Castle :: BC ............... SUCCESS [ 5.961 s]
2020-06-02T12:50:40.301 [INFO] Apache Pulsar :: Bouncy Castle :: BC Shaded ........ SUCCESS [ 6.315 s]
2020-06-02T12:50:40.301 [INFO] pulsar-client-messagecrypto-bc ..................... SUCCESS [ 4.392 s]
2020-06-02T12:50:40.301 [INFO] Pulsar Functions :: Parent ......................... SUCCESS [ 1.274 s]
2020-06-02T12:50:40.301 [INFO] Pulsar Functions :: Proto .......................... SUCCESS [ 10.357 s]
2020-06-02T12:50:40.302 [INFO] Pulsar Client Java ................................. SUCCESS [ 17.839 s]
2020-06-02T12:50:40.302 [INFO] Pulsar Discovery Service WAR ....................... SUCCESS [ 10.321 s]
2020-06-02T12:50:40.302 [INFO] Pulsar WebSocket ................................... SUCCESS [ 9.266 s]
2020-06-02T12:50:40.302 [INFO] Pulsar Client Admin Original ....................... SUCCESS [ 8.233 s]
2020-06-02T12:50:40.302 [INFO] Pulsar Functions :: API ............................ SUCCESS [ 5.300 s]
2020-06-02T12:50:40.302 [INFO] Pulsar IO :: Parent ................................ SUCCESS [ 1.244 s]
2020-06-02T12:50:40.302 [INFO] Pulsar IO :: IO .................................... SUCCESS [ 4.871 s]
2020-06-02T12:50:40.302 [INFO] Pulsar Functions :: Utils .......................... SUCCESS [ 7.673 s]
2020-06-02T12:50:40.302 [INFO] Pulsar Functions :: Secrets ........................ SUCCESS [ 6.953 s]
2020-06-02T12:50:40.302 [INFO] Pulsar Functions :: Instance ....................... SUCCESS [ 13.118 s]
2020-06-02T12:50:40.302 [INFO] Pulsar Functions :: Runtime ........................ SUCCESS [ 11.370 s]
2020-06-02T12:50:40.302 [INFO] Pulsar IO :: Cassandra ............................. SUCCESS [ 5.926 s]
2020-06-02T12:50:40.302 [INFO] Pulsar IO :: IO Common ............................. SUCCESS [ 5.927 s]
2020-06-02T12:50:40.303 [INFO] Pulsar IO :: Twitter ............................... SUCCESS [ 8.818 s]
2020-06-02T12:50:40.303 [INFO] Pulsar Functions :: Worker ......................... SUCCESS [ 21.873 s]
2020-06-02T12:50:40.303 [INFO] Pulsar Functions :: Local Runner original .......... SUCCESS [ 7.901 s]
2020-06-02T12:50:40.303 [INFO] Pulsar Functions :: API Examples ................... SUCCESS [ 4.652 s]
2020-06-02T12:50:40.303 [INFO] Pulsar IO :: Data Generator ........................ SUCCESS [ 6.863 s]
2020-06-02T12:50:40.303 [INFO] Pulsar Transaction :: Coordinator .................. SUCCESS [ 6.676 s]
2020-06-02T12:50:40.303 [INFO] Pulsar Broker ...................................... FAILURE [ 59.593 s]
2020-06-02T12:50:40.303 [INFO] Pulsar Shaded Broker ............................... SKIPPED
2020-06-02T12:50:40.303 [INFO] Pulsar Client Java ................................. SKIPPED
2020-06-02T12:50:40.303 [INFO] Pulsar Client 1.x Compatibility Base ............... SKIPPED
2020-06-02T12:50:40.303 [INFO] Pulsar Client 2.x Shaded API ....................... SKIPPED
2020-06-02T12:50:40.303 [INFO] Pulsar Client 1.x Compatibility API ................ SKIPPED
2020-06-02T12:50:40.303 [INFO] Pulsar Client Admin ................................ SKIPPED
2020-06-02T12:50:40.303 [INFO] Pulsar Client Tools ................................ SKIPPED
2020-06-02T12:50:40.303 [INFO] Pulsar Client Tools Test ........................... SKIPPED
2020-06-02T12:50:40.303 [INFO] Pulsar Client All .................................. SKIPPED
2020-06-02T12:50:40.303 [INFO] Pulsar Proxy ....................................... SKIPPED
2020-06-02T12:50:40.304 [INFO] Pulsar Storm adapter ............................... SKIPPED
2020-06-02T12:50:40.304 [INFO] Pulsar Flink Connectors (Deprecated) ............... SKIPPED
2020-06-02T12:50:40.304 [INFO] Spark Streaming Pulsar Receivers ................... SKIPPED
2020-06-02T12:50:40.304 [INFO] Pulsar Test Client ................................. SKIPPED
2020-06-02T12:50:40.304 [INFO] pulsar-broker-auth-athenz .......................... SKIPPED
2020-06-02T12:50:40.304 [INFO] pulsar-client-auth-athenz .......................... SKIPPED
2020-06-02T12:50:40.304 [INFO] Pulsar Kafka compatibility ......................... SKIPPED
2020-06-02T12:50:40.304 [INFO] Pulsar Kafka compatibility :: API (original) ....... SKIPPED
2020-06-02T12:50:40.304 [INFO] Pulsar Kafka compatibility 0.8 :: API (original) ... SKIPPED
2020-06-02T12:50:40.304 [INFO] Pulsar Kafka compatibility 0.9 :: API (original) ... SKIPPED
2020-06-02T12:50:40.304 [INFO] Pulsar Kafka compatibility :: API .................. SKIPPED
2020-06-02T12:50:40.304 [INFO] Pulsar Kafka compatibility 0.8 :: API .............. SKIPPED
2020-06-02T12:50:40.304 [INFO] Pulsar Kafka compatibility 0.9 :: API .............. SKIPPED
2020-06-02T12:50:40.304 [INFO] Pulsar Kafka compatibility :: Tests ................ SKIPPED
2020-06-02T12:50:40.304 [INFO] Pulsar Kafka-0.8 compatibility :: Tests ............ SKIPPED
2020-06-02T12:50:40.304 [INFO] Pulsar Kafka compatibility 0.9 :: Tests ............ SKIPPED
2020-06-02T12:50:40.304 [INFO] pulsar-zookeeper ................................... SKIPPED
2020-06-02T12:50:40.304 [INFO] Pulsar Log4j2 Appender ............................. SKIPPED
2020-06-02T12:50:40.304 [INFO] Pulsar SQL :: Parent ............................... SKIPPED
2020-06-02T12:50:40.304 [INFO] Pulsar SQL :: Pulsar Presto Connector Packaging .... SKIPPED
2020-06-02T12:50:40.304 [INFO] Pulsar SQL :: Pulsar Presto Connector .............. SKIPPED
2020-06-02T12:50:40.304 [INFO] Pulsar SQL :: Pulsar Presto Distribution ........... SKIPPED
2020-06-02T12:50:40.304 [INFO] Apache Pulsar :: Docker Images ..................... SKIPPED
2020-06-02T12:50:40.304 [INFO] Apache Pulsar :: Docker Images :: Pulsar Dashboard . SKIPPED
2020-06-02T12:50:40.304 [INFO] pulsar-client-auth-sasl ............................ SKIPPED
2020-06-02T12:50:40.304 [INFO] pulsar-broker-auth-sasl ............................ SKIPPED
2020-06-02T12:50:40.304 [INFO] Pulsar Functions :: Runtime All .................... SKIPPED
2020-06-02T12:50:40.305 [INFO] Pulsar Functions :: Local Runner Shaded ............ SKIPPED
2020-06-02T12:50:40.305 [INFO] Pulsar IO :: Canal ................................. SKIPPED
2020-06-02T12:50:40.305 [INFO] Pulsar IO :: ElasticSearch ......................... SKIPPED
2020-06-02T12:50:40.305 [INFO] Pulsar IO :: Hdfs2 ................................. SKIPPED
2020-06-02T12:50:40.305 [INFO] Pulsar IO :: Hdfs3 ................................. SKIPPED
2020-06-02T12:50:40.305 [INFO] Pulsar IO :: Jdbc .................................. SKIPPED
2020-06-02T12:50:40.305 [INFO] Pulsar IO :: Jdbc :: Core .......................... SKIPPED
2020-06-02T12:50:40.305 [INFO] Pulsar IO :: Jdbc :: ClickHouse .................... SKIPPED
2020-06-02T12:50:40.305 [INFO] Pulsar IO :: Jdbc :: Mariadb ....................... SKIPPED
2020-06-02T12:50:40.305 [INFO] Pulsar IO :: Jdbc :: Postgres ...................... SKIPPED
2020-06-02T12:50:40.305 [INFO] Pulsar IO :: Jdbc :: Sqlite ........................ SKIPPED
2020-06-02T12:50:40.305 [INFO] Pulsar IO :: Kafka ................................. SKIPPED
2020-06-02T12:50:40.305 [INFO] Pulsar IO :: IO AWS ................................ SKIPPED
2020-06-02T12:50:40.305 [INFO] Pulsar IO :: Kinesis ............................... SKIPPED
2020-06-02T12:50:40.305 [INFO] Pulsar IO :: RabbitMQ .............................. SKIPPED
2020-06-02T12:50:40.305 [INFO] Pulsar IO :: Docs .................................. SKIPPED
2020-06-02T12:50:40.305 [INFO] Pulsar IO :: Aerospike ............................. SKIPPED
2020-06-02T12:50:40.305 [INFO] Apache Pulsar :: Kafka Connect Avro Converter shaded SKIPPED
2020-06-02T12:50:40.305 [INFO] Pulsar IO :: Kafka Connect Adaptor ................. SKIPPED
2020-06-02T12:50:40.305 [INFO] Pulsar IO :: Debezium .............................. SKIPPED
2020-06-02T12:50:40.305 [INFO] Pulsar IO :: Debezium :: Core ...................... SKIPPED
2020-06-02T12:50:40.305 [INFO] Pulsar IO :: Debezium :: mysql ..................... SKIPPED
2020-06-02T12:50:40.305 [INFO] Pulsar IO :: Debezium :: postgres .................. SKIPPED
2020-06-02T12:50:40.305 [INFO] Pulsar IO :: Debezium :: mongodb ................... SKIPPED
2020-06-02T12:50:40.305 [INFO] Pulsar IO :: File .................................. SKIPPED
2020-06-02T12:50:40.305 [INFO] Pulsar IO :: Netty ................................. SKIPPED
2020-06-02T12:50:40.306 [INFO] Pulsar IO :: Hbase ................................. SKIPPED
2020-06-02T12:50:40.306 [INFO] Pulsar IO :: MongoDB ............................... SKIPPED
2020-06-02T12:50:40.306 [INFO] Pulsar IO :: Flume ................................. SKIPPED
2020-06-02T12:50:40.306 [INFO] Pulsar IO :: Redis ................................. SKIPPED
2020-06-02T12:50:40.306 [INFO] Pulsar IO :: Solr .................................. SKIPPED
2020-06-02T12:50:40.306 [INFO] Pulsar IO :: InfluxDB .............................. SKIPPED
2020-06-02T12:50:40.306 [INFO] Pulsar IO :: DynamoDB .............................. SKIPPED
2020-06-02T12:50:40.306 [INFO] Pulsar Examples :: Parent .......................... SKIPPED
2020-06-02T12:50:40.306 [INFO] Pulsar Examples :: Flink ........................... SKIPPED
2020-06-02T12:50:40.306 [INFO] Pulsar Examples :: Spark ........................... SKIPPED
2020-06-02T12:50:40.306 [INFO] Apache Pulsar :: Bouncy Castle :: BC-FIPS .......... SKIPPED
2020-06-02T12:50:40.306 [INFO] Pulsar Bouncy Castle FIPS Test ..................... SKIPPED
2020-06-02T12:50:40.306 [INFO] Pulsar Bouncy Castle FIPS Nar Test ................. SKIPPED
2020-06-02T12:50:40.306 [INFO] Pulsar :: Distribution ............................. SKIPPED
2020-06-02T12:50:40.306 [INFO] Pulsar :: Distribution :: Server ................... SKIPPED
2020-06-02T12:50:40.306 [INFO] Pulsar :: Distribution :: IO ....................... SKIPPED
2020-06-02T12:50:40.306 [INFO] Pulsar :: Distribution :: Offloader ................ SKIPPED
2020-06-02T12:50:40.306 [INFO] Apache Pulsar :: Docker Images :: Pulsar Latest Version SKIPPED
2020-06-02T12:50:40.306 [INFO] Apache Pulsar :: Docker Images :: Grafana .......... SKIPPED
2020-06-02T12:50:40.306 [INFO] Apache Pulsar :: Docker Images :: Pulsar Latest Version (Include All Components) SKIPPED
2020-06-02T12:50:40.306 [INFO] Apache Pulsar :: Docker Images :: Pulsar Standalone SKIPPED
2020-06-02T12:50:40.306 [INFO] Apache Pulsar :: Tests ............................. SKIPPED
2020-06-02T12:50:40.306 [INFO] Apache Pulsar :: Tests :: Docker Images ............ SKIPPED
2020-06-02T12:50:40.306 [INFO] Apache Pulsar :: Tests :: Docker Images :: Java Test Functions SKIPPED
2020-06-02T12:50:40.306 [INFO] Apache Pulsar :: Tests :: Docker Images :: Latest Version Testing SKIPPED
2020-06-02T12:50:40.306 [INFO] Apache Pulsar :: Tests :: Integration .............. SKIPPED
2020-06-02T12:50:40.306 [INFO] Apache Pulsar :: Tests :: Pulsar Kafka Compat Client Tests SKIPPED
2020-06-02T12:50:40.307 [INFO] Pulsar Storm adapter Tests ......................... SKIPPED
2020-06-02T12:50:40.307 [INFO] Spark Streaming Pulsar Receivers Tests ............. SKIPPED
2020-06-02T12:50:40.307 [INFO] Apache Pulsar :: Tests :: Backwards Client Compatibility 2.0.0-rc1-incubating SKIPPED
2020-06-02T12:50:40.307 [INFO] Apache Pulsar :: Tests :: Backwards Client Compatibility 2.0.1-incubating 2.6.0-SNAPSHOT SKIPPED
2020-06-02T12:50:40.307 [INFO] ------------------------------------------------------------------------
2020-06-02T12:50:40.307 [INFO] BUILD FAILURE
2020-06-02T12:50:40.307 [INFO] ------------------------------------------------------------------------
2020-06-02T12:50:40.307 [INFO] Total time: 10:07 min
2020-06-02T12:50:40.307 [INFO] Finished at: 2020-06-02T12:50:40Z
2020-06-02T12:50:40.307 [INFO] ------------------------------------------------------------------------
Waiting for Jenkins to finish collecting data
2020-06-02T12:50:41.278 [ERROR] Failed to execute goal org.apache.maven.plugins:maven-compiler-plugin:3.8.0:testCompile (default-testCompile) on project pulsar-broker: Compilation failure: Compilation failure:
2020-06-02T12:50:41.278 [ERROR] <https://builds.apache.org/job/pulsar_release_nightly_snapshot/ws/pulsar-broker/src/test/java/org/apache/pulsar/broker/service/PrecisTopicPublishRateThrottleTest.java>:[48,13] cannot find symbol
2020-06-02T12:50:41.278 [ERROR] symbol: method setMaxPendingPublishdRequestsPerConnection(int)
2020-06-02T12:50:41.278 [ERROR] location: variable conf of type org.apache.pulsar.broker.ServiceConfiguration
2020-06-02T12:50:41.278 [ERROR] <https://builds.apache.org/job/pulsar_release_nightly_snapshot/ws/pulsar-broker/src/test/java/org/apache/pulsar/broker/service/PrecisTopicPublishRateThrottleTest.java>:[87,13] cannot find symbol
2020-06-02T12:50:41.278 [ERROR] symbol: method setMaxPendingPublishdRequestsPerConnection(int)
2020-06-02T12:50:41.278 [ERROR] location: variable conf of type org.apache.pulsar.broker.ServiceConfiguration
2020-06-02T12:50:41.278 [ERROR] <https://builds.apache.org/job/pulsar_release_nightly_snapshot/ws/pulsar-broker/src/test/java/org/apache/pulsar/broker/service/PrecisTopicPublishRateThrottleTest.java>:[119,13] cannot find symbol
2020-06-02T12:50:41.278 [ERROR] symbol: method setMaxPendingPublishdRequestsPerConnection(int)
2020-06-02T12:50:41.278 [ERROR] location: variable conf of type org.apache.pulsar.broker.ServiceConfiguration
2020-06-02T12:50:41.278 [ERROR] -> [Help 1]
2020-06-02T12:50:41.278 [ERROR]
2020-06-02T12:50:41.278 [ERROR] To see the full stack trace of the errors, re-run Maven with the -e switch.
2020-06-02T12:50:41.278 [ERROR] Re-run Maven using the -X switch to enable full debug logging.
2020-06-02T12:50:41.278 [ERROR]
2020-06-02T12:50:41.278 [ERROR] For more information about the errors and possible solutions, please read the following articles:
2020-06-02T12:50:41.279 [ERROR] [Help 1] http://cwiki.apache.org/confluence/display/MAVEN/MojoFailureException
2020-06-02T12:50:41.279 [ERROR]
2020-06-02T12:50:41.279 [ERROR] After correcting the problems, you can resume the build with the command
2020-06-02T12:50:41.279 [ERROR] mvn <goals> -rf :pulsar-broker
channel stopped
Not sending mail to unregistered user noreply@github.com
Jenkins build is back to normal : pulsar_release_nightly_snapshot
#833
Posted by Apache Jenkins Server <je...@builds.apache.org>.
See <https://builds.apache.org/job/pulsar_release_nightly_snapshot/833/display/redirect?page=changes>