You are viewing a plain text version of this content. The canonical link for it is here.
Posted to mapreduce-dev@hadoop.apache.org by Apache Jenkins Server <je...@builds.apache.org> on 2016/05/12 01:17:57 UTC

Hadoop-Mapreduce-trunk-Java8 - Build # 1387 - Still Failing

See https://builds.apache.org/job/Hadoop-Mapreduce-trunk-Java8/1387/

###################################################################################
########################## LAST 60 LINES OF THE CONSOLE ###########################
[...truncated 9541 lines...]
Running org.apache.hadoop.mapreduce.lib.map.TestMultithreadedMapper
Tests run: 3, Failures: 0, Errors: 0, Skipped: 0, Time elapsed: 5.506 sec - in org.apache.hadoop.mapreduce.lib.map.TestMultithreadedMapper
Java HotSpot(TM) 64-Bit Server VM warning: ignoring option MaxPermSize=768m; support was removed in 8.0
Running org.apache.hadoop.mapreduce.TestMapCollection
Tests run: 11, Failures: 0, Errors: 0, Skipped: 0, Time elapsed: 13.673 sec - in org.apache.hadoop.mapreduce.TestMapCollection
Java HotSpot(TM) 64-Bit Server VM warning: ignoring option MaxPermSize=768m; support was removed in 8.0
Running org.apache.hadoop.io.TestSequenceFileMergeProgress
Tests run: 3, Failures: 0, Errors: 0, Skipped: 0, Time elapsed: 1.667 sec - in org.apache.hadoop.io.TestSequenceFileMergeProgress

Results :

Failed tests: 
  TestMiniMRChildTask.testTaskEnv:472->runTestTaskEnv:550 The environment checker job failed.
  TestMiniMRChildTask.testTaskOldEnv:496->runTestTaskEnv:550 The environment checker job failed.
  TestClusterMRNotification>NotificationTestCase.testMR:205 expected:<6> but was:<4>

Tests run: 533, Failures: 3, Errors: 0, Skipped: 11

[INFO] ------------------------------------------------------------------------
[INFO] Reactor Summary:
[INFO] 
[INFO] Apache Hadoop MapReduce Client .................... SUCCESS [  2.444 s]
[INFO] Apache Hadoop MapReduce Core ...................... SUCCESS [01:40 min]
[INFO] Apache Hadoop MapReduce Common .................... SUCCESS [ 25.677 s]
[INFO] Apache Hadoop MapReduce Shuffle ................... SUCCESS [  4.312 s]
[INFO] Apache Hadoop MapReduce App ....................... SUCCESS [10:12 min]
[INFO] Apache Hadoop MapReduce HistoryServer ............. SUCCESS [06:24 min]
[INFO] Apache Hadoop MapReduce JobClient ................. FAILURE [  01:47 h]
[INFO] Apache Hadoop MapReduce HistoryServer Plugins ..... SKIPPED
[INFO] Apache Hadoop MapReduce NativeTask ................ SKIPPED
[INFO] Apache Hadoop MapReduce Examples .................. SKIPPED
[INFO] Apache Hadoop MapReduce ........................... SKIPPED
[INFO] ------------------------------------------------------------------------
[INFO] BUILD FAILURE
[INFO] ------------------------------------------------------------------------
[INFO] Total time: 02:06 h
[INFO] Finished at: 2016-05-12T01:17:57+00:00
[INFO] Final Memory: 34M/144M
[INFO] ------------------------------------------------------------------------
[WARNING] The requested profile "parallel-tests" could not be activated because it does not exist.
[ERROR] Failed to execute goal org.apache.maven.plugins:maven-surefire-plugin:2.17:test (default-test) on project hadoop-mapreduce-client-jobclient: There are test failures.
[ERROR] 
[ERROR] Please refer to /home/jenkins/jenkins-slave/workspace/Hadoop-Mapreduce-trunk-Java8/hadoop-mapreduce-project/hadoop-mapreduce-client/hadoop-mapreduce-client-jobclient/target/surefire-reports for the individual test results.
[ERROR] -> [Help 1]
[ERROR] 
[ERROR] To see the full stack trace of the errors, re-run Maven with the -e switch.
[ERROR] Re-run Maven using the -X switch to enable full debug logging.
[ERROR] 
[ERROR] For more information about the errors and possible solutions, please read the following articles:
[ERROR] [Help 1] http://cwiki.apache.org/confluence/display/MAVEN/MojoFailureException
[ERROR] 
[ERROR] After correcting the problems, you can resume the build with the command
[ERROR]   mvn <goals> -rf :hadoop-mapreduce-client-jobclient
Build step 'Execute shell' marked build as failure
[FINDBUGS] Skipping publisher since build result is FAILURE
Archiving artifacts
Recording test results
Email was triggered for: Failure - Any
Sending email for trigger: Failure - Any



###################################################################################
############################## FAILED TESTS (if any) ##############################
3 tests failed.
FAILED:  org.apache.hadoop.mapred.TestClusterMRNotification.testMR

Error Message:
expected:<6> but was:<4>

Stack Trace:
java.lang.AssertionError: expected:<6> but was:<4>
	at org.junit.Assert.fail(Assert.java:88)
	at org.junit.Assert.failNotEquals(Assert.java:743)
	at org.junit.Assert.assertEquals(Assert.java:118)
	at org.junit.Assert.assertEquals(Assert.java:555)
	at org.junit.Assert.assertEquals(Assert.java:542)
	at org.apache.hadoop.mapred.NotificationTestCase.testMR(NotificationTestCase.java:205)
	at sun.reflect.NativeMethodAccessorImpl.invoke0(Native Method)
	at sun.reflect.NativeMethodAccessorImpl.invoke(NativeMethodAccessorImpl.java:62)
	at sun.reflect.DelegatingMethodAccessorImpl.invoke(DelegatingMethodAccessorImpl.java:43)
	at java.lang.reflect.Method.invoke(Method.java:483)
	at org.junit.runners.model.FrameworkMethod$1.runReflectiveCall(FrameworkMethod.java:47)
	at org.junit.internal.runners.model.ReflectiveCallable.run(ReflectiveCallable.java:12)
	at org.junit.runners.model.FrameworkMethod.invokeExplosively(FrameworkMethod.java:44)
	at org.junit.internal.runners.statements.InvokeMethod.evaluate(InvokeMethod.java:17)
	at org.junit.internal.runners.statements.RunBefores.evaluate(RunBefores.java:26)
	at org.junit.internal.runners.statements.RunAfters.evaluate(RunAfters.java:27)
	at org.junit.runners.ParentRunner.runLeaf(ParentRunner.java:271)
	at org.junit.runners.BlockJUnit4ClassRunner.runChild(BlockJUnit4ClassRunner.java:70)
	at org.junit.runners.BlockJUnit4ClassRunner.runChild(BlockJUnit4ClassRunner.java:50)
	at org.junit.runners.ParentRunner$3.run(ParentRunner.java:238)
	at org.junit.runners.ParentRunner$1.schedule(ParentRunner.java:63)
	at org.junit.runners.ParentRunner.runChildren(ParentRunner.java:236)
	at org.junit.runners.ParentRunner.access$000(ParentRunner.java:53)
	at org.junit.runners.ParentRunner$2.evaluate(ParentRunner.java:229)
	at org.junit.runners.ParentRunner.run(ParentRunner.java:309)
	at org.apache.maven.surefire.junit4.JUnit4Provider.execute(JUnit4Provider.java:264)
	at org.apache.maven.surefire.junit4.JUnit4Provider.executeTestSet(JUnit4Provider.java:153)
	at org.apache.maven.surefire.junit4.JUnit4Provider.invoke(JUnit4Provider.java:124)
	at org.apache.maven.surefire.booter.ForkedBooter.invokeProviderInSameClassLoader(ForkedBooter.java:200)
	at org.apache.maven.surefire.booter.ForkedBooter.runSuitesInProcess(ForkedBooter.java:153)
	at org.apache.maven.surefire.booter.ForkedBooter.main(ForkedBooter.java:103)


FAILED:  org.apache.hadoop.mapred.TestMiniMRChildTask.testTaskEnv

Error Message:
The environment checker job failed.

Stack Trace:
java.lang.AssertionError: The environment checker job failed.
	at org.junit.Assert.fail(Assert.java:88)
	at org.junit.Assert.assertTrue(Assert.java:41)
	at org.apache.hadoop.mapred.TestMiniMRChildTask.runTestTaskEnv(TestMiniMRChildTask.java:550)
	at org.apache.hadoop.mapred.TestMiniMRChildTask.testTaskEnv(TestMiniMRChildTask.java:472)


FAILED:  org.apache.hadoop.mapred.TestMiniMRChildTask.testTaskOldEnv

Error Message:
The environment checker job failed.

Stack Trace:
java.lang.AssertionError: The environment checker job failed.
	at org.junit.Assert.fail(Assert.java:88)
	at org.junit.Assert.assertTrue(Assert.java:41)
	at org.apache.hadoop.mapred.TestMiniMRChildTask.runTestTaskEnv(TestMiniMRChildTask.java:550)
	at org.apache.hadoop.mapred.TestMiniMRChildTask.testTaskOldEnv(TestMiniMRChildTask.java:496)




Hadoop-Mapreduce-trunk-Java8 - Build # 1415 - Still Failing

Posted by Apache Jenkins Server <je...@builds.apache.org>.
See https://builds.apache.org/job/Hadoop-Mapreduce-trunk-Java8/1415/

###################################################################################
########################## LAST 60 LINES OF THE CONSOLE ###########################
[...truncated 8383 lines...]
Running org.apache.hadoop.mapred.TestFileInputFormat
Tests run: 12, Failures: 0, Errors: 0, Skipped: 0, Time elapsed: 1.911 sec - in org.apache.hadoop.mapred.TestFileInputFormat
Running org.apache.hadoop.mapred.TestJobEndNotifier
Tests run: 3, Failures: 0, Errors: 0, Skipped: 0, Time elapsed: 3.205 sec - in org.apache.hadoop.mapred.TestJobEndNotifier
Running org.apache.hadoop.mapred.TestOldMethodsJobID
Tests run: 6, Failures: 0, Errors: 0, Skipped: 0, Time elapsed: 0.287 sec - in org.apache.hadoop.mapred.TestOldMethodsJobID
Running org.apache.hadoop.mapred.TestJobQueueClient
Tests run: 1, Failures: 0, Errors: 0, Skipped: 0, Time elapsed: 0.09 sec - in org.apache.hadoop.mapred.TestJobQueueClient
Running org.apache.hadoop.mapred.TestJobConf
Tests run: 12, Failures: 0, Errors: 0, Skipped: 0, Time elapsed: 1.548 sec - in org.apache.hadoop.mapred.TestJobConf

Results :

Failed tests: 
  TestCLI.testGetJob:181 null

Tests run: 244, Failures: 1, Errors: 0, Skipped: 0

[INFO] ------------------------------------------------------------------------
[INFO] Reactor Summary:
[INFO] 
[INFO] Apache Hadoop MapReduce Client .................... SUCCESS [  2.300 s]
[INFO] Apache Hadoop MapReduce Core ...................... FAILURE [01:37 min]
[INFO] Apache Hadoop MapReduce Common .................... SKIPPED
[INFO] Apache Hadoop MapReduce Shuffle ................... SKIPPED
[INFO] Apache Hadoop MapReduce App ....................... SKIPPED
[INFO] Apache Hadoop MapReduce HistoryServer ............. SKIPPED
[INFO] Apache Hadoop MapReduce JobClient ................. SKIPPED
[INFO] Apache Hadoop MapReduce HistoryServer Plugins ..... SKIPPED
[INFO] Apache Hadoop MapReduce NativeTask ................ SKIPPED
[INFO] Apache Hadoop MapReduce Examples .................. SKIPPED
[INFO] Apache Hadoop MapReduce ........................... SKIPPED
[INFO] ------------------------------------------------------------------------
[INFO] BUILD FAILURE
[INFO] ------------------------------------------------------------------------
[INFO] Total time: 01:40 min
[INFO] Finished at: 2016-05-17T15:21:10+00:00
[INFO] Final Memory: 32M/198M
[INFO] ------------------------------------------------------------------------
[WARNING] The requested profile "parallel-tests" could not be activated because it does not exist.
[ERROR] Failed to execute goal org.apache.maven.plugins:maven-surefire-plugin:2.17:test (default-test) on project hadoop-mapreduce-client-core: There are test failures.
[ERROR] 
[ERROR] Please refer to /home/jenkins/jenkins-slave/workspace/Hadoop-Mapreduce-trunk-Java8/hadoop-mapreduce-project/hadoop-mapreduce-client/hadoop-mapreduce-client-core/target/surefire-reports for the individual test results.
[ERROR] -> [Help 1]
[ERROR] 
[ERROR] To see the full stack trace of the errors, re-run Maven with the -e switch.
[ERROR] Re-run Maven using the -X switch to enable full debug logging.
[ERROR] 
[ERROR] For more information about the errors and possible solutions, please read the following articles:
[ERROR] [Help 1] http://cwiki.apache.org/confluence/display/MAVEN/MojoFailureException
[ERROR] 
[ERROR] After correcting the problems, you can resume the build with the command
[ERROR]   mvn <goals> -rf :hadoop-mapreduce-client-core
Build step 'Execute shell' marked build as failure
[FINDBUGS] Skipping publisher since build result is FAILURE
Archiving artifacts
Recording test results
Email was triggered for: Failure - Any
Sending email for trigger: Failure - Any



###################################################################################
############################## FAILED TESTS (if any) ##############################
1 tests failed.
FAILED:  org.apache.hadoop.mapreduce.tools.TestCLI.testGetJob

Error Message:
null

Stack Trace:
java.lang.AssertionError: null
	at org.junit.Assert.fail(Assert.java:86)
	at org.junit.Assert.assertTrue(Assert.java:41)
	at org.junit.Assert.assertTrue(Assert.java:52)
	at org.apache.hadoop.mapreduce.tools.TestCLI.testGetJob(TestCLI.java:181)




Hadoop-Mapreduce-trunk-Java8 - Build # 1414 - Still Failing

Posted by Apache Jenkins Server <je...@builds.apache.org>.
See https://builds.apache.org/job/Hadoop-Mapreduce-trunk-Java8/1414/

###################################################################################
########################## LAST 60 LINES OF THE CONSOLE ###########################
[...truncated 8664 lines...]
Running org.apache.hadoop.mapreduce.v2.app.webapp.TestAMWebApp
Tests run: 12, Failures: 0, Errors: 0, Skipped: 0, Time elapsed: 17.612 sec - in org.apache.hadoop.mapreduce.v2.app.webapp.TestAMWebApp
Running org.apache.hadoop.mapreduce.v2.app.webapp.TestAMWebServicesJobConf
Tests run: 4, Failures: 0, Errors: 0, Skipped: 0, Time elapsed: 5.197 sec - in org.apache.hadoop.mapreduce.v2.app.webapp.TestAMWebServicesJobConf
Running org.apache.hadoop.mapred.TestTaskAttemptListenerImpl
Tests run: 6, Failures: 0, Errors: 0, Skipped: 0, Time elapsed: 1.148 sec - in org.apache.hadoop.mapred.TestTaskAttemptListenerImpl
Running org.apache.hadoop.mapred.TestTaskAttemptFinishingMonitor
Tests run: 1, Failures: 0, Errors: 0, Skipped: 0, Time elapsed: 1.333 sec - in org.apache.hadoop.mapred.TestTaskAttemptFinishingMonitor
Running org.apache.hadoop.mapred.TestLocalContainerLauncher
Tests run: 2, Failures: 0, Errors: 0, Skipped: 0, Time elapsed: 1.712 sec - in org.apache.hadoop.mapred.TestLocalContainerLauncher

Results :

Failed tests: 
  TestRecovery.testCrashed:188 TaskAttempt state is not correct (timedout) expected:<FAILED> but was:<STARTING>

Tests run: 348, Failures: 1, Errors: 0, Skipped: 0

[INFO] ------------------------------------------------------------------------
[INFO] Reactor Summary:
[INFO] 
[INFO] Apache Hadoop MapReduce Client .................... SUCCESS [  2.281 s]
[INFO] Apache Hadoop MapReduce Core ...................... SUCCESS [01:38 min]
[INFO] Apache Hadoop MapReduce Common .................... SUCCESS [ 25.590 s]
[INFO] Apache Hadoop MapReduce Shuffle ................... SUCCESS [  4.869 s]
[INFO] Apache Hadoop MapReduce App ....................... FAILURE [10:25 min]
[INFO] Apache Hadoop MapReduce HistoryServer ............. SKIPPED
[INFO] Apache Hadoop MapReduce JobClient ................. SKIPPED
[INFO] Apache Hadoop MapReduce HistoryServer Plugins ..... SKIPPED
[INFO] Apache Hadoop MapReduce NativeTask ................ SKIPPED
[INFO] Apache Hadoop MapReduce Examples .................. SKIPPED
[INFO] Apache Hadoop MapReduce ........................... SKIPPED
[INFO] ------------------------------------------------------------------------
[INFO] BUILD FAILURE
[INFO] ------------------------------------------------------------------------
[INFO] Total time: 12:37 min
[INFO] Finished at: 2016-05-17T14:32:12+00:00
[INFO] Final Memory: 36M/203M
[INFO] ------------------------------------------------------------------------
[WARNING] The requested profile "parallel-tests" could not be activated because it does not exist.
[ERROR] Failed to execute goal org.apache.maven.plugins:maven-surefire-plugin:2.17:test (default-test) on project hadoop-mapreduce-client-app: There are test failures.
[ERROR] 
[ERROR] Please refer to /home/jenkins/jenkins-slave/workspace/Hadoop-Mapreduce-trunk-Java8/hadoop-mapreduce-project/hadoop-mapreduce-client/hadoop-mapreduce-client-app/target/surefire-reports for the individual test results.
[ERROR] -> [Help 1]
[ERROR] 
[ERROR] To see the full stack trace of the errors, re-run Maven with the -e switch.
[ERROR] Re-run Maven using the -X switch to enable full debug logging.
[ERROR] 
[ERROR] For more information about the errors and possible solutions, please read the following articles:
[ERROR] [Help 1] http://cwiki.apache.org/confluence/display/MAVEN/MojoFailureException
[ERROR] 
[ERROR] After correcting the problems, you can resume the build with the command
[ERROR]   mvn <goals> -rf :hadoop-mapreduce-client-app
Build step 'Execute shell' marked build as failure
[FINDBUGS] Skipping publisher since build result is FAILURE
Archiving artifacts
Recording test results
Email was triggered for: Failure - Any
Sending email for trigger: Failure - Any



###################################################################################
############################## FAILED TESTS (if any) ##############################
1 tests failed.
FAILED:  org.apache.hadoop.mapreduce.v2.app.TestRecovery.testCrashed

Error Message:
TaskAttempt state is not correct (timedout) expected:<FAILED> but was:<STARTING>

Stack Trace:
java.lang.AssertionError: TaskAttempt state is not correct (timedout) expected:<FAILED> but was:<STARTING>
	at org.junit.Assert.fail(Assert.java:88)
	at org.junit.Assert.failNotEquals(Assert.java:743)
	at org.junit.Assert.assertEquals(Assert.java:118)
	at org.apache.hadoop.mapreduce.v2.app.MRApp.waitForState(MRApp.java:382)
	at org.apache.hadoop.mapreduce.v2.app.TestRecovery.testCrashed(TestRecovery.java:188)




Hadoop-Mapreduce-trunk-Java8 - Build # 1413 - Still Failing

Posted by Apache Jenkins Server <je...@builds.apache.org>.
See https://builds.apache.org/job/Hadoop-Mapreduce-trunk-Java8/1413/

###################################################################################
########################## LAST 60 LINES OF THE CONSOLE ###########################
[...truncated 8665 lines...]
Running org.apache.hadoop.mapreduce.v2.app.TestFail
Tests run: 5, Failures: 0, Errors: 0, Skipped: 0, Time elapsed: 16.308 sec - in org.apache.hadoop.mapreduce.v2.app.TestFail
Running org.apache.hadoop.mapreduce.v2.app.TestMRApp
Tests run: 13, Failures: 0, Errors: 0, Skipped: 0, Time elapsed: 23.332 sec - in org.apache.hadoop.mapreduce.v2.app.TestMRApp
Running org.apache.hadoop.mapred.TestTaskAttemptFinishingMonitor
Tests run: 1, Failures: 0, Errors: 0, Skipped: 0, Time elapsed: 1.299 sec - in org.apache.hadoop.mapred.TestTaskAttemptFinishingMonitor
Running org.apache.hadoop.mapred.TestTaskAttemptListenerImpl
Tests run: 6, Failures: 0, Errors: 0, Skipped: 0, Time elapsed: 1.112 sec - in org.apache.hadoop.mapred.TestTaskAttemptListenerImpl
Running org.apache.hadoop.mapred.TestLocalContainerLauncher
Tests run: 2, Failures: 0, Errors: 0, Skipped: 0, Time elapsed: 1.71 sec - in org.apache.hadoop.mapred.TestLocalContainerLauncher

Results :

Failed tests: 
  TestRecovery.testCrashed:188 TaskAttempt state is not correct (timedout) expected:<FAILED> but was:<STARTING>

Tests run: 348, Failures: 1, Errors: 0, Skipped: 0

[INFO] ------------------------------------------------------------------------
[INFO] Reactor Summary:
[INFO] 
[INFO] Apache Hadoop MapReduce Client .................... SUCCESS [  2.351 s]
[INFO] Apache Hadoop MapReduce Core ...................... SUCCESS [01:42 min]
[INFO] Apache Hadoop MapReduce Common .................... SUCCESS [ 25.421 s]
[INFO] Apache Hadoop MapReduce Shuffle ................... SUCCESS [  4.339 s]
[INFO] Apache Hadoop MapReduce App ....................... FAILURE [10:32 min]
[INFO] Apache Hadoop MapReduce HistoryServer ............. SKIPPED
[INFO] Apache Hadoop MapReduce JobClient ................. SKIPPED
[INFO] Apache Hadoop MapReduce HistoryServer Plugins ..... SKIPPED
[INFO] Apache Hadoop MapReduce NativeTask ................ SKIPPED
[INFO] Apache Hadoop MapReduce Examples .................. SKIPPED
[INFO] Apache Hadoop MapReduce ........................... SKIPPED
[INFO] ------------------------------------------------------------------------
[INFO] BUILD FAILURE
[INFO] ------------------------------------------------------------------------
[INFO] Total time: 12:47 min
[INFO] Finished at: 2016-05-17T13:32:27+00:00
[INFO] Final Memory: 36M/235M
[INFO] ------------------------------------------------------------------------
[WARNING] The requested profile "parallel-tests" could not be activated because it does not exist.
[ERROR] Failed to execute goal org.apache.maven.plugins:maven-surefire-plugin:2.17:test (default-test) on project hadoop-mapreduce-client-app: There are test failures.
[ERROR] 
[ERROR] Please refer to /home/jenkins/jenkins-slave/workspace/Hadoop-Mapreduce-trunk-Java8/hadoop-mapreduce-project/hadoop-mapreduce-client/hadoop-mapreduce-client-app/target/surefire-reports for the individual test results.
[ERROR] -> [Help 1]
[ERROR] 
[ERROR] To see the full stack trace of the errors, re-run Maven with the -e switch.
[ERROR] Re-run Maven using the -X switch to enable full debug logging.
[ERROR] 
[ERROR] For more information about the errors and possible solutions, please read the following articles:
[ERROR] [Help 1] http://cwiki.apache.org/confluence/display/MAVEN/MojoFailureException
[ERROR] 
[ERROR] After correcting the problems, you can resume the build with the command
[ERROR]   mvn <goals> -rf :hadoop-mapreduce-client-app
Build step 'Execute shell' marked build as failure
[FINDBUGS] Skipping publisher since build result is FAILURE
Archiving artifacts
Recording test results
Email was triggered for: Failure - Any
Sending email for trigger: Failure - Any



###################################################################################
############################## FAILED TESTS (if any) ##############################
1 tests failed.
FAILED:  org.apache.hadoop.mapreduce.v2.app.TestRecovery.testCrashed

Error Message:
TaskAttempt state is not correct (timedout) expected:<FAILED> but was:<STARTING>

Stack Trace:
java.lang.AssertionError: TaskAttempt state is not correct (timedout) expected:<FAILED> but was:<STARTING>
	at org.junit.Assert.fail(Assert.java:88)
	at org.junit.Assert.failNotEquals(Assert.java:743)
	at org.junit.Assert.assertEquals(Assert.java:118)
	at org.apache.hadoop.mapreduce.v2.app.MRApp.waitForState(MRApp.java:382)
	at org.apache.hadoop.mapreduce.v2.app.TestRecovery.testCrashed(TestRecovery.java:188)




Hadoop-Mapreduce-trunk-Java8 - Build # 1412 - Still Failing

Posted by Apache Jenkins Server <je...@builds.apache.org>.
See https://builds.apache.org/job/Hadoop-Mapreduce-trunk-Java8/1412/

###################################################################################
########################## LAST 60 LINES OF THE CONSOLE ###########################
[...truncated 8385 lines...]
Running org.apache.hadoop.mapred.TestFileInputFormat
Tests run: 12, Failures: 0, Errors: 0, Skipped: 0, Time elapsed: 1.847 sec - in org.apache.hadoop.mapred.TestFileInputFormat
Running org.apache.hadoop.mapred.TestJobEndNotifier
Tests run: 3, Failures: 0, Errors: 0, Skipped: 0, Time elapsed: 3.131 sec - in org.apache.hadoop.mapred.TestJobEndNotifier
Running org.apache.hadoop.mapred.TestOldMethodsJobID
Tests run: 6, Failures: 0, Errors: 0, Skipped: 0, Time elapsed: 0.283 sec - in org.apache.hadoop.mapred.TestOldMethodsJobID
Running org.apache.hadoop.mapred.TestJobQueueClient
Tests run: 1, Failures: 0, Errors: 0, Skipped: 0, Time elapsed: 0.077 sec - in org.apache.hadoop.mapred.TestJobQueueClient
Running org.apache.hadoop.mapred.TestJobConf
Tests run: 12, Failures: 0, Errors: 0, Skipped: 0, Time elapsed: 1.438 sec - in org.apache.hadoop.mapred.TestJobConf

Results :

Failed tests: 
  TestCLI.testGetJob:181 null

Tests run: 244, Failures: 1, Errors: 0, Skipped: 0

[INFO] ------------------------------------------------------------------------
[INFO] Reactor Summary:
[INFO] 
[INFO] Apache Hadoop MapReduce Client .................... SUCCESS [  2.284 s]
[INFO] Apache Hadoop MapReduce Core ...................... FAILURE [01:36 min]
[INFO] Apache Hadoop MapReduce Common .................... SKIPPED
[INFO] Apache Hadoop MapReduce Shuffle ................... SKIPPED
[INFO] Apache Hadoop MapReduce App ....................... SKIPPED
[INFO] Apache Hadoop MapReduce HistoryServer ............. SKIPPED
[INFO] Apache Hadoop MapReduce JobClient ................. SKIPPED
[INFO] Apache Hadoop MapReduce HistoryServer Plugins ..... SKIPPED
[INFO] Apache Hadoop MapReduce NativeTask ................ SKIPPED
[INFO] Apache Hadoop MapReduce Examples .................. SKIPPED
[INFO] Apache Hadoop MapReduce ........................... SKIPPED
[INFO] ------------------------------------------------------------------------
[INFO] BUILD FAILURE
[INFO] ------------------------------------------------------------------------
[INFO] Total time: 01:39 min
[INFO] Finished at: 2016-05-17T12:20:59+00:00
[INFO] Final Memory: 31M/192M
[INFO] ------------------------------------------------------------------------
[WARNING] The requested profile "parallel-tests" could not be activated because it does not exist.
[ERROR] Failed to execute goal org.apache.maven.plugins:maven-surefire-plugin:2.17:test (default-test) on project hadoop-mapreduce-client-core: There are test failures.
[ERROR] 
[ERROR] Please refer to /home/jenkins/jenkins-slave/workspace/Hadoop-Mapreduce-trunk-Java8/hadoop-mapreduce-project/hadoop-mapreduce-client/hadoop-mapreduce-client-core/target/surefire-reports for the individual test results.
[ERROR] -> [Help 1]
[ERROR] 
[ERROR] To see the full stack trace of the errors, re-run Maven with the -e switch.
[ERROR] Re-run Maven using the -X switch to enable full debug logging.
[ERROR] 
[ERROR] For more information about the errors and possible solutions, please read the following articles:
[ERROR] [Help 1] http://cwiki.apache.org/confluence/display/MAVEN/MojoFailureException
[ERROR] 
[ERROR] After correcting the problems, you can resume the build with the command
[ERROR]   mvn <goals> -rf :hadoop-mapreduce-client-core
Build step 'Execute shell' marked build as failure
[FINDBUGS] Skipping publisher since build result is FAILURE
Archiving artifacts
Recording test results
Email was triggered for: Failure - Any
Sending email for trigger: Failure - Any



###################################################################################
############################## FAILED TESTS (if any) ##############################
1 tests failed.
FAILED:  org.apache.hadoop.mapreduce.tools.TestCLI.testGetJob

Error Message:
null

Stack Trace:
java.lang.AssertionError: null
	at org.junit.Assert.fail(Assert.java:86)
	at org.junit.Assert.assertTrue(Assert.java:41)
	at org.junit.Assert.assertTrue(Assert.java:52)
	at org.apache.hadoop.mapreduce.tools.TestCLI.testGetJob(TestCLI.java:181)




Hadoop-Mapreduce-trunk-Java8 - Build # 1411 - Still Failing

Posted by Apache Jenkins Server <je...@builds.apache.org>.
See https://builds.apache.org/job/Hadoop-Mapreduce-trunk-Java8/1411/

###################################################################################
########################## LAST 60 LINES OF THE CONSOLE ###########################
[...truncated 8383 lines...]
Running org.apache.hadoop.mapred.TestFileInputFormat
Tests run: 12, Failures: 0, Errors: 0, Skipped: 0, Time elapsed: 1.79 sec - in org.apache.hadoop.mapred.TestFileInputFormat
Running org.apache.hadoop.mapred.TestJobEndNotifier
Tests run: 3, Failures: 0, Errors: 0, Skipped: 0, Time elapsed: 2.881 sec - in org.apache.hadoop.mapred.TestJobEndNotifier
Running org.apache.hadoop.mapred.TestOldMethodsJobID
Tests run: 6, Failures: 0, Errors: 0, Skipped: 0, Time elapsed: 0.276 sec - in org.apache.hadoop.mapred.TestOldMethodsJobID
Running org.apache.hadoop.mapred.TestJobQueueClient
Tests run: 1, Failures: 0, Errors: 0, Skipped: 0, Time elapsed: 0.104 sec - in org.apache.hadoop.mapred.TestJobQueueClient
Running org.apache.hadoop.mapred.TestJobConf
Tests run: 12, Failures: 0, Errors: 0, Skipped: 0, Time elapsed: 1.439 sec - in org.apache.hadoop.mapred.TestJobConf

Results :

Failed tests: 
  TestCLI.testGetJob:181 null

Tests run: 244, Failures: 1, Errors: 0, Skipped: 0

[INFO] ------------------------------------------------------------------------
[INFO] Reactor Summary:
[INFO] 
[INFO] Apache Hadoop MapReduce Client .................... SUCCESS [  2.174 s]
[INFO] Apache Hadoop MapReduce Core ...................... FAILURE [01:36 min]
[INFO] Apache Hadoop MapReduce Common .................... SKIPPED
[INFO] Apache Hadoop MapReduce Shuffle ................... SKIPPED
[INFO] Apache Hadoop MapReduce App ....................... SKIPPED
[INFO] Apache Hadoop MapReduce HistoryServer ............. SKIPPED
[INFO] Apache Hadoop MapReduce JobClient ................. SKIPPED
[INFO] Apache Hadoop MapReduce HistoryServer Plugins ..... SKIPPED
[INFO] Apache Hadoop MapReduce NativeTask ................ SKIPPED
[INFO] Apache Hadoop MapReduce Examples .................. SKIPPED
[INFO] Apache Hadoop MapReduce ........................... SKIPPED
[INFO] ------------------------------------------------------------------------
[INFO] BUILD FAILURE
[INFO] ------------------------------------------------------------------------
[INFO] Total time: 01:39 min
[INFO] Finished at: 2016-05-17T07:21:10+00:00
[INFO] Final Memory: 32M/185M
[INFO] ------------------------------------------------------------------------
[WARNING] The requested profile "parallel-tests" could not be activated because it does not exist.
[ERROR] Failed to execute goal org.apache.maven.plugins:maven-surefire-plugin:2.17:test (default-test) on project hadoop-mapreduce-client-core: There are test failures.
[ERROR] 
[ERROR] Please refer to /home/jenkins/jenkins-slave/workspace/Hadoop-Mapreduce-trunk-Java8/hadoop-mapreduce-project/hadoop-mapreduce-client/hadoop-mapreduce-client-core/target/surefire-reports for the individual test results.
[ERROR] -> [Help 1]
[ERROR] 
[ERROR] To see the full stack trace of the errors, re-run Maven with the -e switch.
[ERROR] Re-run Maven using the -X switch to enable full debug logging.
[ERROR] 
[ERROR] For more information about the errors and possible solutions, please read the following articles:
[ERROR] [Help 1] http://cwiki.apache.org/confluence/display/MAVEN/MojoFailureException
[ERROR] 
[ERROR] After correcting the problems, you can resume the build with the command
[ERROR]   mvn <goals> -rf :hadoop-mapreduce-client-core
Build step 'Execute shell' marked build as failure
[FINDBUGS] Skipping publisher since build result is FAILURE
Archiving artifacts
Recording test results
Email was triggered for: Failure - Any
Sending email for trigger: Failure - Any



###################################################################################
############################## FAILED TESTS (if any) ##############################
1 tests failed.
FAILED:  org.apache.hadoop.mapreduce.tools.TestCLI.testGetJob

Error Message:
null

Stack Trace:
java.lang.AssertionError: null
	at org.junit.Assert.fail(Assert.java:86)
	at org.junit.Assert.assertTrue(Assert.java:41)
	at org.junit.Assert.assertTrue(Assert.java:52)
	at org.apache.hadoop.mapreduce.tools.TestCLI.testGetJob(TestCLI.java:181)




Hadoop-Mapreduce-trunk-Java8 - Build # 1410 - Still Failing

Posted by Apache Jenkins Server <je...@builds.apache.org>.
See https://builds.apache.org/job/Hadoop-Mapreduce-trunk-Java8/1410/

###################################################################################
########################## LAST 60 LINES OF THE CONSOLE ###########################
[...truncated 9196 lines...]
Running org.apache.hadoop.mapred.TestMiniMRDFSCaching
Tests run: 1, Failures: 0, Errors: 0, Skipped: 1, Time elapsed: 0.039 sec - in org.apache.hadoop.mapred.TestMiniMRDFSCaching
Running org.apache.hadoop.hdfs.TestNNBench
Tests run: 2, Failures: 0, Errors: 0, Skipped: 0, Time elapsed: 16.075 sec - in org.apache.hadoop.hdfs.TestNNBench
Running org.apache.hadoop.io.TestSequenceFileMergeProgress
Tests run: 3, Failures: 0, Errors: 0, Skipped: 0, Time elapsed: 1.828 sec - in org.apache.hadoop.io.TestSequenceFileMergeProgress
Running org.apache.hadoop.conf.TestNoDefaultsJobConf
Tests run: 1, Failures: 0, Errors: 0, Skipped: 0, Time elapsed: 22.881 sec - in org.apache.hadoop.conf.TestNoDefaultsJobConf

Results :

Failed tests: 
  TestMRCJCFileOutputCommitter.testAbort:153 Output directory not empty expected:<0> but was:<4>
  TestMiniMRChildTask.testTaskEnv:472->runTestTaskEnv:550 The environment checker job failed.
  TestMiniMRChildTask.testTaskOldEnv:496->runTestTaskEnv:550 The environment checker job failed.

Tests run: 533, Failures: 3, Errors: 0, Skipped: 11

[INFO] ------------------------------------------------------------------------
[INFO] Reactor Summary:
[INFO] 
[INFO] Apache Hadoop MapReduce Client .................... SUCCESS [  2.167 s]
[INFO] Apache Hadoop MapReduce Core ...................... SUCCESS [01:36 min]
[INFO] Apache Hadoop MapReduce Common .................... SUCCESS [ 24.764 s]
[INFO] Apache Hadoop MapReduce Shuffle ................... SUCCESS [  4.316 s]
[INFO] Apache Hadoop MapReduce App ....................... SUCCESS [10:03 min]
[INFO] Apache Hadoop MapReduce HistoryServer ............. SUCCESS [06:20 min]
[INFO] Apache Hadoop MapReduce JobClient ................. FAILURE [  01:42 h]
[INFO] Apache Hadoop MapReduce HistoryServer Plugins ..... SKIPPED
[INFO] Apache Hadoop MapReduce NativeTask ................ SKIPPED
[INFO] Apache Hadoop MapReduce Examples .................. SKIPPED
[INFO] Apache Hadoop MapReduce ........................... SKIPPED
[INFO] ------------------------------------------------------------------------
[INFO] BUILD FAILURE
[INFO] ------------------------------------------------------------------------
[INFO] Total time: 02:00 h
[INFO] Finished at: 2016-05-17T06:20:42+00:00
[INFO] Final Memory: 34M/147M
[INFO] ------------------------------------------------------------------------
[WARNING] The requested profile "parallel-tests" could not be activated because it does not exist.
[ERROR] Failed to execute goal org.apache.maven.plugins:maven-surefire-plugin:2.17:test (default-test) on project hadoop-mapreduce-client-jobclient: There are test failures.
[ERROR] 
[ERROR] Please refer to /home/jenkins/jenkins-slave/workspace/Hadoop-Mapreduce-trunk-Java8/hadoop-mapreduce-project/hadoop-mapreduce-client/hadoop-mapreduce-client-jobclient/target/surefire-reports for the individual test results.
[ERROR] -> [Help 1]
[ERROR] 
[ERROR] To see the full stack trace of the errors, re-run Maven with the -e switch.
[ERROR] Re-run Maven using the -X switch to enable full debug logging.
[ERROR] 
[ERROR] For more information about the errors and possible solutions, please read the following articles:
[ERROR] [Help 1] http://cwiki.apache.org/confluence/display/MAVEN/MojoFailureException
[ERROR] 
[ERROR] After correcting the problems, you can resume the build with the command
[ERROR]   mvn <goals> -rf :hadoop-mapreduce-client-jobclient
Build step 'Execute shell' marked build as failure
[FINDBUGS] Skipping publisher since build result is FAILURE
Archiving artifacts
Recording test results
Email was triggered for: Failure - Any
Sending email for trigger: Failure - Any



###################################################################################
############################## FAILED TESTS (if any) ##############################
3 tests failed.
FAILED:  org.apache.hadoop.mapred.TestMRCJCFileOutputCommitter.testAbort

Error Message:
Output directory not empty expected:<0> but was:<4>

Stack Trace:
java.lang.AssertionError: Output directory not empty expected:<0> but was:<4>
	at org.junit.Assert.fail(Assert.java:88)
	at org.junit.Assert.failNotEquals(Assert.java:743)
	at org.junit.Assert.assertEquals(Assert.java:118)
	at org.junit.Assert.assertEquals(Assert.java:555)
	at org.apache.hadoop.mapred.TestMRCJCFileOutputCommitter.testAbort(TestMRCJCFileOutputCommitter.java:153)


FAILED:  org.apache.hadoop.mapred.TestMiniMRChildTask.testTaskEnv

Error Message:
The environment checker job failed.

Stack Trace:
java.lang.AssertionError: The environment checker job failed.
	at org.junit.Assert.fail(Assert.java:88)
	at org.junit.Assert.assertTrue(Assert.java:41)
	at org.apache.hadoop.mapred.TestMiniMRChildTask.runTestTaskEnv(TestMiniMRChildTask.java:550)
	at org.apache.hadoop.mapred.TestMiniMRChildTask.testTaskEnv(TestMiniMRChildTask.java:472)


FAILED:  org.apache.hadoop.mapred.TestMiniMRChildTask.testTaskOldEnv

Error Message:
The environment checker job failed.

Stack Trace:
java.lang.AssertionError: The environment checker job failed.
	at org.junit.Assert.fail(Assert.java:88)
	at org.junit.Assert.assertTrue(Assert.java:41)
	at org.apache.hadoop.mapred.TestMiniMRChildTask.runTestTaskEnv(TestMiniMRChildTask.java:550)
	at org.apache.hadoop.mapred.TestMiniMRChildTask.testTaskOldEnv(TestMiniMRChildTask.java:496)




Hadoop-Mapreduce-trunk-Java8 - Build # 1409 - Still Failing

Posted by Apache Jenkins Server <je...@builds.apache.org>.
See https://builds.apache.org/job/Hadoop-Mapreduce-trunk-Java8/1409/

###################################################################################
########################## LAST 60 LINES OF THE CONSOLE ###########################
[...truncated 9196 lines...]
Running org.apache.hadoop.mapred.TestMiniMRDFSCaching
Tests run: 1, Failures: 0, Errors: 0, Skipped: 1, Time elapsed: 0.031 sec - in org.apache.hadoop.mapred.TestMiniMRDFSCaching
Running org.apache.hadoop.hdfs.TestNNBench
Tests run: 2, Failures: 0, Errors: 0, Skipped: 0, Time elapsed: 15.688 sec - in org.apache.hadoop.hdfs.TestNNBench
Running org.apache.hadoop.io.TestSequenceFileMergeProgress
Tests run: 3, Failures: 0, Errors: 0, Skipped: 0, Time elapsed: 1.501 sec - in org.apache.hadoop.io.TestSequenceFileMergeProgress
Running org.apache.hadoop.conf.TestNoDefaultsJobConf
Tests run: 1, Failures: 0, Errors: 0, Skipped: 0, Time elapsed: 21.719 sec - in org.apache.hadoop.conf.TestNoDefaultsJobConf

Results :

Failed tests: 
  TestMRCJCFileOutputCommitter.testAbort:153 Output directory not empty expected:<0> but was:<4>
  TestMiniMRChildTask.testTaskEnv:472->runTestTaskEnv:550 The environment checker job failed.
  TestMiniMRChildTask.testTaskOldEnv:496->runTestTaskEnv:550 The environment checker job failed.

Tests run: 533, Failures: 3, Errors: 0, Skipped: 11

[INFO] ------------------------------------------------------------------------
[INFO] Reactor Summary:
[INFO] 
[INFO] Apache Hadoop MapReduce Client .................... SUCCESS [  2.372 s]
[INFO] Apache Hadoop MapReduce Core ...................... SUCCESS [01:37 min]
[INFO] Apache Hadoop MapReduce Common .................... SUCCESS [ 25.048 s]
[INFO] Apache Hadoop MapReduce Shuffle ................... SUCCESS [  4.431 s]
[INFO] Apache Hadoop MapReduce App ....................... SUCCESS [10:13 min]
[INFO] Apache Hadoop MapReduce HistoryServer ............. SUCCESS [06:23 min]
[INFO] Apache Hadoop MapReduce JobClient ................. FAILURE [  01:50 h]
[INFO] Apache Hadoop MapReduce HistoryServer Plugins ..... SKIPPED
[INFO] Apache Hadoop MapReduce NativeTask ................ SKIPPED
[INFO] Apache Hadoop MapReduce Examples .................. SKIPPED
[INFO] Apache Hadoop MapReduce ........................... SKIPPED
[INFO] ------------------------------------------------------------------------
[INFO] BUILD FAILURE
[INFO] ------------------------------------------------------------------------
[INFO] Total time: 02:08 h
[INFO] Finished at: 2016-05-17T04:14:51+00:00
[INFO] Final Memory: 34M/153M
[INFO] ------------------------------------------------------------------------
[WARNING] The requested profile "parallel-tests" could not be activated because it does not exist.
[ERROR] Failed to execute goal org.apache.maven.plugins:maven-surefire-plugin:2.17:test (default-test) on project hadoop-mapreduce-client-jobclient: There are test failures.
[ERROR] 
[ERROR] Please refer to /home/jenkins/jenkins-slave/workspace/Hadoop-Mapreduce-trunk-Java8/hadoop-mapreduce-project/hadoop-mapreduce-client/hadoop-mapreduce-client-jobclient/target/surefire-reports for the individual test results.
[ERROR] -> [Help 1]
[ERROR] 
[ERROR] To see the full stack trace of the errors, re-run Maven with the -e switch.
[ERROR] Re-run Maven using the -X switch to enable full debug logging.
[ERROR] 
[ERROR] For more information about the errors and possible solutions, please read the following articles:
[ERROR] [Help 1] http://cwiki.apache.org/confluence/display/MAVEN/MojoFailureException
[ERROR] 
[ERROR] After correcting the problems, you can resume the build with the command
[ERROR]   mvn <goals> -rf :hadoop-mapreduce-client-jobclient
Build step 'Execute shell' marked build as failure
[FINDBUGS] Skipping publisher since build result is FAILURE
Archiving artifacts
Recording test results
Email was triggered for: Failure - Any
Sending email for trigger: Failure - Any



###################################################################################
############################## FAILED TESTS (if any) ##############################
3 tests failed.
FAILED:  org.apache.hadoop.mapred.TestMRCJCFileOutputCommitter.testAbort

Error Message:
Output directory not empty expected:<0> but was:<4>

Stack Trace:
java.lang.AssertionError: Output directory not empty expected:<0> but was:<4>
	at org.junit.Assert.fail(Assert.java:88)
	at org.junit.Assert.failNotEquals(Assert.java:743)
	at org.junit.Assert.assertEquals(Assert.java:118)
	at org.junit.Assert.assertEquals(Assert.java:555)
	at org.apache.hadoop.mapred.TestMRCJCFileOutputCommitter.testAbort(TestMRCJCFileOutputCommitter.java:153)


FAILED:  org.apache.hadoop.mapred.TestMiniMRChildTask.testTaskEnv

Error Message:
The environment checker job failed.

Stack Trace:
java.lang.AssertionError: The environment checker job failed.
	at org.junit.Assert.fail(Assert.java:88)
	at org.junit.Assert.assertTrue(Assert.java:41)
	at org.apache.hadoop.mapred.TestMiniMRChildTask.runTestTaskEnv(TestMiniMRChildTask.java:550)
	at org.apache.hadoop.mapred.TestMiniMRChildTask.testTaskEnv(TestMiniMRChildTask.java:472)


FAILED:  org.apache.hadoop.mapred.TestMiniMRChildTask.testTaskOldEnv

Error Message:
The environment checker job failed.

Stack Trace:
java.lang.AssertionError: The environment checker job failed.
	at org.junit.Assert.fail(Assert.java:88)
	at org.junit.Assert.assertTrue(Assert.java:41)
	at org.apache.hadoop.mapred.TestMiniMRChildTask.runTestTaskEnv(TestMiniMRChildTask.java:550)
	at org.apache.hadoop.mapred.TestMiniMRChildTask.testTaskOldEnv(TestMiniMRChildTask.java:496)




Hadoop-Mapreduce-trunk-Java8 - Build # 1408 - Still Failing

Posted by Apache Jenkins Server <je...@builds.apache.org>.
See https://builds.apache.org/job/Hadoop-Mapreduce-trunk-Java8/1408/

###################################################################################
########################## LAST 60 LINES OF THE CONSOLE ###########################
[...truncated 9276 lines...]
Running org.apache.hadoop.mapred.TestSequenceFileAsBinaryOutputFormat
Tests run: 3, Failures: 0, Errors: 0, Skipped: 0, Time elapsed: 1.65 sec - in org.apache.hadoop.mapred.TestSequenceFileAsBinaryOutputFormat

Results :

Failed tests: 
  TestMiniMRChildTask.testTaskEnv:472->runTestTaskEnv:550 The environment checker job failed.
  TestMiniMRChildTask.testTaskOldEnv:496->runTestTaskEnv:550 The environment checker job failed.

Tests in error: 
  TestJobOutputCommitter.tearDown:72->HadoopTestCase.tearDown:170 » NoClassDefFound
  TestJobOutputCommitter.setUp:64->HadoopTestCase.setUp:156 » YarnRuntime could ...
  TestJobOutputCommitter.tearDown:71 NullPointer
  TestJobOutputCommitter.setUp:64->HadoopTestCase.setUp:156 » YarnRuntime could ...
  TestJobOutputCommitter.tearDown:71 NullPointer

Tests run: 535, Failures: 2, Errors: 5, Skipped: 11

[INFO] ------------------------------------------------------------------------
[INFO] Reactor Summary:
[INFO] 
[INFO] Apache Hadoop MapReduce Client .................... SUCCESS [  2.223 s]
[INFO] Apache Hadoop MapReduce Core ...................... SUCCESS [01:39 min]
[INFO] Apache Hadoop MapReduce Common .................... SUCCESS [ 24.883 s]
[INFO] Apache Hadoop MapReduce Shuffle ................... SUCCESS [  4.285 s]
[INFO] Apache Hadoop MapReduce App ....................... SUCCESS [10:07 min]
[INFO] Apache Hadoop MapReduce HistoryServer ............. SUCCESS [06:18 min]
[INFO] Apache Hadoop MapReduce JobClient ................. FAILURE [  01:45 h]
[INFO] Apache Hadoop MapReduce HistoryServer Plugins ..... SKIPPED
[INFO] Apache Hadoop MapReduce NativeTask ................ SKIPPED
[INFO] Apache Hadoop MapReduce Examples .................. SKIPPED
[INFO] Apache Hadoop MapReduce ........................... SKIPPED
[INFO] ------------------------------------------------------------------------
[INFO] BUILD FAILURE
[INFO] ------------------------------------------------------------------------
[INFO] Total time: 02:03 h
[INFO] Finished at: 2016-05-17T02:00:41+00:00
[INFO] Final Memory: 34M/138M
[INFO] ------------------------------------------------------------------------
[WARNING] The requested profile "parallel-tests" could not be activated because it does not exist.
[ERROR] Failed to execute goal org.apache.maven.plugins:maven-surefire-plugin:2.17:test (default-test) on project hadoop-mapreduce-client-jobclient: There are test failures.
[ERROR] 
[ERROR] Please refer to /home/jenkins/jenkins-slave/workspace/Hadoop-Mapreduce-trunk-Java8/hadoop-mapreduce-project/hadoop-mapreduce-client/hadoop-mapreduce-client-jobclient/target/surefire-reports for the individual test results.
[ERROR] -> [Help 1]
[ERROR] 
[ERROR] To see the full stack trace of the errors, re-run Maven with the -e switch.
[ERROR] Re-run Maven using the -X switch to enable full debug logging.
[ERROR] 
[ERROR] For more information about the errors and possible solutions, please read the following articles:
[ERROR] [Help 1] http://cwiki.apache.org/confluence/display/MAVEN/MojoFailureException
[ERROR] 
[ERROR] After correcting the problems, you can resume the build with the command
[ERROR]   mvn <goals> -rf :hadoop-mapreduce-client-jobclient
Build step 'Execute shell' marked build as failure
[FINDBUGS] Skipping publisher since build result is FAILURE
Archiving artifacts
Recording test results
Email was triggered for: Failure - Any
Sending email for trigger: Failure - Any



###################################################################################
############################## FAILED TESTS (if any) ##############################
7 tests failed.
FAILED:  org.apache.hadoop.mapreduce.lib.output.TestJobOutputCommitter.testCustomCleanup

Error Message:
org/apache/hadoop/service/ServiceOperations

Stack Trace:
java.lang.NoClassDefFoundError: org/apache/hadoop/service/ServiceOperations
	at java.net.URLClassLoader$1.run(URLClassLoader.java:372)
	at java.net.URLClassLoader$1.run(URLClassLoader.java:361)
	at java.security.AccessController.doPrivileged(Native Method)
	at java.net.URLClassLoader.findClass(URLClassLoader.java:360)
	at java.lang.ClassLoader.loadClass(ClassLoader.java:424)
	at sun.misc.Launcher$AppClassLoader.loadClass(Launcher.java:308)
	at java.lang.ClassLoader.loadClass(ClassLoader.java:357)
	at org.apache.hadoop.service.CompositeService.stop(CompositeService.java:157)
	at org.apache.hadoop.service.CompositeService.serviceStop(CompositeService.java:131)
	at org.apache.hadoop.service.AbstractService.stop(AbstractService.java:221)
	at org.apache.hadoop.mapred.MiniMRYarnClusterAdapter.stop(MiniMRYarnClusterAdapter.java:55)
	at org.apache.hadoop.mapred.MiniMRCluster.shutdown(MiniMRCluster.java:267)
	at org.apache.hadoop.mapred.HadoopTestCase.tearDown(HadoopTestCase.java:170)
	at org.apache.hadoop.mapreduce.lib.output.TestJobOutputCommitter.tearDown(TestJobOutputCommitter.java:72)


FAILED:  org.apache.hadoop.mapreduce.lib.output.TestJobOutputCommitter.testDefaultCleanupAndAbort

Error Message:
could not cleanup test dir: org.apache.hadoop.fs.UnsupportedFileSystemException: fs.AbstractFileSystem.file.impl=null: No AbstractFileSystem configured for scheme: file

Stack Trace:
org.apache.hadoop.yarn.exceptions.YarnRuntimeException: could not cleanup test dir: org.apache.hadoop.fs.UnsupportedFileSystemException: fs.AbstractFileSystem.file.impl=null: No AbstractFileSystem configured for scheme: file
	at org.apache.hadoop.fs.AbstractFileSystem.createFileSystem(AbstractFileSystem.java:161)
	at org.apache.hadoop.fs.AbstractFileSystem.get(AbstractFileSystem.java:250)
	at org.apache.hadoop.fs.FileContext$2.run(FileContext.java:332)
	at org.apache.hadoop.fs.FileContext$2.run(FileContext.java:329)
	at java.security.AccessController.doPrivileged(Native Method)
	at javax.security.auth.Subject.doAs(Subject.java:422)
	at org.apache.hadoop.security.UserGroupInformation.doAs(UserGroupInformation.java:1755)
	at org.apache.hadoop.fs.FileContext.getAbstractFileSystem(FileContext.java:329)
	at org.apache.hadoop.fs.FileContext.getFileContext(FileContext.java:446)
	at org.apache.hadoop.fs.FileContext.getFileContext(FileContext.java:423)
	at org.apache.hadoop.fs.FileContext.getLocalFSFileContext(FileContext.java:409)
	at org.apache.hadoop.yarn.server.MiniYARNCluster.<init>(MiniYARNCluster.java:161)
	at org.apache.hadoop.mapreduce.v2.MiniMRYarnCluster.<init>(MiniMRYarnCluster.java:79)
	at org.apache.hadoop.mapreduce.v2.MiniMRYarnCluster.<init>(MiniMRYarnCluster.java:75)
	at org.apache.hadoop.mapred.MiniMRClientClusterFactory.create(MiniMRClientClusterFactory.java:73)
	at org.apache.hadoop.mapred.MiniMRCluster.<init>(MiniMRCluster.java:187)
	at org.apache.hadoop.mapred.MiniMRCluster.<init>(MiniMRCluster.java:175)
	at org.apache.hadoop.mapred.MiniMRCluster.<init>(MiniMRCluster.java:167)
	at org.apache.hadoop.mapred.MiniMRCluster.<init>(MiniMRCluster.java:159)
	at org.apache.hadoop.mapred.MiniMRCluster.<init>(MiniMRCluster.java:152)
	at org.apache.hadoop.mapred.MiniMRCluster.<init>(MiniMRCluster.java:145)
	at org.apache.hadoop.mapred.MiniMRCluster.<init>(MiniMRCluster.java:138)
	at org.apache.hadoop.mapred.MiniMRCluster.<init>(MiniMRCluster.java:133)
	at org.apache.hadoop.mapred.HadoopTestCase.setUp(HadoopTestCase.java:156)
	at org.apache.hadoop.mapreduce.lib.output.TestJobOutputCommitter.setUp(TestJobOutputCommitter.java:64)


FAILED:  org.apache.hadoop.mapreduce.lib.output.TestJobOutputCommitter.testDefaultCleanupAndAbort

Error Message:
null

Stack Trace:
java.lang.NullPointerException: null
	at org.apache.hadoop.mapreduce.lib.output.TestJobOutputCommitter.tearDown(TestJobOutputCommitter.java:71)


FAILED:  org.apache.hadoop.mapreduce.lib.output.TestJobOutputCommitter.testCustomAbort

Error Message:
could not cleanup test dir: org.apache.hadoop.fs.UnsupportedFileSystemException: fs.AbstractFileSystem.file.impl=null: No AbstractFileSystem configured for scheme: file

Stack Trace:
org.apache.hadoop.yarn.exceptions.YarnRuntimeException: could not cleanup test dir: org.apache.hadoop.fs.UnsupportedFileSystemException: fs.AbstractFileSystem.file.impl=null: No AbstractFileSystem configured for scheme: file
	at org.apache.hadoop.fs.AbstractFileSystem.createFileSystem(AbstractFileSystem.java:161)
	at org.apache.hadoop.fs.AbstractFileSystem.get(AbstractFileSystem.java:250)
	at org.apache.hadoop.fs.FileContext$2.run(FileContext.java:332)
	at org.apache.hadoop.fs.FileContext$2.run(FileContext.java:329)
	at java.security.AccessController.doPrivileged(Native Method)
	at javax.security.auth.Subject.doAs(Subject.java:422)
	at org.apache.hadoop.security.UserGroupInformation.doAs(UserGroupInformation.java:1755)
	at org.apache.hadoop.fs.FileContext.getAbstractFileSystem(FileContext.java:329)
	at org.apache.hadoop.fs.FileContext.getFileContext(FileContext.java:446)
	at org.apache.hadoop.fs.FileContext.getFileContext(FileContext.java:423)
	at org.apache.hadoop.fs.FileContext.getLocalFSFileContext(FileContext.java:409)
	at org.apache.hadoop.yarn.server.MiniYARNCluster.<init>(MiniYARNCluster.java:161)
	at org.apache.hadoop.mapreduce.v2.MiniMRYarnCluster.<init>(MiniMRYarnCluster.java:79)
	at org.apache.hadoop.mapreduce.v2.MiniMRYarnCluster.<init>(MiniMRYarnCluster.java:75)
	at org.apache.hadoop.mapred.MiniMRClientClusterFactory.create(MiniMRClientClusterFactory.java:73)
	at org.apache.hadoop.mapred.MiniMRCluster.<init>(MiniMRCluster.java:187)
	at org.apache.hadoop.mapred.MiniMRCluster.<init>(MiniMRCluster.java:175)
	at org.apache.hadoop.mapred.MiniMRCluster.<init>(MiniMRCluster.java:167)
	at org.apache.hadoop.mapred.MiniMRCluster.<init>(MiniMRCluster.java:159)
	at org.apache.hadoop.mapred.MiniMRCluster.<init>(MiniMRCluster.java:152)
	at org.apache.hadoop.mapred.MiniMRCluster.<init>(MiniMRCluster.java:145)
	at org.apache.hadoop.mapred.MiniMRCluster.<init>(MiniMRCluster.java:138)
	at org.apache.hadoop.mapred.MiniMRCluster.<init>(MiniMRCluster.java:133)
	at org.apache.hadoop.mapred.HadoopTestCase.setUp(HadoopTestCase.java:156)
	at org.apache.hadoop.mapreduce.lib.output.TestJobOutputCommitter.setUp(TestJobOutputCommitter.java:64)


FAILED:  org.apache.hadoop.mapreduce.lib.output.TestJobOutputCommitter.testCustomAbort

Error Message:
null

Stack Trace:
java.lang.NullPointerException: null
	at org.apache.hadoop.mapreduce.lib.output.TestJobOutputCommitter.tearDown(TestJobOutputCommitter.java:71)


FAILED:  org.apache.hadoop.mapred.TestMiniMRChildTask.testTaskEnv

Error Message:
The environment checker job failed.

Stack Trace:
java.lang.AssertionError: The environment checker job failed.
	at org.junit.Assert.fail(Assert.java:88)
	at org.junit.Assert.assertTrue(Assert.java:41)
	at org.apache.hadoop.mapred.TestMiniMRChildTask.runTestTaskEnv(TestMiniMRChildTask.java:550)
	at org.apache.hadoop.mapred.TestMiniMRChildTask.testTaskEnv(TestMiniMRChildTask.java:472)


FAILED:  org.apache.hadoop.mapred.TestMiniMRChildTask.testTaskOldEnv

Error Message:
The environment checker job failed.

Stack Trace:
java.lang.AssertionError: The environment checker job failed.
	at org.junit.Assert.fail(Assert.java:88)
	at org.junit.Assert.assertTrue(Assert.java:41)
	at org.apache.hadoop.mapred.TestMiniMRChildTask.runTestTaskEnv(TestMiniMRChildTask.java:550)
	at org.apache.hadoop.mapred.TestMiniMRChildTask.testTaskOldEnv(TestMiniMRChildTask.java:496)




Hadoop-Mapreduce-trunk-Java8 - Build # 1407 - Still Failing

Posted by Apache Jenkins Server <je...@builds.apache.org>.
See https://builds.apache.org/job/Hadoop-Mapreduce-trunk-Java8/1407/

###################################################################################
########################## LAST 60 LINES OF THE CONSOLE ###########################
[...truncated 9505 lines...]
Java HotSpot(TM) 64-Bit Server VM warning: ignoring option MaxPermSize=768m; support was removed in 8.0
Running org.apache.hadoop.mapred.TestReduceFetchFromPartialMem
Tests run: 1, Failures: 0, Errors: 0, Skipped: 0, Time elapsed: 72.525 sec - in org.apache.hadoop.mapred.TestReduceFetchFromPartialMem
Java HotSpot(TM) 64-Bit Server VM warning: ignoring option MaxPermSize=768m; support was removed in 8.0
Running org.apache.hadoop.mapred.TestSpecialCharactersInOutputPath
Tests run: 1, Failures: 0, Errors: 0, Skipped: 0, Time elapsed: 23.143 sec - in org.apache.hadoop.mapred.TestSpecialCharactersInOutputPath
Java HotSpot(TM) 64-Bit Server VM warning: ignoring option MaxPermSize=768m; support was removed in 8.0
Running org.apache.hadoop.mapred.TestSequenceFileAsBinaryOutputFormat
Tests run: 3, Failures: 0, Errors: 0, Skipped: 0, Time elapsed: 1.424 sec - in org.apache.hadoop.mapred.TestSequenceFileAsBinaryOutputFormat

Results :

Failed tests: 
  TestMiniMRChildTask.testTaskEnv:472->runTestTaskEnv:550 The environment checker job failed.
  TestMiniMRChildTask.testTaskOldEnv:496->runTestTaskEnv:550 The environment checker job failed.

Tests run: 533, Failures: 2, Errors: 0, Skipped: 11

[INFO] ------------------------------------------------------------------------
[INFO] Reactor Summary:
[INFO] 
[INFO] Apache Hadoop MapReduce Client .................... SUCCESS [  2.181 s]
[INFO] Apache Hadoop MapReduce Core ...................... SUCCESS [01:39 min]
[INFO] Apache Hadoop MapReduce Common .................... SUCCESS [ 25.416 s]
[INFO] Apache Hadoop MapReduce Shuffle ................... SUCCESS [  4.229 s]
[INFO] Apache Hadoop MapReduce App ....................... SUCCESS [10:11 min]
[INFO] Apache Hadoop MapReduce HistoryServer ............. SUCCESS [06:23 min]
[INFO] Apache Hadoop MapReduce JobClient ................. FAILURE [  01:43 h]
[INFO] Apache Hadoop MapReduce HistoryServer Plugins ..... SKIPPED
[INFO] Apache Hadoop MapReduce NativeTask ................ SKIPPED
[INFO] Apache Hadoop MapReduce Examples .................. SKIPPED
[INFO] Apache Hadoop MapReduce ........................... SKIPPED
[INFO] ------------------------------------------------------------------------
[INFO] BUILD FAILURE
[INFO] ------------------------------------------------------------------------
[INFO] Total time: 02:01 h
[INFO] Finished at: 2016-05-16T23:51:50+00:00
[INFO] Final Memory: 34M/144M
[INFO] ------------------------------------------------------------------------
[WARNING] The requested profile "parallel-tests" could not be activated because it does not exist.
[ERROR] Failed to execute goal org.apache.maven.plugins:maven-surefire-plugin:2.17:test (default-test) on project hadoop-mapreduce-client-jobclient: There are test failures.
[ERROR] 
[ERROR] Please refer to /home/jenkins/jenkins-slave/workspace/Hadoop-Mapreduce-trunk-Java8/hadoop-mapreduce-project/hadoop-mapreduce-client/hadoop-mapreduce-client-jobclient/target/surefire-reports for the individual test results.
[ERROR] -> [Help 1]
[ERROR] 
[ERROR] To see the full stack trace of the errors, re-run Maven with the -e switch.
[ERROR] Re-run Maven using the -X switch to enable full debug logging.
[ERROR] 
[ERROR] For more information about the errors and possible solutions, please read the following articles:
[ERROR] [Help 1] http://cwiki.apache.org/confluence/display/MAVEN/MojoFailureException
[ERROR] 
[ERROR] After correcting the problems, you can resume the build with the command
[ERROR]   mvn <goals> -rf :hadoop-mapreduce-client-jobclient
Build step 'Execute shell' marked build as failure
[FINDBUGS] Skipping publisher since build result is FAILURE
Archiving artifacts
Recording test results
Email was triggered for: Failure - Any
Sending email for trigger: Failure - Any



###################################################################################
############################## FAILED TESTS (if any) ##############################
2 tests failed.
FAILED:  org.apache.hadoop.mapred.TestMiniMRChildTask.testTaskEnv

Error Message:
The environment checker job failed.

Stack Trace:
java.lang.AssertionError: The environment checker job failed.
	at org.junit.Assert.fail(Assert.java:88)
	at org.junit.Assert.assertTrue(Assert.java:41)
	at org.apache.hadoop.mapred.TestMiniMRChildTask.runTestTaskEnv(TestMiniMRChildTask.java:550)
	at org.apache.hadoop.mapred.TestMiniMRChildTask.testTaskEnv(TestMiniMRChildTask.java:472)


FAILED:  org.apache.hadoop.mapred.TestMiniMRChildTask.testTaskOldEnv

Error Message:
The environment checker job failed.

Stack Trace:
java.lang.AssertionError: The environment checker job failed.
	at org.junit.Assert.fail(Assert.java:88)
	at org.junit.Assert.assertTrue(Assert.java:41)
	at org.apache.hadoop.mapred.TestMiniMRChildTask.runTestTaskEnv(TestMiniMRChildTask.java:550)
	at org.apache.hadoop.mapred.TestMiniMRChildTask.testTaskOldEnv(TestMiniMRChildTask.java:496)




Hadoop-Mapreduce-trunk-Java8 - Build # 1406 - Still Failing

Posted by Apache Jenkins Server <je...@builds.apache.org>.
See https://builds.apache.org/job/Hadoop-Mapreduce-trunk-Java8/1406/

###################################################################################
########################## LAST 60 LINES OF THE CONSOLE ###########################
[...truncated 9518 lines...]
Tests run: 5, Failures: 0, Errors: 0, Skipped: 0, Time elapsed: 5.323 sec - in org.apache.hadoop.mapred.pipes.TestPipeApplication
Java HotSpot(TM) 64-Bit Server VM warning: ignoring option MaxPermSize=768m; support was removed in 8.0
Running org.apache.hadoop.mapred.pipes.TestPipes
Tests run: 1, Failures: 0, Errors: 0, Skipped: 1, Time elapsed: 0.029 sec - in org.apache.hadoop.mapred.pipes.TestPipes
Java HotSpot(TM) 64-Bit Server VM warning: ignoring option MaxPermSize=768m; support was removed in 8.0
Running org.apache.hadoop.mapred.TestSpecialCharactersInOutputPath
Tests run: 1, Failures: 0, Errors: 0, Skipped: 0, Time elapsed: 25.548 sec - in org.apache.hadoop.mapred.TestSpecialCharactersInOutputPath
Java HotSpot(TM) 64-Bit Server VM warning: ignoring option MaxPermSize=768m; support was removed in 8.0
Running org.apache.hadoop.mapred.TestReporter
Tests run: 3, Failures: 0, Errors: 0, Skipped: 0, Time elapsed: 13.736 sec - in org.apache.hadoop.mapred.TestReporter

Results :

Failed tests: 
  TestMiniMRChildTask.testTaskEnv:472->runTestTaskEnv:550 The environment checker job failed.
  TestMiniMRChildTask.testTaskOldEnv:496->runTestTaskEnv:550 The environment checker job failed.

Tests run: 530, Failures: 2, Errors: 0, Skipped: 11

[INFO] ------------------------------------------------------------------------
[INFO] Reactor Summary:
[INFO] 
[INFO] Apache Hadoop MapReduce Client .................... SUCCESS [  2.185 s]
[INFO] Apache Hadoop MapReduce Core ...................... SUCCESS [01:36 min]
[INFO] Apache Hadoop MapReduce Common .................... SUCCESS [ 24.658 s]
[INFO] Apache Hadoop MapReduce Shuffle ................... SUCCESS [  4.296 s]
[INFO] Apache Hadoop MapReduce App ....................... SUCCESS [10:08 min]
[INFO] Apache Hadoop MapReduce HistoryServer ............. SUCCESS [06:27 min]
[INFO] Apache Hadoop MapReduce JobClient ................. FAILURE [  02:04 h]
[INFO] Apache Hadoop MapReduce HistoryServer Plugins ..... SKIPPED
[INFO] Apache Hadoop MapReduce NativeTask ................ SKIPPED
[INFO] Apache Hadoop MapReduce Examples .................. SKIPPED
[INFO] Apache Hadoop MapReduce ........................... SKIPPED
[INFO] ------------------------------------------------------------------------
[INFO] BUILD FAILURE
[INFO] ------------------------------------------------------------------------
[INFO] Total time: 02:22 h
[INFO] Finished at: 2016-05-16T21:42:34+00:00
[INFO] Final Memory: 39M/150M
[INFO] ------------------------------------------------------------------------
[WARNING] The requested profile "parallel-tests" could not be activated because it does not exist.
[ERROR] Failed to execute goal org.apache.maven.plugins:maven-surefire-plugin:2.17:test (default-test) on project hadoop-mapreduce-client-jobclient: ExecutionException: java.lang.RuntimeException: The forked VM terminated without properly saying goodbye. VM crash or System.exit called?
[ERROR] Command was /bin/sh -c cd /home/jenkins/jenkins-slave/workspace/Hadoop-Mapreduce-trunk-Java8/hadoop-mapreduce-project/hadoop-mapreduce-client/hadoop-mapreduce-client-jobclient && /home/jenkins/tools/java/jdk1.8.0/jre/bin/java -Xmx2048m -XX:MaxPermSize=768m -XX:+HeapDumpOnOutOfMemoryError -jar /home/jenkins/jenkins-slave/workspace/Hadoop-Mapreduce-trunk-Java8/hadoop-mapreduce-project/hadoop-mapreduce-client/hadoop-mapreduce-client-jobclient/target/surefire/surefirebooter264982520343454756.jar /home/jenkins/jenkins-slave/workspace/Hadoop-Mapreduce-trunk-Java8/hadoop-mapreduce-project/hadoop-mapreduce-client/hadoop-mapreduce-client-jobclient/target/surefire/surefire4268075182468606055tmp /home/jenkins/jenkins-slave/workspace/Hadoop-Mapreduce-trunk-Java8/hadoop-mapreduce-project/hadoop-mapreduce-client/hadoop-mapreduce-client-jobclient/target/surefire/surefire_2782730037742647121922tmp
[ERROR] -> [Help 1]
[ERROR] 
[ERROR] To see the full stack trace of the errors, re-run Maven with the -e switch.
[ERROR] Re-run Maven using the -X switch to enable full debug logging.
[ERROR] 
[ERROR] For more information about the errors and possible solutions, please read the following articles:
[ERROR] [Help 1] http://cwiki.apache.org/confluence/display/MAVEN/MojoFailureException
[ERROR] 
[ERROR] After correcting the problems, you can resume the build with the command
[ERROR]   mvn <goals> -rf :hadoop-mapreduce-client-jobclient
Build step 'Execute shell' marked build as failure
[FINDBUGS] Skipping publisher since build result is FAILURE
Archiving artifacts
Recording test results
Email was triggered for: Failure - Any
Sending email for trigger: Failure - Any



###################################################################################
############################## FAILED TESTS (if any) ##############################
2 tests failed.
FAILED:  org.apache.hadoop.mapred.TestMiniMRChildTask.testTaskEnv

Error Message:
The environment checker job failed.

Stack Trace:
java.lang.AssertionError: The environment checker job failed.
	at org.junit.Assert.fail(Assert.java:88)
	at org.junit.Assert.assertTrue(Assert.java:41)
	at org.apache.hadoop.mapred.TestMiniMRChildTask.runTestTaskEnv(TestMiniMRChildTask.java:550)
	at org.apache.hadoop.mapred.TestMiniMRChildTask.testTaskEnv(TestMiniMRChildTask.java:472)


FAILED:  org.apache.hadoop.mapred.TestMiniMRChildTask.testTaskOldEnv

Error Message:
The environment checker job failed.

Stack Trace:
java.lang.AssertionError: The environment checker job failed.
	at org.junit.Assert.fail(Assert.java:88)
	at org.junit.Assert.assertTrue(Assert.java:41)
	at org.apache.hadoop.mapred.TestMiniMRChildTask.runTestTaskEnv(TestMiniMRChildTask.java:550)
	at org.apache.hadoop.mapred.TestMiniMRChildTask.testTaskOldEnv(TestMiniMRChildTask.java:496)




Hadoop-Mapreduce-trunk-Java8 - Build # 1405 - Still Failing

Posted by Apache Jenkins Server <je...@builds.apache.org>.
See https://builds.apache.org/job/Hadoop-Mapreduce-trunk-Java8/1405/

###################################################################################
########################## LAST 60 LINES OF THE CONSOLE ###########################
[...truncated 9513 lines...]
Running org.apache.hadoop.hdfs.TestNNBench
Tests run: 2, Failures: 0, Errors: 0, Skipped: 0, Time elapsed: 17.071 sec - in org.apache.hadoop.hdfs.TestNNBench
Java HotSpot(TM) 64-Bit Server VM warning: ignoring option MaxPermSize=768m; support was removed in 8.0
Running org.apache.hadoop.io.TestSequenceFileMergeProgress
Tests run: 3, Failures: 0, Errors: 0, Skipped: 0, Time elapsed: 2.319 sec - in org.apache.hadoop.io.TestSequenceFileMergeProgress
Java HotSpot(TM) 64-Bit Server VM warning: ignoring option MaxPermSize=768m; support was removed in 8.0
Running org.apache.hadoop.conf.TestNoDefaultsJobConf
Tests run: 1, Failures: 0, Errors: 0, Skipped: 0, Time elapsed: 26.283 sec - in org.apache.hadoop.conf.TestNoDefaultsJobConf

Results :

Failed tests: 
  TestMRCJCFileOutputCommitter.testAbort:153 Output directory not empty expected:<0> but was:<4>
  TestMiniMRChildTask.testTaskEnv:472->runTestTaskEnv:550 The environment checker job failed.
  TestMiniMRChildTask.testTaskOldEnv:496->runTestTaskEnv:550 The environment checker job failed.

Tests run: 533, Failures: 3, Errors: 0, Skipped: 11

[INFO] ------------------------------------------------------------------------
[INFO] Reactor Summary:
[INFO] 
[INFO] Apache Hadoop MapReduce Client .................... SUCCESS [  2.373 s]
[INFO] Apache Hadoop MapReduce Core ...................... SUCCESS [01:36 min]
[INFO] Apache Hadoop MapReduce Common .................... SUCCESS [ 24.712 s]
[INFO] Apache Hadoop MapReduce Shuffle ................... SUCCESS [  4.340 s]
[INFO] Apache Hadoop MapReduce App ....................... SUCCESS [10:08 min]
[INFO] Apache Hadoop MapReduce HistoryServer ............. SUCCESS [06:26 min]
[INFO] Apache Hadoop MapReduce JobClient ................. FAILURE [  01:44 h]
[INFO] Apache Hadoop MapReduce HistoryServer Plugins ..... SKIPPED
[INFO] Apache Hadoop MapReduce NativeTask ................ SKIPPED
[INFO] Apache Hadoop MapReduce Examples .................. SKIPPED
[INFO] Apache Hadoop MapReduce ........................... SKIPPED
[INFO] ------------------------------------------------------------------------
[INFO] BUILD FAILURE
[INFO] ------------------------------------------------------------------------
[INFO] Total time: 02:02 h
[INFO] Finished at: 2016-05-16T18:22:01+00:00
[INFO] Final Memory: 34M/157M
[INFO] ------------------------------------------------------------------------
[WARNING] The requested profile "parallel-tests" could not be activated because it does not exist.
[ERROR] Failed to execute goal org.apache.maven.plugins:maven-surefire-plugin:2.17:test (default-test) on project hadoop-mapreduce-client-jobclient: There are test failures.
[ERROR] 
[ERROR] Please refer to /home/jenkins/jenkins-slave/workspace/Hadoop-Mapreduce-trunk-Java8/hadoop-mapreduce-project/hadoop-mapreduce-client/hadoop-mapreduce-client-jobclient/target/surefire-reports for the individual test results.
[ERROR] -> [Help 1]
[ERROR] 
[ERROR] To see the full stack trace of the errors, re-run Maven with the -e switch.
[ERROR] Re-run Maven using the -X switch to enable full debug logging.
[ERROR] 
[ERROR] For more information about the errors and possible solutions, please read the following articles:
[ERROR] [Help 1] http://cwiki.apache.org/confluence/display/MAVEN/MojoFailureException
[ERROR] 
[ERROR] After correcting the problems, you can resume the build with the command
[ERROR]   mvn <goals> -rf :hadoop-mapreduce-client-jobclient
Build step 'Execute shell' marked build as failure
[FINDBUGS] Skipping publisher since build result is FAILURE
Archiving artifacts
Recording test results
Email was triggered for: Failure - Any
Sending email for trigger: Failure - Any



###################################################################################
############################## FAILED TESTS (if any) ##############################
3 tests failed.
FAILED:  org.apache.hadoop.mapred.TestMRCJCFileOutputCommitter.testAbort

Error Message:
Output directory not empty expected:<0> but was:<4>

Stack Trace:
java.lang.AssertionError: Output directory not empty expected:<0> but was:<4>
	at org.junit.Assert.fail(Assert.java:88)
	at org.junit.Assert.failNotEquals(Assert.java:743)
	at org.junit.Assert.assertEquals(Assert.java:118)
	at org.junit.Assert.assertEquals(Assert.java:555)
	at org.apache.hadoop.mapred.TestMRCJCFileOutputCommitter.testAbort(TestMRCJCFileOutputCommitter.java:153)


FAILED:  org.apache.hadoop.mapred.TestMiniMRChildTask.testTaskEnv

Error Message:
The environment checker job failed.

Stack Trace:
java.lang.AssertionError: The environment checker job failed.
	at org.junit.Assert.fail(Assert.java:88)
	at org.junit.Assert.assertTrue(Assert.java:41)
	at org.apache.hadoop.mapred.TestMiniMRChildTask.runTestTaskEnv(TestMiniMRChildTask.java:550)
	at org.apache.hadoop.mapred.TestMiniMRChildTask.testTaskEnv(TestMiniMRChildTask.java:472)


FAILED:  org.apache.hadoop.mapred.TestMiniMRChildTask.testTaskOldEnv

Error Message:
The environment checker job failed.

Stack Trace:
java.lang.AssertionError: The environment checker job failed.
	at org.junit.Assert.fail(Assert.java:88)
	at org.junit.Assert.assertTrue(Assert.java:41)
	at org.apache.hadoop.mapred.TestMiniMRChildTask.runTestTaskEnv(TestMiniMRChildTask.java:550)
	at org.apache.hadoop.mapred.TestMiniMRChildTask.testTaskOldEnv(TestMiniMRChildTask.java:496)




Hadoop-Mapreduce-trunk-Java8 - Build # 1404 - Still Failing

Posted by Apache Jenkins Server <je...@builds.apache.org>.
See https://builds.apache.org/job/Hadoop-Mapreduce-trunk-Java8/1404/

###################################################################################
########################## LAST 60 LINES OF THE CONSOLE ###########################
[...truncated 9515 lines...]
Running org.apache.hadoop.hdfs.TestNNBench
Tests run: 2, Failures: 0, Errors: 0, Skipped: 0, Time elapsed: 17.484 sec - in org.apache.hadoop.hdfs.TestNNBench
Java HotSpot(TM) 64-Bit Server VM warning: ignoring option MaxPermSize=768m; support was removed in 8.0
Running org.apache.hadoop.io.TestSequenceFileMergeProgress
Tests run: 3, Failures: 0, Errors: 0, Skipped: 0, Time elapsed: 1.839 sec - in org.apache.hadoop.io.TestSequenceFileMergeProgress
Java HotSpot(TM) 64-Bit Server VM warning: ignoring option MaxPermSize=768m; support was removed in 8.0
Running org.apache.hadoop.conf.TestNoDefaultsJobConf
Tests run: 1, Failures: 0, Errors: 0, Skipped: 0, Time elapsed: 21.977 sec - in org.apache.hadoop.conf.TestNoDefaultsJobConf

Results :

Failed tests: 
  TestMRCJCFileOutputCommitter.testAbort:153 Output directory not empty expected:<0> but was:<4>
  TestMiniMRChildTask.testTaskEnv:472->runTestTaskEnv:550 The environment checker job failed.
  TestMiniMRChildTask.testTaskOldEnv:496->runTestTaskEnv:550 The environment checker job failed.

Tests run: 533, Failures: 3, Errors: 0, Skipped: 11

[INFO] ------------------------------------------------------------------------
[INFO] Reactor Summary:
[INFO] 
[INFO] Apache Hadoop MapReduce Client .................... SUCCESS [  2.305 s]
[INFO] Apache Hadoop MapReduce Core ...................... SUCCESS [01:36 min]
[INFO] Apache Hadoop MapReduce Common .................... SUCCESS [ 24.732 s]
[INFO] Apache Hadoop MapReduce Shuffle ................... SUCCESS [  4.253 s]
[INFO] Apache Hadoop MapReduce App ....................... SUCCESS [10:04 min]
[INFO] Apache Hadoop MapReduce HistoryServer ............. SUCCESS [06:19 min]
[INFO] Apache Hadoop MapReduce JobClient ................. FAILURE [  01:47 h]
[INFO] Apache Hadoop MapReduce HistoryServer Plugins ..... SKIPPED
[INFO] Apache Hadoop MapReduce NativeTask ................ SKIPPED
[INFO] Apache Hadoop MapReduce Examples .................. SKIPPED
[INFO] Apache Hadoop MapReduce ........................... SKIPPED
[INFO] ------------------------------------------------------------------------
[INFO] BUILD FAILURE
[INFO] ------------------------------------------------------------------------
[INFO] Total time: 02:06 h
[INFO] Finished at: 2016-05-16T10:44:58+00:00
[INFO] Final Memory: 34M/162M
[INFO] ------------------------------------------------------------------------
[WARNING] The requested profile "parallel-tests" could not be activated because it does not exist.
[ERROR] Failed to execute goal org.apache.maven.plugins:maven-surefire-plugin:2.17:test (default-test) on project hadoop-mapreduce-client-jobclient: There are test failures.
[ERROR] 
[ERROR] Please refer to /home/jenkins/jenkins-slave/workspace/Hadoop-Mapreduce-trunk-Java8/hadoop-mapreduce-project/hadoop-mapreduce-client/hadoop-mapreduce-client-jobclient/target/surefire-reports for the individual test results.
[ERROR] -> [Help 1]
[ERROR] 
[ERROR] To see the full stack trace of the errors, re-run Maven with the -e switch.
[ERROR] Re-run Maven using the -X switch to enable full debug logging.
[ERROR] 
[ERROR] For more information about the errors and possible solutions, please read the following articles:
[ERROR] [Help 1] http://cwiki.apache.org/confluence/display/MAVEN/MojoFailureException
[ERROR] 
[ERROR] After correcting the problems, you can resume the build with the command
[ERROR]   mvn <goals> -rf :hadoop-mapreduce-client-jobclient
Build step 'Execute shell' marked build as failure
[FINDBUGS] Skipping publisher since build result is FAILURE
Archiving artifacts
Recording test results
Email was triggered for: Failure - Any
Sending email for trigger: Failure - Any



###################################################################################
############################## FAILED TESTS (if any) ##############################
3 tests failed.
FAILED:  org.apache.hadoop.mapred.TestMRCJCFileOutputCommitter.testAbort

Error Message:
Output directory not empty expected:<0> but was:<4>

Stack Trace:
java.lang.AssertionError: Output directory not empty expected:<0> but was:<4>
	at org.junit.Assert.fail(Assert.java:88)
	at org.junit.Assert.failNotEquals(Assert.java:743)
	at org.junit.Assert.assertEquals(Assert.java:118)
	at org.junit.Assert.assertEquals(Assert.java:555)
	at org.apache.hadoop.mapred.TestMRCJCFileOutputCommitter.testAbort(TestMRCJCFileOutputCommitter.java:153)


FAILED:  org.apache.hadoop.mapred.TestMiniMRChildTask.testTaskEnv

Error Message:
The environment checker job failed.

Stack Trace:
java.lang.AssertionError: The environment checker job failed.
	at org.junit.Assert.fail(Assert.java:88)
	at org.junit.Assert.assertTrue(Assert.java:41)
	at org.apache.hadoop.mapred.TestMiniMRChildTask.runTestTaskEnv(TestMiniMRChildTask.java:550)
	at org.apache.hadoop.mapred.TestMiniMRChildTask.testTaskEnv(TestMiniMRChildTask.java:472)


FAILED:  org.apache.hadoop.mapred.TestMiniMRChildTask.testTaskOldEnv

Error Message:
The environment checker job failed.

Stack Trace:
java.lang.AssertionError: The environment checker job failed.
	at org.junit.Assert.fail(Assert.java:88)
	at org.junit.Assert.assertTrue(Assert.java:41)
	at org.apache.hadoop.mapred.TestMiniMRChildTask.runTestTaskEnv(TestMiniMRChildTask.java:550)
	at org.apache.hadoop.mapred.TestMiniMRChildTask.testTaskOldEnv(TestMiniMRChildTask.java:496)




Hadoop-Mapreduce-trunk-Java8 - Build # 1403 - Still Failing

Posted by Apache Jenkins Server <je...@builds.apache.org>.
See https://builds.apache.org/job/Hadoop-Mapreduce-trunk-Java8/1403/

###################################################################################
########################## LAST 60 LINES OF THE CONSOLE ###########################
[...truncated 9515 lines...]
Running org.apache.hadoop.hdfs.TestNNBench
Tests run: 2, Failures: 0, Errors: 0, Skipped: 0, Time elapsed: 15.657 sec - in org.apache.hadoop.hdfs.TestNNBench
Java HotSpot(TM) 64-Bit Server VM warning: ignoring option MaxPermSize=768m; support was removed in 8.0
Running org.apache.hadoop.io.TestSequenceFileMergeProgress
Tests run: 3, Failures: 0, Errors: 0, Skipped: 0, Time elapsed: 1.509 sec - in org.apache.hadoop.io.TestSequenceFileMergeProgress
Java HotSpot(TM) 64-Bit Server VM warning: ignoring option MaxPermSize=768m; support was removed in 8.0
Running org.apache.hadoop.conf.TestNoDefaultsJobConf
Tests run: 1, Failures: 0, Errors: 0, Skipped: 0, Time elapsed: 21.237 sec - in org.apache.hadoop.conf.TestNoDefaultsJobConf

Results :

Failed tests: 
  TestMRCJCFileOutputCommitter.testAbort:153 Output directory not empty expected:<0> but was:<4>
  TestMiniMRChildTask.testTaskEnv:472->runTestTaskEnv:550 The environment checker job failed.
  TestMiniMRChildTask.testTaskOldEnv:496->runTestTaskEnv:550 The environment checker job failed.

Tests run: 533, Failures: 3, Errors: 0, Skipped: 11

[INFO] ------------------------------------------------------------------------
[INFO] Reactor Summary:
[INFO] 
[INFO] Apache Hadoop MapReduce Client .................... SUCCESS [  2.880 s]
[INFO] Apache Hadoop MapReduce Core ...................... SUCCESS [01:56 min]
[INFO] Apache Hadoop MapReduce Common .................... SUCCESS [ 30.711 s]
[INFO] Apache Hadoop MapReduce Shuffle ................... SUCCESS [  5.994 s]
[INFO] Apache Hadoop MapReduce App ....................... SUCCESS [12:02 min]
[INFO] Apache Hadoop MapReduce HistoryServer ............. SUCCESS [06:42 min]
[INFO] Apache Hadoop MapReduce JobClient ................. FAILURE [  01:51 h]
[INFO] Apache Hadoop MapReduce HistoryServer Plugins ..... SKIPPED
[INFO] Apache Hadoop MapReduce NativeTask ................ SKIPPED
[INFO] Apache Hadoop MapReduce Examples .................. SKIPPED
[INFO] Apache Hadoop MapReduce ........................... SKIPPED
[INFO] ------------------------------------------------------------------------
[INFO] BUILD FAILURE
[INFO] ------------------------------------------------------------------------
[INFO] Total time: 02:13 h
[INFO] Finished at: 2016-05-16T08:33:25+00:00
[INFO] Final Memory: 34M/141M
[INFO] ------------------------------------------------------------------------
[WARNING] The requested profile "parallel-tests" could not be activated because it does not exist.
[ERROR] Failed to execute goal org.apache.maven.plugins:maven-surefire-plugin:2.17:test (default-test) on project hadoop-mapreduce-client-jobclient: There are test failures.
[ERROR] 
[ERROR] Please refer to /home/jenkins/jenkins-slave/workspace/Hadoop-Mapreduce-trunk-Java8/hadoop-mapreduce-project/hadoop-mapreduce-client/hadoop-mapreduce-client-jobclient/target/surefire-reports for the individual test results.
[ERROR] -> [Help 1]
[ERROR] 
[ERROR] To see the full stack trace of the errors, re-run Maven with the -e switch.
[ERROR] Re-run Maven using the -X switch to enable full debug logging.
[ERROR] 
[ERROR] For more information about the errors and possible solutions, please read the following articles:
[ERROR] [Help 1] http://cwiki.apache.org/confluence/display/MAVEN/MojoFailureException
[ERROR] 
[ERROR] After correcting the problems, you can resume the build with the command
[ERROR]   mvn <goals> -rf :hadoop-mapreduce-client-jobclient
Build step 'Execute shell' marked build as failure
[FINDBUGS] Skipping publisher since build result is FAILURE
Archiving artifacts
Recording test results
Email was triggered for: Failure - Any
Sending email for trigger: Failure - Any



###################################################################################
############################## FAILED TESTS (if any) ##############################
3 tests failed.
FAILED:  org.apache.hadoop.mapred.TestMRCJCFileOutputCommitter.testAbort

Error Message:
Output directory not empty expected:<0> but was:<4>

Stack Trace:
java.lang.AssertionError: Output directory not empty expected:<0> but was:<4>
	at org.junit.Assert.fail(Assert.java:88)
	at org.junit.Assert.failNotEquals(Assert.java:743)
	at org.junit.Assert.assertEquals(Assert.java:118)
	at org.junit.Assert.assertEquals(Assert.java:555)
	at org.apache.hadoop.mapred.TestMRCJCFileOutputCommitter.testAbort(TestMRCJCFileOutputCommitter.java:153)


FAILED:  org.apache.hadoop.mapred.TestMiniMRChildTask.testTaskEnv

Error Message:
The environment checker job failed.

Stack Trace:
java.lang.AssertionError: The environment checker job failed.
	at org.junit.Assert.fail(Assert.java:88)
	at org.junit.Assert.assertTrue(Assert.java:41)
	at org.apache.hadoop.mapred.TestMiniMRChildTask.runTestTaskEnv(TestMiniMRChildTask.java:550)
	at org.apache.hadoop.mapred.TestMiniMRChildTask.testTaskEnv(TestMiniMRChildTask.java:472)


FAILED:  org.apache.hadoop.mapred.TestMiniMRChildTask.testTaskOldEnv

Error Message:
The environment checker job failed.

Stack Trace:
java.lang.AssertionError: The environment checker job failed.
	at org.junit.Assert.fail(Assert.java:88)
	at org.junit.Assert.assertTrue(Assert.java:41)
	at org.apache.hadoop.mapred.TestMiniMRChildTask.runTestTaskEnv(TestMiniMRChildTask.java:550)
	at org.apache.hadoop.mapred.TestMiniMRChildTask.testTaskOldEnv(TestMiniMRChildTask.java:496)




Hadoop-Mapreduce-trunk-Java8 - Build # 1402 - Still Failing

Posted by Apache Jenkins Server <je...@builds.apache.org>.
See https://builds.apache.org/job/Hadoop-Mapreduce-trunk-Java8/1402/

###################################################################################
########################## LAST 60 LINES OF THE CONSOLE ###########################
[...truncated 9238 lines...]
Running org.apache.hadoop.mapred.lib.TestDelegatingInputFormat
Tests run: 1, Failures: 0, Errors: 0, Skipped: 0, Time elapsed: 7.47 sec - in org.apache.hadoop.mapred.lib.TestDelegatingInputFormat
Java HotSpot(TM) 64-Bit Server VM warning: ignoring option MaxPermSize=768m; support was removed in 8.0
Running org.apache.hadoop.mapred.lib.db.TestConstructQuery
Tests run: 2, Failures: 0, Errors: 0, Skipped: 0, Time elapsed: 0.613 sec - in org.apache.hadoop.mapred.lib.db.TestConstructQuery
Java HotSpot(TM) 64-Bit Server VM warning: ignoring option MaxPermSize=768m; support was removed in 8.0
Running org.apache.hadoop.mapred.lib.TestChainMapReduce
Tests run: 1, Failures: 0, Errors: 0, Skipped: 0, Time elapsed: 2.949 sec - in org.apache.hadoop.mapred.lib.TestChainMapReduce
Java HotSpot(TM) 64-Bit Server VM warning: ignoring option MaxPermSize=768m; support was removed in 8.0
Running org.apache.hadoop.mapred.lib.TestMultithreadedMapRunner
Tests run: 3, Failures: 0, Errors: 0, Skipped: 0, Time elapsed: 3.125 sec - in org.apache.hadoop.mapred.lib.TestMultithreadedMapRunner
Java HotSpot(TM) 64-Bit Server VM warning: ignoring option MaxPermSize=768m; support was removed in 8.0
Running org.apache.hadoop.mapred.lib.TestMultipleInputs
Tests run: 2, Failures: 0, Errors: 0, Skipped: 0, Time elapsed: 0.626 sec - in org.apache.hadoop.mapred.lib.TestMultipleInputs
Java HotSpot(TM) 64-Bit Server VM warning: ignoring option MaxPermSize=768m; support was removed in 8.0
Running org.apache.hadoop.mapred.TestYARNRunner
Tests run: 13, Failures: 0, Errors: 0, Skipped: 0, Time elapsed: 32.925 sec - in org.apache.hadoop.mapred.TestYARNRunner
Java HotSpot(TM) 64-Bit Server VM warning: ignoring option MaxPermSize=768m; support was removed in 8.0
Running org.apache.hadoop.mapred.TestMerge
Tests run: 1, Failures: 0, Errors: 0, Skipped: 0, Time elapsed: 83.169 sec - in org.apache.hadoop.mapred.TestMerge
Java HotSpot(TM) 64-Bit Server VM warning: ignoring option MaxPermSize=768m; support was removed in 8.0
Running org.apache.hadoop.mapred.TestSequenceFileAsBinaryInputFormat
Tests run: 1, Failures: 0, Errors: 0, Skipped: 0, Time elapsed: 1.436 sec - in org.apache.hadoop.mapred.TestSequenceFileAsBinaryInputFormat
Java HotSpot(TM) 64-Bit Server VM warning: ignoring option MaxPermSize=768m; support was removed in 8.0
Running org.apache.hadoop.mapred.TestClusterMRNotification
Slave went offline during the build
ERROR: Connection was broken: java.io.IOException: Sorry, this connection is closed.
	at com.trilead.ssh2.transport.TransportManager.ensureConnected(TransportManager.java:587)
	at com.trilead.ssh2.transport.TransportManager.sendMessage(TransportManager.java:660)
	at com.trilead.ssh2.channel.Channel.freeupWindow(Channel.java:407)
	at com.trilead.ssh2.channel.Channel.freeupWindow(Channel.java:347)
	at com.trilead.ssh2.channel.ChannelManager.getChannelData(ChannelManager.java:943)
	at com.trilead.ssh2.channel.ChannelInputStream.read(ChannelInputStream.java:58)
	at com.trilead.ssh2.channel.ChannelInputStream.read(ChannelInputStream.java:79)
	at hudson.remoting.FlightRecorderInputStream.read(FlightRecorderInputStream.java:82)
	at hudson.remoting.ChunkedInputStream.readHeader(ChunkedInputStream.java:72)
	at hudson.remoting.ChunkedInputStream.readUntilBreak(ChunkedInputStream.java:103)
	at hudson.remoting.ChunkedCommandTransport.readBlock(ChunkedCommandTransport.java:39)
	at hudson.remoting.AbstractSynchronousByteArrayCommandTransport.read(AbstractSynchronousByteArrayCommandTransport.java:34)
	at hudson.remoting.SynchronousCommandTransport$ReaderThread.run(SynchronousCommandTransport.java:48)
Caused by: java.io.IOException: Error: the peer is not consuming our asynchronous replies.
	at com.trilead.ssh2.transport.TransportManager.sendAsynchronousMessage(TransportManager.java:628)
	at com.trilead.ssh2.channel.Channel.freeupWindow(Channel.java:405)
	at com.trilead.ssh2.channel.Channel$Output.write(Channel.java:99)
	at com.trilead.ssh2.channel.ChannelManager.msgChannelExtendedData(ChannelManager.java:848)
	at com.trilead.ssh2.channel.ChannelManager.handleMessage(ChannelManager.java:1463)
	at com.trilead.ssh2.transport.TransportManager.receiveLoop(TransportManager.java:796)
	at com.trilead.ssh2.transport.TransportManager$1.run(TransportManager.java:489)
	at java.lang.Thread.run(Thread.java:745)

Build step 'Execute shell' marked build as failure
ERROR: Step ?Publish FindBugs analysis results? failed: no workspace for Hadoop-Mapreduce-trunk-Java8 #1402
ERROR: Step ?Archive the artifacts? failed: no workspace for Hadoop-Mapreduce-trunk-Java8 #1402
ERROR: Step ?Publish JUnit test result report? failed: no workspace for Hadoop-Mapreduce-trunk-Java8 #1402
Email was triggered for: Failure - Any
Sending email for trigger: Failure - Any
ERROR: H1 is offline; cannot locate jdk-1.8.0
ERROR: H1 is offline; cannot locate jdk-1.8.0




###################################################################################
############################## FAILED TESTS (if any) ##############################
No tests ran.

Hadoop-Mapreduce-trunk-Java8 - Build # 1401 - Still Failing

Posted by Apache Jenkins Server <je...@builds.apache.org>.
See https://builds.apache.org/job/Hadoop-Mapreduce-trunk-Java8/1401/

###################################################################################
########################## LAST 60 LINES OF THE CONSOLE ###########################
[...truncated 9514 lines...]
Running org.apache.hadoop.hdfs.TestNNBench
Tests run: 2, Failures: 0, Errors: 0, Skipped: 0, Time elapsed: 15.685 sec - in org.apache.hadoop.hdfs.TestNNBench
Java HotSpot(TM) 64-Bit Server VM warning: ignoring option MaxPermSize=768m; support was removed in 8.0
Running org.apache.hadoop.io.TestSequenceFileMergeProgress
Tests run: 3, Failures: 0, Errors: 0, Skipped: 0, Time elapsed: 1.512 sec - in org.apache.hadoop.io.TestSequenceFileMergeProgress
Java HotSpot(TM) 64-Bit Server VM warning: ignoring option MaxPermSize=768m; support was removed in 8.0
Running org.apache.hadoop.conf.TestNoDefaultsJobConf
Tests run: 1, Failures: 0, Errors: 0, Skipped: 0, Time elapsed: 21.824 sec - in org.apache.hadoop.conf.TestNoDefaultsJobConf

Results :

Failed tests: 
  TestMRCJCFileOutputCommitter.testAbort:153 Output directory not empty expected:<0> but was:<4>
  TestMiniMRChildTask.testTaskEnv:472->runTestTaskEnv:550 The environment checker job failed.
  TestMiniMRChildTask.testTaskOldEnv:496->runTestTaskEnv:550 The environment checker job failed.

Tests run: 533, Failures: 3, Errors: 0, Skipped: 11

[INFO] ------------------------------------------------------------------------
[INFO] Reactor Summary:
[INFO] 
[INFO] Apache Hadoop MapReduce Client .................... SUCCESS [  2.334 s]
[INFO] Apache Hadoop MapReduce Core ...................... SUCCESS [01:37 min]
[INFO] Apache Hadoop MapReduce Common .................... SUCCESS [ 24.846 s]
[INFO] Apache Hadoop MapReduce Shuffle ................... SUCCESS [  4.326 s]
[INFO] Apache Hadoop MapReduce App ....................... SUCCESS [10:14 min]
[INFO] Apache Hadoop MapReduce HistoryServer ............. SUCCESS [06:23 min]
[INFO] Apache Hadoop MapReduce JobClient ................. FAILURE [  01:44 h]
[INFO] Apache Hadoop MapReduce HistoryServer Plugins ..... SKIPPED
[INFO] Apache Hadoop MapReduce NativeTask ................ SKIPPED
[INFO] Apache Hadoop MapReduce Examples .................. SKIPPED
[INFO] Apache Hadoop MapReduce ........................... SKIPPED
[INFO] ------------------------------------------------------------------------
[INFO] BUILD FAILURE
[INFO] ------------------------------------------------------------------------
[INFO] Total time: 02:02 h
[INFO] Finished at: 2016-05-14T22:22:10+00:00
[INFO] Final Memory: 34M/153M
[INFO] ------------------------------------------------------------------------
[WARNING] The requested profile "parallel-tests" could not be activated because it does not exist.
[ERROR] Failed to execute goal org.apache.maven.plugins:maven-surefire-plugin:2.17:test (default-test) on project hadoop-mapreduce-client-jobclient: There are test failures.
[ERROR] 
[ERROR] Please refer to /home/jenkins/jenkins-slave/workspace/Hadoop-Mapreduce-trunk-Java8/hadoop-mapreduce-project/hadoop-mapreduce-client/hadoop-mapreduce-client-jobclient/target/surefire-reports for the individual test results.
[ERROR] -> [Help 1]
[ERROR] 
[ERROR] To see the full stack trace of the errors, re-run Maven with the -e switch.
[ERROR] Re-run Maven using the -X switch to enable full debug logging.
[ERROR] 
[ERROR] For more information about the errors and possible solutions, please read the following articles:
[ERROR] [Help 1] http://cwiki.apache.org/confluence/display/MAVEN/MojoFailureException
[ERROR] 
[ERROR] After correcting the problems, you can resume the build with the command
[ERROR]   mvn <goals> -rf :hadoop-mapreduce-client-jobclient
Build step 'Execute shell' marked build as failure
[FINDBUGS] Skipping publisher since build result is FAILURE
Archiving artifacts
Recording test results
Email was triggered for: Failure - Any
Sending email for trigger: Failure - Any



###################################################################################
############################## FAILED TESTS (if any) ##############################
3 tests failed.
FAILED:  org.apache.hadoop.mapred.TestMRCJCFileOutputCommitter.testAbort

Error Message:
Output directory not empty expected:<0> but was:<4>

Stack Trace:
java.lang.AssertionError: Output directory not empty expected:<0> but was:<4>
	at org.junit.Assert.fail(Assert.java:88)
	at org.junit.Assert.failNotEquals(Assert.java:743)
	at org.junit.Assert.assertEquals(Assert.java:118)
	at org.junit.Assert.assertEquals(Assert.java:555)
	at org.apache.hadoop.mapred.TestMRCJCFileOutputCommitter.testAbort(TestMRCJCFileOutputCommitter.java:153)


FAILED:  org.apache.hadoop.mapred.TestMiniMRChildTask.testTaskEnv

Error Message:
The environment checker job failed.

Stack Trace:
java.lang.AssertionError: The environment checker job failed.
	at org.junit.Assert.fail(Assert.java:88)
	at org.junit.Assert.assertTrue(Assert.java:41)
	at org.apache.hadoop.mapred.TestMiniMRChildTask.runTestTaskEnv(TestMiniMRChildTask.java:550)
	at org.apache.hadoop.mapred.TestMiniMRChildTask.testTaskEnv(TestMiniMRChildTask.java:472)


FAILED:  org.apache.hadoop.mapred.TestMiniMRChildTask.testTaskOldEnv

Error Message:
The environment checker job failed.

Stack Trace:
java.lang.AssertionError: The environment checker job failed.
	at org.junit.Assert.fail(Assert.java:88)
	at org.junit.Assert.assertTrue(Assert.java:41)
	at org.apache.hadoop.mapred.TestMiniMRChildTask.runTestTaskEnv(TestMiniMRChildTask.java:550)
	at org.apache.hadoop.mapred.TestMiniMRChildTask.testTaskOldEnv(TestMiniMRChildTask.java:496)




Hadoop-Mapreduce-trunk-Java8 - Build # 1400 - Still Failing

Posted by Apache Jenkins Server <je...@builds.apache.org>.
See https://builds.apache.org/job/Hadoop-Mapreduce-trunk-Java8/1400/

###################################################################################
########################## LAST 60 LINES OF THE CONSOLE ###########################
[...truncated 8433 lines...]
Tests run: 3, Failures: 0, Errors: 0, Skipped: 0, Time elapsed: 2.945 sec - in org.apache.hadoop.mapred.TestJobEndNotifier
Java HotSpot(TM) 64-Bit Server VM warning: ignoring option MaxPermSize=768m; support was removed in 8.0
Running org.apache.hadoop.mapred.TestOldMethodsJobID
Tests run: 6, Failures: 0, Errors: 0, Skipped: 0, Time elapsed: 0.262 sec - in org.apache.hadoop.mapred.TestOldMethodsJobID
Java HotSpot(TM) 64-Bit Server VM warning: ignoring option MaxPermSize=768m; support was removed in 8.0
Running org.apache.hadoop.mapred.TestJobQueueClient
Tests run: 1, Failures: 0, Errors: 0, Skipped: 0, Time elapsed: 0.095 sec - in org.apache.hadoop.mapred.TestJobQueueClient
Java HotSpot(TM) 64-Bit Server VM warning: ignoring option MaxPermSize=768m; support was removed in 8.0
Running org.apache.hadoop.mapred.TestJobConf
Tests run: 12, Failures: 0, Errors: 0, Skipped: 0, Time elapsed: 1.481 sec - in org.apache.hadoop.mapred.TestJobConf

Results :

Failed tests: 
  TestCLI.testGetJob:181 null

Tests run: 244, Failures: 1, Errors: 0, Skipped: 0

[INFO] ------------------------------------------------------------------------
[INFO] Reactor Summary:
[INFO] 
[INFO] Apache Hadoop MapReduce Client .................... SUCCESS [  2.337 s]
[INFO] Apache Hadoop MapReduce Core ...................... FAILURE [01:36 min]
[INFO] Apache Hadoop MapReduce Common .................... SKIPPED
[INFO] Apache Hadoop MapReduce Shuffle ................... SKIPPED
[INFO] Apache Hadoop MapReduce App ....................... SKIPPED
[INFO] Apache Hadoop MapReduce HistoryServer ............. SKIPPED
[INFO] Apache Hadoop MapReduce JobClient ................. SKIPPED
[INFO] Apache Hadoop MapReduce HistoryServer Plugins ..... SKIPPED
[INFO] Apache Hadoop MapReduce NativeTask ................ SKIPPED
[INFO] Apache Hadoop MapReduce Examples .................. SKIPPED
[INFO] Apache Hadoop MapReduce ........................... SKIPPED
[INFO] ------------------------------------------------------------------------
[INFO] BUILD FAILURE
[INFO] ------------------------------------------------------------------------
[INFO] Total time: 01:39 min
[INFO] Finished at: 2016-05-13T21:20:57+00:00
[INFO] Final Memory: 32M/224M
[INFO] ------------------------------------------------------------------------
[WARNING] The requested profile "parallel-tests" could not be activated because it does not exist.
[ERROR] Failed to execute goal org.apache.maven.plugins:maven-surefire-plugin:2.17:test (default-test) on project hadoop-mapreduce-client-core: There are test failures.
[ERROR] 
[ERROR] Please refer to /home/jenkins/jenkins-slave/workspace/Hadoop-Mapreduce-trunk-Java8/hadoop-mapreduce-project/hadoop-mapreduce-client/hadoop-mapreduce-client-core/target/surefire-reports for the individual test results.
[ERROR] -> [Help 1]
[ERROR] 
[ERROR] To see the full stack trace of the errors, re-run Maven with the -e switch.
[ERROR] Re-run Maven using the -X switch to enable full debug logging.
[ERROR] 
[ERROR] For more information about the errors and possible solutions, please read the following articles:
[ERROR] [Help 1] http://cwiki.apache.org/confluence/display/MAVEN/MojoFailureException
[ERROR] 
[ERROR] After correcting the problems, you can resume the build with the command
[ERROR]   mvn <goals> -rf :hadoop-mapreduce-client-core
Build step 'Execute shell' marked build as failure
[FINDBUGS] Skipping publisher since build result is FAILURE
Archiving artifacts
Recording test results
Email was triggered for: Failure - Any
Sending email for trigger: Failure - Any



###################################################################################
############################## FAILED TESTS (if any) ##############################
1 tests failed.
FAILED:  org.apache.hadoop.mapreduce.tools.TestCLI.testGetJob

Error Message:
null

Stack Trace:
java.lang.AssertionError: null
	at org.junit.Assert.fail(Assert.java:86)
	at org.junit.Assert.assertTrue(Assert.java:41)
	at org.junit.Assert.assertTrue(Assert.java:52)
	at org.apache.hadoop.mapreduce.tools.TestCLI.testGetJob(TestCLI.java:181)




Hadoop-Mapreduce-trunk-Java8 - Build # 1399 - Still Failing

Posted by Apache Jenkins Server <je...@builds.apache.org>.
See https://builds.apache.org/job/Hadoop-Mapreduce-trunk-Java8/1399/

###################################################################################
########################## LAST 60 LINES OF THE CONSOLE ###########################
[...truncated 8806 lines...]
Tests run: 1, Failures: 0, Errors: 0, Skipped: 0, Time elapsed: 1.248 sec - in org.apache.hadoop.mapred.TestTaskAttemptFinishingMonitor
Java HotSpot(TM) 64-Bit Server VM warning: ignoring option MaxPermSize=768m; support was removed in 8.0
Running org.apache.hadoop.mapred.TestTaskAttemptListenerImpl
Tests run: 6, Failures: 0, Errors: 0, Skipped: 0, Time elapsed: 1.001 sec - in org.apache.hadoop.mapred.TestTaskAttemptListenerImpl
Java HotSpot(TM) 64-Bit Server VM warning: ignoring option MaxPermSize=768m; support was removed in 8.0
Running org.apache.hadoop.mapred.TestLocalContainerLauncher
Tests run: 2, Failures: 0, Errors: 0, Skipped: 0, Time elapsed: 1.735 sec - in org.apache.hadoop.mapred.TestLocalContainerLauncher

Results :

Failed tests: 
  TestRecovery.testOutputRecoveryMapsOnly:995 Task state is not correct (timedout) expected:<SUCCEEDED> but was:<RUNNING>
  TestRecovery.testRecoverySuccessUsingCustomOutputCommitter:537 Task state is not correct (timedout) expected:<SUCCEEDED> but was:<RUNNING>
  TestRecovery.testCrashed:262 Task state is not correct (timedout) expected:<SUCCEEDED> but was:<RUNNING>
  TestRecovery.testSpeculative:1256 Task state is not correct (timedout) expected:<SUCCEEDED> but was:<RUNNING>

Tests run: 348, Failures: 4, Errors: 0, Skipped: 0

[INFO] ------------------------------------------------------------------------
[INFO] Reactor Summary:
[INFO] 
[INFO] Apache Hadoop MapReduce Client .................... SUCCESS [  2.552 s]
[INFO] Apache Hadoop MapReduce Core ...................... SUCCESS [01:39 min]
[INFO] Apache Hadoop MapReduce Common .................... SUCCESS [ 26.985 s]
[INFO] Apache Hadoop MapReduce Shuffle ................... SUCCESS [  4.443 s]
[INFO] Apache Hadoop MapReduce App ....................... FAILURE [11:00 min]
[INFO] Apache Hadoop MapReduce HistoryServer ............. SKIPPED
[INFO] Apache Hadoop MapReduce JobClient ................. SKIPPED
[INFO] Apache Hadoop MapReduce HistoryServer Plugins ..... SKIPPED
[INFO] Apache Hadoop MapReduce NativeTask ................ SKIPPED
[INFO] Apache Hadoop MapReduce Examples .................. SKIPPED
[INFO] Apache Hadoop MapReduce ........................... SKIPPED
[INFO] ------------------------------------------------------------------------
[INFO] BUILD FAILURE
[INFO] ------------------------------------------------------------------------
[INFO] Total time: 13:15 min
[INFO] Finished at: 2016-05-13T17:38:01+00:00
[INFO] Final Memory: 36M/190M
[INFO] ------------------------------------------------------------------------
[WARNING] The requested profile "parallel-tests" could not be activated because it does not exist.
[ERROR] Failed to execute goal org.apache.maven.plugins:maven-surefire-plugin:2.17:test (default-test) on project hadoop-mapreduce-client-app: There are test failures.
[ERROR] 
[ERROR] Please refer to /home/jenkins/jenkins-slave/workspace/Hadoop-Mapreduce-trunk-Java8/hadoop-mapreduce-project/hadoop-mapreduce-client/hadoop-mapreduce-client-app/target/surefire-reports for the individual test results.
[ERROR] -> [Help 1]
[ERROR] 
[ERROR] To see the full stack trace of the errors, re-run Maven with the -e switch.
[ERROR] Re-run Maven using the -X switch to enable full debug logging.
[ERROR] 
[ERROR] For more information about the errors and possible solutions, please read the following articles:
[ERROR] [Help 1] http://cwiki.apache.org/confluence/display/MAVEN/MojoFailureException
[ERROR] 
[ERROR] After correcting the problems, you can resume the build with the command
[ERROR]   mvn <goals> -rf :hadoop-mapreduce-client-app
Build step 'Execute shell' marked build as failure
[FINDBUGS] Skipping publisher since build result is FAILURE
Archiving artifacts
Recording test results
Email was triggered for: Failure - Any
Sending email for trigger: Failure - Any



###################################################################################
############################## FAILED TESTS (if any) ##############################
4 tests failed.
FAILED:  org.apache.hadoop.mapreduce.v2.app.TestRecovery.testOutputRecoveryMapsOnly

Error Message:
Task state is not correct (timedout) expected:<SUCCEEDED> but was:<RUNNING>

Stack Trace:
java.lang.AssertionError: Task state is not correct (timedout) expected:<SUCCEEDED> but was:<RUNNING>
	at org.junit.Assert.fail(Assert.java:88)
	at org.junit.Assert.failNotEquals(Assert.java:743)
	at org.junit.Assert.assertEquals(Assert.java:118)
	at org.apache.hadoop.mapreduce.v2.app.MRApp.waitForState(MRApp.java:399)
	at org.apache.hadoop.mapreduce.v2.app.TestRecovery.testOutputRecoveryMapsOnly(TestRecovery.java:995)


FAILED:  org.apache.hadoop.mapreduce.v2.app.TestRecovery.testRecoverySuccessUsingCustomOutputCommitter

Error Message:
Task state is not correct (timedout) expected:<SUCCEEDED> but was:<RUNNING>

Stack Trace:
java.lang.AssertionError: Task state is not correct (timedout) expected:<SUCCEEDED> but was:<RUNNING>
	at org.junit.Assert.fail(Assert.java:88)
	at org.junit.Assert.failNotEquals(Assert.java:743)
	at org.junit.Assert.assertEquals(Assert.java:118)
	at org.apache.hadoop.mapreduce.v2.app.MRApp.waitForState(MRApp.java:399)
	at org.apache.hadoop.mapreduce.v2.app.TestRecovery.testRecoverySuccessUsingCustomOutputCommitter(TestRecovery.java:537)


FAILED:  org.apache.hadoop.mapreduce.v2.app.TestRecovery.testCrashed

Error Message:
Task state is not correct (timedout) expected:<SUCCEEDED> but was:<RUNNING>

Stack Trace:
java.lang.AssertionError: Task state is not correct (timedout) expected:<SUCCEEDED> but was:<RUNNING>
	at org.junit.Assert.fail(Assert.java:88)
	at org.junit.Assert.failNotEquals(Assert.java:743)
	at org.junit.Assert.assertEquals(Assert.java:118)
	at org.apache.hadoop.mapreduce.v2.app.MRApp.waitForState(MRApp.java:399)
	at org.apache.hadoop.mapreduce.v2.app.TestRecovery.testCrashed(TestRecovery.java:262)


FAILED:  org.apache.hadoop.mapreduce.v2.app.TestRecovery.testSpeculative

Error Message:
Task state is not correct (timedout) expected:<SUCCEEDED> but was:<RUNNING>

Stack Trace:
java.lang.AssertionError: Task state is not correct (timedout) expected:<SUCCEEDED> but was:<RUNNING>
	at org.junit.Assert.fail(Assert.java:88)
	at org.junit.Assert.failNotEquals(Assert.java:743)
	at org.junit.Assert.assertEquals(Assert.java:118)
	at org.apache.hadoop.mapreduce.v2.app.MRApp.waitForState(MRApp.java:399)
	at org.apache.hadoop.mapreduce.v2.app.TestRecovery.testSpeculative(TestRecovery.java:1256)




Hadoop-Mapreduce-trunk-Java8 - Build # 1398 - Still Failing

Posted by Apache Jenkins Server <je...@builds.apache.org>.
See https://builds.apache.org/job/Hadoop-Mapreduce-trunk-Java8/1398/

###################################################################################
########################## LAST 60 LINES OF THE CONSOLE ###########################
[...truncated 9559 lines...]
Java HotSpot(TM) 64-Bit Server VM warning: ignoring option MaxPermSize=768m; support was removed in 8.0
Running org.apache.hadoop.hdfs.TestNNBench
Tests run: 2, Failures: 0, Errors: 0, Skipped: 0, Time elapsed: 16.7 sec - in org.apache.hadoop.hdfs.TestNNBench
Java HotSpot(TM) 64-Bit Server VM warning: ignoring option MaxPermSize=768m; support was removed in 8.0
Running org.apache.hadoop.io.TestSequenceFileMergeProgress
Tests run: 3, Failures: 0, Errors: 0, Skipped: 0, Time elapsed: 1.62 sec - in org.apache.hadoop.io.TestSequenceFileMergeProgress
Java HotSpot(TM) 64-Bit Server VM warning: ignoring option MaxPermSize=768m; support was removed in 8.0
Running org.apache.hadoop.conf.TestNoDefaultsJobConf
Tests run: 1, Failures: 0, Errors: 0, Skipped: 0, Time elapsed: 21.742 sec - in org.apache.hadoop.conf.TestNoDefaultsJobConf

Results :

Failed tests: 
  TestMRCJCFileOutputCommitter.testAbort:153 Output directory not empty expected:<0> but was:<4>
  TestMiniMRChildTask.testTaskEnv:472->runTestTaskEnv:550 The environment checker job failed.
  TestMiniMRChildTask.testTaskOldEnv:496->runTestTaskEnv:550 The environment checker job failed.

Tests run: 529, Failures: 3, Errors: 0, Skipped: 11

[INFO] ------------------------------------------------------------------------
[INFO] Reactor Summary:
[INFO] 
[INFO] Apache Hadoop MapReduce Client .................... SUCCESS [  2.573 s]
[INFO] Apache Hadoop MapReduce Core ...................... SUCCESS [01:40 min]
[INFO] Apache Hadoop MapReduce Common .................... SUCCESS [ 25.823 s]
[INFO] Apache Hadoop MapReduce Shuffle ................... SUCCESS [  4.502 s]
[INFO] Apache Hadoop MapReduce App ....................... SUCCESS [10:39 min]
[INFO] Apache Hadoop MapReduce HistoryServer ............. SUCCESS [06:25 min]
[INFO] Apache Hadoop MapReduce JobClient ................. FAILURE [  01:40 h]
[INFO] Apache Hadoop MapReduce HistoryServer Plugins ..... SKIPPED
[INFO] Apache Hadoop MapReduce NativeTask ................ SKIPPED
[INFO] Apache Hadoop MapReduce Examples .................. SKIPPED
[INFO] Apache Hadoop MapReduce ........................... SKIPPED
[INFO] ------------------------------------------------------------------------
[INFO] BUILD FAILURE
[INFO] ------------------------------------------------------------------------
[INFO] Total time: 02:00 h
[INFO] Finished at: 2016-05-13T17:19:41+00:00
[INFO] Final Memory: 34M/155M
[INFO] ------------------------------------------------------------------------
[WARNING] The requested profile "parallel-tests" could not be activated because it does not exist.
[ERROR] Failed to execute goal org.apache.maven.plugins:maven-surefire-plugin:2.17:test (default-test) on project hadoop-mapreduce-client-jobclient: ExecutionException: java.lang.RuntimeException: The forked VM terminated without properly saying goodbye. VM crash or System.exit called?
[ERROR] Command was /bin/sh -c cd /home/jenkins/jenkins-slave/workspace/Hadoop-Mapreduce-trunk-Java8/hadoop-mapreduce-project/hadoop-mapreduce-client/hadoop-mapreduce-client-jobclient && /home/jenkins/tools/java/jdk1.8.0/jre/bin/java -Xmx2048m -XX:MaxPermSize=768m -XX:+HeapDumpOnOutOfMemoryError -jar /home/jenkins/jenkins-slave/workspace/Hadoop-Mapreduce-trunk-Java8/hadoop-mapreduce-project/hadoop-mapreduce-client/hadoop-mapreduce-client-jobclient/target/surefire/surefirebooter4295745490478206475.jar /home/jenkins/jenkins-slave/workspace/Hadoop-Mapreduce-trunk-Java8/hadoop-mapreduce-project/hadoop-mapreduce-client/hadoop-mapreduce-client-jobclient/target/surefire/surefire8605929818491983095tmp /home/jenkins/jenkins-slave/workspace/Hadoop-Mapreduce-trunk-Java8/hadoop-mapreduce-project/hadoop-mapreduce-client/hadoop-mapreduce-client-jobclient/target/surefire/surefire_2985322543892716641911tmp
[ERROR] -> [Help 1]
[ERROR] 
[ERROR] To see the full stack trace of the errors, re-run Maven with the -e switch.
[ERROR] Re-run Maven using the -X switch to enable full debug logging.
[ERROR] 
[ERROR] For more information about the errors and possible solutions, please read the following articles:
[ERROR] [Help 1] http://cwiki.apache.org/confluence/display/MAVEN/MojoFailureException
[ERROR] 
[ERROR] After correcting the problems, you can resume the build with the command
[ERROR]   mvn <goals> -rf :hadoop-mapreduce-client-jobclient
Build step 'Execute shell' marked build as failure
[FINDBUGS] Skipping publisher since build result is FAILURE
Archiving artifacts
Recording test results
Email was triggered for: Failure - Any
Sending email for trigger: Failure - Any



###################################################################################
############################## FAILED TESTS (if any) ##############################
3 tests failed.
FAILED:  org.apache.hadoop.mapred.TestMRCJCFileOutputCommitter.testAbort

Error Message:
Output directory not empty expected:<0> but was:<4>

Stack Trace:
java.lang.AssertionError: Output directory not empty expected:<0> but was:<4>
	at org.junit.Assert.fail(Assert.java:88)
	at org.junit.Assert.failNotEquals(Assert.java:743)
	at org.junit.Assert.assertEquals(Assert.java:118)
	at org.junit.Assert.assertEquals(Assert.java:555)
	at org.apache.hadoop.mapred.TestMRCJCFileOutputCommitter.testAbort(TestMRCJCFileOutputCommitter.java:153)


FAILED:  org.apache.hadoop.mapred.TestMiniMRChildTask.testTaskEnv

Error Message:
The environment checker job failed.

Stack Trace:
java.lang.AssertionError: The environment checker job failed.
	at org.junit.Assert.fail(Assert.java:88)
	at org.junit.Assert.assertTrue(Assert.java:41)
	at org.apache.hadoop.mapred.TestMiniMRChildTask.runTestTaskEnv(TestMiniMRChildTask.java:550)
	at org.apache.hadoop.mapred.TestMiniMRChildTask.testTaskEnv(TestMiniMRChildTask.java:472)


FAILED:  org.apache.hadoop.mapred.TestMiniMRChildTask.testTaskOldEnv

Error Message:
The environment checker job failed.

Stack Trace:
java.lang.AssertionError: The environment checker job failed.
	at org.junit.Assert.fail(Assert.java:88)
	at org.junit.Assert.assertTrue(Assert.java:41)
	at org.apache.hadoop.mapred.TestMiniMRChildTask.runTestTaskEnv(TestMiniMRChildTask.java:550)
	at org.apache.hadoop.mapred.TestMiniMRChildTask.testTaskOldEnv(TestMiniMRChildTask.java:496)




Hadoop-Mapreduce-trunk-Java8 - Build # 1397 - Still Failing

Posted by Apache Jenkins Server <je...@builds.apache.org>.
See https://builds.apache.org/job/Hadoop-Mapreduce-trunk-Java8/1397/

###################################################################################
########################## LAST 60 LINES OF THE CONSOLE ###########################
[...truncated 9514 lines...]
Running org.apache.hadoop.hdfs.TestNNBench
Tests run: 2, Failures: 0, Errors: 0, Skipped: 0, Time elapsed: 15.778 sec - in org.apache.hadoop.hdfs.TestNNBench
Java HotSpot(TM) 64-Bit Server VM warning: ignoring option MaxPermSize=768m; support was removed in 8.0
Running org.apache.hadoop.io.TestSequenceFileMergeProgress
Tests run: 3, Failures: 0, Errors: 0, Skipped: 0, Time elapsed: 1.576 sec - in org.apache.hadoop.io.TestSequenceFileMergeProgress
Java HotSpot(TM) 64-Bit Server VM warning: ignoring option MaxPermSize=768m; support was removed in 8.0
Running org.apache.hadoop.conf.TestNoDefaultsJobConf
Tests run: 1, Failures: 0, Errors: 0, Skipped: 0, Time elapsed: 22.937 sec - in org.apache.hadoop.conf.TestNoDefaultsJobConf

Results :

Failed tests: 
  TestMRCJCFileOutputCommitter.testAbort:153 Output directory not empty expected:<0> but was:<4>
  TestMiniMRChildTask.testTaskEnv:472->runTestTaskEnv:550 The environment checker job failed.
  TestMiniMRChildTask.testTaskOldEnv:496->runTestTaskEnv:550 The environment checker job failed.

Tests run: 533, Failures: 3, Errors: 0, Skipped: 11

[INFO] ------------------------------------------------------------------------
[INFO] Reactor Summary:
[INFO] 
[INFO] Apache Hadoop MapReduce Client .................... SUCCESS [  2.206 s]
[INFO] Apache Hadoop MapReduce Core ...................... SUCCESS [01:35 min]
[INFO] Apache Hadoop MapReduce Common .................... SUCCESS [ 24.558 s]
[INFO] Apache Hadoop MapReduce Shuffle ................... SUCCESS [  4.217 s]
[INFO] Apache Hadoop MapReduce App ....................... SUCCESS [10:15 min]
[INFO] Apache Hadoop MapReduce HistoryServer ............. SUCCESS [06:19 min]
[INFO] Apache Hadoop MapReduce JobClient ................. FAILURE [  01:47 h]
[INFO] Apache Hadoop MapReduce HistoryServer Plugins ..... SKIPPED
[INFO] Apache Hadoop MapReduce NativeTask ................ SKIPPED
[INFO] Apache Hadoop MapReduce Examples .................. SKIPPED
[INFO] Apache Hadoop MapReduce ........................... SKIPPED
[INFO] ------------------------------------------------------------------------
[INFO] BUILD FAILURE
[INFO] ------------------------------------------------------------------------
[INFO] Total time: 02:06 h
[INFO] Finished at: 2016-05-13T12:26:08+00:00
[INFO] Final Memory: 34M/189M
[INFO] ------------------------------------------------------------------------
[WARNING] The requested profile "parallel-tests" could not be activated because it does not exist.
[ERROR] Failed to execute goal org.apache.maven.plugins:maven-surefire-plugin:2.17:test (default-test) on project hadoop-mapreduce-client-jobclient: There are test failures.
[ERROR] 
[ERROR] Please refer to /home/jenkins/jenkins-slave/workspace/Hadoop-Mapreduce-trunk-Java8/hadoop-mapreduce-project/hadoop-mapreduce-client/hadoop-mapreduce-client-jobclient/target/surefire-reports for the individual test results.
[ERROR] -> [Help 1]
[ERROR] 
[ERROR] To see the full stack trace of the errors, re-run Maven with the -e switch.
[ERROR] Re-run Maven using the -X switch to enable full debug logging.
[ERROR] 
[ERROR] For more information about the errors and possible solutions, please read the following articles:
[ERROR] [Help 1] http://cwiki.apache.org/confluence/display/MAVEN/MojoFailureException
[ERROR] 
[ERROR] After correcting the problems, you can resume the build with the command
[ERROR]   mvn <goals> -rf :hadoop-mapreduce-client-jobclient
Build step 'Execute shell' marked build as failure
[FINDBUGS] Skipping publisher since build result is FAILURE
Archiving artifacts
Recording test results
Email was triggered for: Failure - Any
Sending email for trigger: Failure - Any



###################################################################################
############################## FAILED TESTS (if any) ##############################
3 tests failed.
FAILED:  org.apache.hadoop.mapred.TestMRCJCFileOutputCommitter.testAbort

Error Message:
Output directory not empty expected:<0> but was:<4>

Stack Trace:
java.lang.AssertionError: Output directory not empty expected:<0> but was:<4>
	at org.junit.Assert.fail(Assert.java:88)
	at org.junit.Assert.failNotEquals(Assert.java:743)
	at org.junit.Assert.assertEquals(Assert.java:118)
	at org.junit.Assert.assertEquals(Assert.java:555)
	at org.apache.hadoop.mapred.TestMRCJCFileOutputCommitter.testAbort(TestMRCJCFileOutputCommitter.java:153)


FAILED:  org.apache.hadoop.mapred.TestMiniMRChildTask.testTaskEnv

Error Message:
The environment checker job failed.

Stack Trace:
java.lang.AssertionError: The environment checker job failed.
	at org.junit.Assert.fail(Assert.java:88)
	at org.junit.Assert.assertTrue(Assert.java:41)
	at org.apache.hadoop.mapred.TestMiniMRChildTask.runTestTaskEnv(TestMiniMRChildTask.java:550)
	at org.apache.hadoop.mapred.TestMiniMRChildTask.testTaskEnv(TestMiniMRChildTask.java:472)


FAILED:  org.apache.hadoop.mapred.TestMiniMRChildTask.testTaskOldEnv

Error Message:
The environment checker job failed.

Stack Trace:
java.lang.AssertionError: The environment checker job failed.
	at org.junit.Assert.fail(Assert.java:88)
	at org.junit.Assert.assertTrue(Assert.java:41)
	at org.apache.hadoop.mapred.TestMiniMRChildTask.runTestTaskEnv(TestMiniMRChildTask.java:550)
	at org.apache.hadoop.mapred.TestMiniMRChildTask.testTaskOldEnv(TestMiniMRChildTask.java:496)




Hadoop-Mapreduce-trunk-Java8 - Build # 1396 - Still Failing

Posted by Apache Jenkins Server <je...@builds.apache.org>.
See https://builds.apache.org/job/Hadoop-Mapreduce-trunk-Java8/1396/

###################################################################################
########################## LAST 60 LINES OF THE CONSOLE ###########################
[...truncated 8435 lines...]
Tests run: 4, Failures: 0, Errors: 0, Skipped: 0, Time elapsed: 0.982 sec - in org.apache.hadoop.mapred.TestJobAclsManager
Java HotSpot(TM) 64-Bit Server VM warning: ignoring option MaxPermSize=768m; support was removed in 8.0
Running org.apache.hadoop.mapred.TestLineRecordReader
Tests run: 13, Failures: 0, Errors: 0, Skipped: 0, Time elapsed: 10.799 sec - in org.apache.hadoop.mapred.TestLineRecordReader
Java HotSpot(TM) 64-Bit Server VM warning: ignoring option MaxPermSize=768m; support was removed in 8.0
Running org.apache.hadoop.mapred.TestClock
Tests run: 1, Failures: 0, Errors: 0, Skipped: 0, Time elapsed: 0.091 sec - in org.apache.hadoop.mapred.TestClock
Java HotSpot(TM) 64-Bit Server VM warning: ignoring option MaxPermSize=768m; support was removed in 8.0
Running org.apache.hadoop.mapred.TestJobQueueClient
Tests run: 1, Failures: 0, Errors: 0, Skipped: 0, Time elapsed: 0.097 sec - in org.apache.hadoop.mapred.TestJobQueueClient

Results :

Failed tests: 
  TestCLI.testGetJob:181 null

Tests run: 242, Failures: 1, Errors: 0, Skipped: 0

[INFO] ------------------------------------------------------------------------
[INFO] Reactor Summary:
[INFO] 
[INFO] Apache Hadoop MapReduce Client .................... SUCCESS [  3.296 s]
[INFO] Apache Hadoop MapReduce Core ...................... FAILURE [01:47 min]
[INFO] Apache Hadoop MapReduce Common .................... SKIPPED
[INFO] Apache Hadoop MapReduce Shuffle ................... SKIPPED
[INFO] Apache Hadoop MapReduce App ....................... SKIPPED
[INFO] Apache Hadoop MapReduce HistoryServer ............. SKIPPED
[INFO] Apache Hadoop MapReduce JobClient ................. SKIPPED
[INFO] Apache Hadoop MapReduce HistoryServer Plugins ..... SKIPPED
[INFO] Apache Hadoop MapReduce NativeTask ................ SKIPPED
[INFO] Apache Hadoop MapReduce Examples .................. SKIPPED
[INFO] Apache Hadoop MapReduce ........................... SKIPPED
[INFO] ------------------------------------------------------------------------
[INFO] BUILD FAILURE
[INFO] ------------------------------------------------------------------------
[INFO] Total time: 01:51 min
[INFO] Finished at: 2016-05-13T07:21:38+00:00
[INFO] Final Memory: 32M/185M
[INFO] ------------------------------------------------------------------------
[WARNING] The requested profile "parallel-tests" could not be activated because it does not exist.
[ERROR] Failed to execute goal org.apache.maven.plugins:maven-surefire-plugin:2.17:test (default-test) on project hadoop-mapreduce-client-core: There are test failures.
[ERROR] 
[ERROR] Please refer to /home/jenkins/jenkins-slave/workspace/Hadoop-Mapreduce-trunk-Java8/hadoop-mapreduce-project/hadoop-mapreduce-client/hadoop-mapreduce-client-core/target/surefire-reports for the individual test results.
[ERROR] -> [Help 1]
[ERROR] 
[ERROR] To see the full stack trace of the errors, re-run Maven with the -e switch.
[ERROR] Re-run Maven using the -X switch to enable full debug logging.
[ERROR] 
[ERROR] For more information about the errors and possible solutions, please read the following articles:
[ERROR] [Help 1] http://cwiki.apache.org/confluence/display/MAVEN/MojoFailureException
[ERROR] 
[ERROR] After correcting the problems, you can resume the build with the command
[ERROR]   mvn <goals> -rf :hadoop-mapreduce-client-core
Build step 'Execute shell' marked build as failure
[FINDBUGS] Skipping publisher since build result is FAILURE
Archiving artifacts
Recording test results
Email was triggered for: Failure - Any
Sending email for trigger: Failure - Any



###################################################################################
############################## FAILED TESTS (if any) ##############################
1 tests failed.
FAILED:  org.apache.hadoop.mapreduce.tools.TestCLI.testGetJob

Error Message:
null

Stack Trace:
java.lang.AssertionError: null
	at org.junit.Assert.fail(Assert.java:86)
	at org.junit.Assert.assertTrue(Assert.java:41)
	at org.junit.Assert.assertTrue(Assert.java:52)
	at org.apache.hadoop.mapreduce.tools.TestCLI.testGetJob(TestCLI.java:181)




Hadoop-Mapreduce-trunk-Java8 - Build # 1395 - Still Failing

Posted by Apache Jenkins Server <je...@builds.apache.org>.
See https://builds.apache.org/job/Hadoop-Mapreduce-trunk-Java8/1395/

###################################################################################
########################## LAST 60 LINES OF THE CONSOLE ###########################
[...truncated 9502 lines...]
Java HotSpot(TM) 64-Bit Server VM warning: ignoring option MaxPermSize=768m; support was removed in 8.0
Running org.apache.hadoop.mapred.pipes.TestPipes
Tests run: 1, Failures: 0, Errors: 0, Skipped: 1, Time elapsed: 0.029 sec - in org.apache.hadoop.mapred.pipes.TestPipes
Java HotSpot(TM) 64-Bit Server VM warning: ignoring option MaxPermSize=768m; support was removed in 8.0
Running org.apache.hadoop.mapred.TestSpecialCharactersInOutputPath
Tests run: 1, Failures: 0, Errors: 0, Skipped: 0, Time elapsed: 23.639 sec - in org.apache.hadoop.mapred.TestSpecialCharactersInOutputPath
Java HotSpot(TM) 64-Bit Server VM warning: ignoring option MaxPermSize=768m; support was removed in 8.0
Running org.apache.hadoop.mapred.TestReporter
Tests run: 3, Failures: 0, Errors: 0, Skipped: 0, Time elapsed: 13.224 sec - in org.apache.hadoop.mapred.TestReporter

Results :

Failed tests: 
  TestMiniMRChildTask.testTaskEnv:472->runTestTaskEnv:550 The environment checker job failed.
  TestMiniMRChildTask.testTaskOldEnv:496->runTestTaskEnv:550 The environment checker job failed.

Tests run: 533, Failures: 2, Errors: 0, Skipped: 11

[INFO] ------------------------------------------------------------------------
[INFO] Reactor Summary:
[INFO] 
[INFO] Apache Hadoop MapReduce Client .................... SUCCESS [  2.382 s]
[INFO] Apache Hadoop MapReduce Core ...................... SUCCESS [01:52 min]
[INFO] Apache Hadoop MapReduce Common .................... SUCCESS [ 30.067 s]
[INFO] Apache Hadoop MapReduce Shuffle ................... SUCCESS [  5.259 s]
[INFO] Apache Hadoop MapReduce App ....................... SUCCESS [11:13 min]
[INFO] Apache Hadoop MapReduce HistoryServer ............. SUCCESS [06:38 min]
[INFO] Apache Hadoop MapReduce JobClient ................. FAILURE [  01:50 h]
[INFO] Apache Hadoop MapReduce HistoryServer Plugins ..... SKIPPED
[INFO] Apache Hadoop MapReduce NativeTask ................ SKIPPED
[INFO] Apache Hadoop MapReduce Examples .................. SKIPPED
[INFO] Apache Hadoop MapReduce ........................... SKIPPED
[INFO] ------------------------------------------------------------------------
[INFO] BUILD FAILURE
[INFO] ------------------------------------------------------------------------
[INFO] Total time: 02:11 h
[INFO] Finished at: 2016-05-13T04:31:01+00:00
[INFO] Final Memory: 34M/147M
[INFO] ------------------------------------------------------------------------
[WARNING] The requested profile "parallel-tests" could not be activated because it does not exist.
[ERROR] Failed to execute goal org.apache.maven.plugins:maven-surefire-plugin:2.17:test (default-test) on project hadoop-mapreduce-client-jobclient: There are test failures.
[ERROR] 
[ERROR] Please refer to /home/jenkins/jenkins-slave/workspace/Hadoop-Mapreduce-trunk-Java8/hadoop-mapreduce-project/hadoop-mapreduce-client/hadoop-mapreduce-client-jobclient/target/surefire-reports for the individual test results.
[ERROR] -> [Help 1]
[ERROR] 
[ERROR] To see the full stack trace of the errors, re-run Maven with the -e switch.
[ERROR] Re-run Maven using the -X switch to enable full debug logging.
[ERROR] 
[ERROR] For more information about the errors and possible solutions, please read the following articles:
[ERROR] [Help 1] http://cwiki.apache.org/confluence/display/MAVEN/MojoFailureException
[ERROR] 
[ERROR] After correcting the problems, you can resume the build with the command
[ERROR]   mvn <goals> -rf :hadoop-mapreduce-client-jobclient
Build step 'Execute shell' marked build as failure
[FINDBUGS] Skipping publisher since build result is FAILURE
Archiving artifacts
Recording test results
Email was triggered for: Failure - Any
Sending email for trigger: Failure - Any



###################################################################################
############################## FAILED TESTS (if any) ##############################
2 tests failed.
FAILED:  org.apache.hadoop.mapred.TestMiniMRChildTask.testTaskEnv

Error Message:
The environment checker job failed.

Stack Trace:
java.lang.AssertionError: The environment checker job failed.
	at org.junit.Assert.fail(Assert.java:88)
	at org.junit.Assert.assertTrue(Assert.java:41)
	at org.apache.hadoop.mapred.TestMiniMRChildTask.runTestTaskEnv(TestMiniMRChildTask.java:550)
	at org.apache.hadoop.mapred.TestMiniMRChildTask.testTaskEnv(TestMiniMRChildTask.java:472)


FAILED:  org.apache.hadoop.mapred.TestMiniMRChildTask.testTaskOldEnv

Error Message:
The environment checker job failed.

Stack Trace:
java.lang.AssertionError: The environment checker job failed.
	at org.junit.Assert.fail(Assert.java:88)
	at org.junit.Assert.assertTrue(Assert.java:41)
	at org.apache.hadoop.mapred.TestMiniMRChildTask.runTestTaskEnv(TestMiniMRChildTask.java:550)
	at org.apache.hadoop.mapred.TestMiniMRChildTask.testTaskOldEnv(TestMiniMRChildTask.java:496)




Hadoop-Mapreduce-trunk-Java8 - Build # 1394 - Still Failing

Posted by Apache Jenkins Server <je...@builds.apache.org>.
See https://builds.apache.org/job/Hadoop-Mapreduce-trunk-Java8/1394/

###################################################################################
########################## LAST 60 LINES OF THE CONSOLE ###########################
[...truncated 9505 lines...]
Java HotSpot(TM) 64-Bit Server VM warning: ignoring option MaxPermSize=768m; support was removed in 8.0
Running org.apache.hadoop.mapred.TestJavaSerialization
Tests run: 2, Failures: 0, Errors: 0, Skipped: 0, Time elapsed: 4.011 sec - in org.apache.hadoop.mapred.TestJavaSerialization
Java HotSpot(TM) 64-Bit Server VM warning: ignoring option MaxPermSize=768m; support was removed in 8.0
Running org.apache.hadoop.mapred.TestSpecialCharactersInOutputPath
Tests run: 1, Failures: 0, Errors: 0, Skipped: 0, Time elapsed: 23.365 sec - in org.apache.hadoop.mapred.TestSpecialCharactersInOutputPath
Java HotSpot(TM) 64-Bit Server VM warning: ignoring option MaxPermSize=768m; support was removed in 8.0
Running org.apache.hadoop.ipc.TestMRCJCSocketFactory
Tests run: 1, Failures: 0, Errors: 0, Skipped: 0, Time elapsed: 19.118 sec - in org.apache.hadoop.ipc.TestMRCJCSocketFactory

Results :

Failed tests: 
  TestMiniMRChildTask.testTaskEnv:472->runTestTaskEnv:550 The environment checker job failed.
  TestMiniMRChildTask.testTaskOldEnv:496->runTestTaskEnv:550 The environment checker job failed.

Tests run: 533, Failures: 2, Errors: 0, Skipped: 11

[INFO] ------------------------------------------------------------------------
[INFO] Reactor Summary:
[INFO] 
[INFO] Apache Hadoop MapReduce Client .................... SUCCESS [  2.565 s]
[INFO] Apache Hadoop MapReduce Core ...................... SUCCESS [01:37 min]
[INFO] Apache Hadoop MapReduce Common .................... SUCCESS [ 24.980 s]
[INFO] Apache Hadoop MapReduce Shuffle ................... SUCCESS [  4.351 s]
[INFO] Apache Hadoop MapReduce App ....................... SUCCESS [10:16 min]
[INFO] Apache Hadoop MapReduce HistoryServer ............. SUCCESS [06:20 min]
[INFO] Apache Hadoop MapReduce JobClient ................. FAILURE [  01:42 h]
[INFO] Apache Hadoop MapReduce HistoryServer Plugins ..... SKIPPED
[INFO] Apache Hadoop MapReduce NativeTask ................ SKIPPED
[INFO] Apache Hadoop MapReduce Examples .................. SKIPPED
[INFO] Apache Hadoop MapReduce ........................... SKIPPED
[INFO] ------------------------------------------------------------------------
[INFO] BUILD FAILURE
[INFO] ------------------------------------------------------------------------
[INFO] Total time: 02:01 h
[INFO] Finished at: 2016-05-13T01:43:22+00:00
[INFO] Final Memory: 34M/150M
[INFO] ------------------------------------------------------------------------
[WARNING] The requested profile "parallel-tests" could not be activated because it does not exist.
[ERROR] Failed to execute goal org.apache.maven.plugins:maven-surefire-plugin:2.17:test (default-test) on project hadoop-mapreduce-client-jobclient: There are test failures.
[ERROR] 
[ERROR] Please refer to /home/jenkins/jenkins-slave/workspace/Hadoop-Mapreduce-trunk-Java8/hadoop-mapreduce-project/hadoop-mapreduce-client/hadoop-mapreduce-client-jobclient/target/surefire-reports for the individual test results.
[ERROR] -> [Help 1]
[ERROR] 
[ERROR] To see the full stack trace of the errors, re-run Maven with the -e switch.
[ERROR] Re-run Maven using the -X switch to enable full debug logging.
[ERROR] 
[ERROR] For more information about the errors and possible solutions, please read the following articles:
[ERROR] [Help 1] http://cwiki.apache.org/confluence/display/MAVEN/MojoFailureException
[ERROR] 
[ERROR] After correcting the problems, you can resume the build with the command
[ERROR]   mvn <goals> -rf :hadoop-mapreduce-client-jobclient
Build step 'Execute shell' marked build as failure
[FINDBUGS] Skipping publisher since build result is FAILURE
Archiving artifacts
Recording test results
Email was triggered for: Failure - Any
Sending email for trigger: Failure - Any



###################################################################################
############################## FAILED TESTS (if any) ##############################
2 tests failed.
FAILED:  org.apache.hadoop.mapred.TestMiniMRChildTask.testTaskEnv

Error Message:
The environment checker job failed.

Stack Trace:
java.lang.AssertionError: The environment checker job failed.
	at org.junit.Assert.fail(Assert.java:88)
	at org.junit.Assert.assertTrue(Assert.java:41)
	at org.apache.hadoop.mapred.TestMiniMRChildTask.runTestTaskEnv(TestMiniMRChildTask.java:550)
	at org.apache.hadoop.mapred.TestMiniMRChildTask.testTaskEnv(TestMiniMRChildTask.java:472)


FAILED:  org.apache.hadoop.mapred.TestMiniMRChildTask.testTaskOldEnv

Error Message:
The environment checker job failed.

Stack Trace:
java.lang.AssertionError: The environment checker job failed.
	at org.junit.Assert.fail(Assert.java:88)
	at org.junit.Assert.assertTrue(Assert.java:41)
	at org.apache.hadoop.mapred.TestMiniMRChildTask.runTestTaskEnv(TestMiniMRChildTask.java:550)
	at org.apache.hadoop.mapred.TestMiniMRChildTask.testTaskOldEnv(TestMiniMRChildTask.java:496)




Hadoop-Mapreduce-trunk-Java8 - Build # 1393 - Still Failing

Posted by Apache Jenkins Server <je...@builds.apache.org>.
See https://builds.apache.org/job/Hadoop-Mapreduce-trunk-Java8/1393/

###################################################################################
########################## LAST 60 LINES OF THE CONSOLE ###########################
[...truncated 8783 lines...]
	at org.apache.hadoop.mapreduce.jobhistory.TestJobHistoryEventHandler.setUpClass(TestJobHistoryEventHandler.java:93)

org.apache.hadoop.mapreduce.jobhistory.TestJobHistoryEventHandler  Time elapsed: 18.503 sec  <<< ERROR!
java.lang.NullPointerException: null
	at org.apache.hadoop.mapreduce.jobhistory.TestJobHistoryEventHandler.cleanUpClass(TestJobHistoryEventHandler.java:98)

Java HotSpot(TM) 64-Bit Server VM warning: ignoring option MaxPermSize=768m; support was removed in 8.0
Running org.apache.hadoop.mapreduce.jobhistory.TestEvents
Tests run: 5, Failures: 0, Errors: 0, Skipped: 0, Time elapsed: 1.072 sec - in org.apache.hadoop.mapreduce.jobhistory.TestEvents

Results :

Tests in error: 
  TestJobHistoryEventHandler.setUpClass:93 » IO Timed out waiting for Mini HDFS ...
  TestJobHistoryEventHandler.cleanUpClass:98 NullPointer

Tests run: 337, Failures: 0, Errors: 2, Skipped: 0

[INFO] ------------------------------------------------------------------------
[INFO] Reactor Summary:
[INFO] 
[INFO] Apache Hadoop MapReduce Client .................... SUCCESS [  4.739 s]
[INFO] Apache Hadoop MapReduce Core ...................... SUCCESS [02:32 min]
[INFO] Apache Hadoop MapReduce Common .................... SUCCESS [ 38.283 s]
[INFO] Apache Hadoop MapReduce Shuffle ................... SUCCESS [  7.566 s]
[INFO] Apache Hadoop MapReduce App ....................... FAILURE [12:49 min]
[INFO] Apache Hadoop MapReduce HistoryServer ............. SKIPPED
[INFO] Apache Hadoop MapReduce JobClient ................. SKIPPED
[INFO] Apache Hadoop MapReduce HistoryServer Plugins ..... SKIPPED
[INFO] Apache Hadoop MapReduce NativeTask ................ SKIPPED
[INFO] Apache Hadoop MapReduce Examples .................. SKIPPED
[INFO] Apache Hadoop MapReduce ........................... SKIPPED
[INFO] ------------------------------------------------------------------------
[INFO] BUILD FAILURE
[INFO] ------------------------------------------------------------------------
[INFO] Total time: 16:13 min
[INFO] Finished at: 2016-05-12T22:35:33+00:00
[INFO] Final Memory: 36M/195M
[INFO] ------------------------------------------------------------------------
[WARNING] The requested profile "parallel-tests" could not be activated because it does not exist.
[ERROR] Failed to execute goal org.apache.maven.plugins:maven-surefire-plugin:2.17:test (default-test) on project hadoop-mapreduce-client-app: There are test failures.
[ERROR] 
[ERROR] Please refer to /home/jenkins/jenkins-slave/workspace/Hadoop-Mapreduce-trunk-Java8/hadoop-mapreduce-project/hadoop-mapreduce-client/hadoop-mapreduce-client-app/target/surefire-reports for the individual test results.
[ERROR] -> [Help 1]
[ERROR] 
[ERROR] To see the full stack trace of the errors, re-run Maven with the -e switch.
[ERROR] Re-run Maven using the -X switch to enable full debug logging.
[ERROR] 
[ERROR] For more information about the errors and possible solutions, please read the following articles:
[ERROR] [Help 1] http://cwiki.apache.org/confluence/display/MAVEN/MojoFailureException
[ERROR] 
[ERROR] After correcting the problems, you can resume the build with the command
[ERROR]   mvn <goals> -rf :hadoop-mapreduce-client-app
Build step 'Execute shell' marked build as failure
[FINDBUGS] Skipping publisher since build result is FAILURE
Archiving artifacts
Recording test results
Email was triggered for: Failure - Any
Sending email for trigger: Failure - Any



###################################################################################
############################## FAILED TESTS (if any) ##############################
2 tests failed.
FAILED:  org.apache.hadoop.mapreduce.jobhistory.TestJobHistoryEventHandler.org.apache.hadoop.mapreduce.jobhistory.TestJobHistoryEventHandler

Error Message:
Timed out waiting for Mini HDFS Cluster to start

Stack Trace:
java.io.IOException: Timed out waiting for Mini HDFS Cluster to start
	at org.apache.hadoop.hdfs.MiniDFSCluster.waitClusterUp(MiniDFSCluster.java:1345)
	at org.apache.hadoop.hdfs.MiniDFSCluster.initMiniDFSCluster(MiniDFSCluster.java:848)
	at org.apache.hadoop.hdfs.MiniDFSCluster.<init>(MiniDFSCluster.java:482)
	at org.apache.hadoop.hdfs.MiniDFSCluster$Builder.build(MiniDFSCluster.java:441)
	at org.apache.hadoop.mapreduce.jobhistory.TestJobHistoryEventHandler.setUpClass(TestJobHistoryEventHandler.java:93)


FAILED:  org.apache.hadoop.mapreduce.jobhistory.TestJobHistoryEventHandler.org.apache.hadoop.mapreduce.jobhistory.TestJobHistoryEventHandler

Error Message:
null

Stack Trace:
java.lang.NullPointerException: null
	at org.apache.hadoop.mapreduce.jobhistory.TestJobHistoryEventHandler.cleanUpClass(TestJobHistoryEventHandler.java:98)




Hadoop-Mapreduce-trunk-Java8 - Build # 1392 - Still Failing

Posted by Apache Jenkins Server <je...@builds.apache.org>.
See https://builds.apache.org/job/Hadoop-Mapreduce-trunk-Java8/1392/

###################################################################################
########################## LAST 60 LINES OF THE CONSOLE ###########################
[...truncated 8781 lines...]
Java HotSpot(TM) 64-Bit Server VM warning: ignoring option MaxPermSize=768m; support was removed in 8.0
Running org.apache.hadoop.mapred.TestTaskAttemptFinishingMonitor
Tests run: 1, Failures: 0, Errors: 0, Skipped: 0, Time elapsed: 1.282 sec - in org.apache.hadoop.mapred.TestTaskAttemptFinishingMonitor
Java HotSpot(TM) 64-Bit Server VM warning: ignoring option MaxPermSize=768m; support was removed in 8.0
Running org.apache.hadoop.mapred.TestTaskAttemptListenerImpl
Tests run: 6, Failures: 0, Errors: 0, Skipped: 0, Time elapsed: 1.004 sec - in org.apache.hadoop.mapred.TestTaskAttemptListenerImpl
Java HotSpot(TM) 64-Bit Server VM warning: ignoring option MaxPermSize=768m; support was removed in 8.0
Running org.apache.hadoop.mapred.TestLocalContainerLauncher
Tests run: 2, Failures: 0, Errors: 0, Skipped: 0, Time elapsed: 1.651 sec - in org.apache.hadoop.mapred.TestLocalContainerLauncher

Results :

Tests in error: 
  TestJobHistoryEventHandler.setUpClass:93 » IO Timed out waiting for Mini HDFS ...
  TestJobHistoryEventHandler.cleanUpClass:98 NullPointer

Tests run: 337, Failures: 0, Errors: 2, Skipped: 0

[INFO] ------------------------------------------------------------------------
[INFO] Reactor Summary:
[INFO] 
[INFO] Apache Hadoop MapReduce Client .................... SUCCESS [  2.065 s]
[INFO] Apache Hadoop MapReduce Core ...................... SUCCESS [01:35 min]
[INFO] Apache Hadoop MapReduce Common .................... SUCCESS [ 24.343 s]
[INFO] Apache Hadoop MapReduce Shuffle ................... SUCCESS [  4.093 s]
[INFO] Apache Hadoop MapReduce App ....................... FAILURE [09:53 min]
[INFO] Apache Hadoop MapReduce HistoryServer ............. SKIPPED
[INFO] Apache Hadoop MapReduce JobClient ................. SKIPPED
[INFO] Apache Hadoop MapReduce HistoryServer Plugins ..... SKIPPED
[INFO] Apache Hadoop MapReduce NativeTask ................ SKIPPED
[INFO] Apache Hadoop MapReduce Examples .................. SKIPPED
[INFO] Apache Hadoop MapReduce ........................... SKIPPED
[INFO] ------------------------------------------------------------------------
[INFO] BUILD FAILURE
[INFO] ------------------------------------------------------------------------
[INFO] Total time: 12:00 min
[INFO] Finished at: 2016-05-12T20:31:28+00:00
[INFO] Final Memory: 35M/220M
[INFO] ------------------------------------------------------------------------
[WARNING] The requested profile "parallel-tests" could not be activated because it does not exist.
[ERROR] Failed to execute goal org.apache.maven.plugins:maven-surefire-plugin:2.17:test (default-test) on project hadoop-mapreduce-client-app: There are test failures.
[ERROR] 
[ERROR] Please refer to /home/jenkins/jenkins-slave/workspace/Hadoop-Mapreduce-trunk-Java8/hadoop-mapreduce-project/hadoop-mapreduce-client/hadoop-mapreduce-client-app/target/surefire-reports for the individual test results.
[ERROR] -> [Help 1]
[ERROR] 
[ERROR] To see the full stack trace of the errors, re-run Maven with the -e switch.
[ERROR] Re-run Maven using the -X switch to enable full debug logging.
[ERROR] 
[ERROR] For more information about the errors and possible solutions, please read the following articles:
[ERROR] [Help 1] http://cwiki.apache.org/confluence/display/MAVEN/MojoFailureException
[ERROR] 
[ERROR] After correcting the problems, you can resume the build with the command
[ERROR]   mvn <goals> -rf :hadoop-mapreduce-client-app
Build step 'Execute shell' marked build as failure
[FINDBUGS] Skipping publisher since build result is FAILURE
Archiving artifacts
Recording test results
Email was triggered for: Failure - Any
Sending email for trigger: Failure - Any



###################################################################################
############################## FAILED TESTS (if any) ##############################
2 tests failed.
FAILED:  org.apache.hadoop.mapreduce.jobhistory.TestJobHistoryEventHandler.org.apache.hadoop.mapreduce.jobhistory.TestJobHistoryEventHandler

Error Message:
Timed out waiting for Mini HDFS Cluster to start

Stack Trace:
java.io.IOException: Timed out waiting for Mini HDFS Cluster to start
	at org.apache.hadoop.hdfs.MiniDFSCluster.waitClusterUp(MiniDFSCluster.java:1345)
	at org.apache.hadoop.hdfs.MiniDFSCluster.initMiniDFSCluster(MiniDFSCluster.java:848)
	at org.apache.hadoop.hdfs.MiniDFSCluster.<init>(MiniDFSCluster.java:482)
	at org.apache.hadoop.hdfs.MiniDFSCluster$Builder.build(MiniDFSCluster.java:441)
	at org.apache.hadoop.mapreduce.jobhistory.TestJobHistoryEventHandler.setUpClass(TestJobHistoryEventHandler.java:93)


FAILED:  org.apache.hadoop.mapreduce.jobhistory.TestJobHistoryEventHandler.org.apache.hadoop.mapreduce.jobhistory.TestJobHistoryEventHandler

Error Message:
null

Stack Trace:
java.lang.NullPointerException: null
	at org.apache.hadoop.mapreduce.jobhistory.TestJobHistoryEventHandler.cleanUpClass(TestJobHistoryEventHandler.java:98)




Hadoop-Mapreduce-trunk-Java8 - Build # 1391 - Still Failing

Posted by Apache Jenkins Server <je...@builds.apache.org>.
See https://builds.apache.org/job/Hadoop-Mapreduce-trunk-Java8/1391/

###################################################################################
########################## LAST 60 LINES OF THE CONSOLE ###########################
[...truncated 9507 lines...]
Java HotSpot(TM) 64-Bit Server VM warning: ignoring option MaxPermSize=768m; support was removed in 8.0
Running org.apache.hadoop.mapreduce.lib.map.TestMultithreadedMapper
Tests run: 3, Failures: 0, Errors: 0, Skipped: 0, Time elapsed: 5.633 sec - in org.apache.hadoop.mapreduce.lib.map.TestMultithreadedMapper
Java HotSpot(TM) 64-Bit Server VM warning: ignoring option MaxPermSize=768m; support was removed in 8.0
Running org.apache.hadoop.mapreduce.TestMapCollection
Tests run: 11, Failures: 0, Errors: 0, Skipped: 0, Time elapsed: 13.57 sec - in org.apache.hadoop.mapreduce.TestMapCollection
Java HotSpot(TM) 64-Bit Server VM warning: ignoring option MaxPermSize=768m; support was removed in 8.0
Running org.apache.hadoop.io.TestSequenceFileMergeProgress
Tests run: 3, Failures: 0, Errors: 0, Skipped: 0, Time elapsed: 1.668 sec - in org.apache.hadoop.io.TestSequenceFileMergeProgress

Results :

Failed tests: 
  TestMiniMRChildTask.testTaskEnv:472->runTestTaskEnv:550 The environment checker job failed.
  TestMiniMRChildTask.testTaskOldEnv:496->runTestTaskEnv:550 The environment checker job failed.

Tests run: 533, Failures: 2, Errors: 0, Skipped: 11

[INFO] ------------------------------------------------------------------------
[INFO] Reactor Summary:
[INFO] 
[INFO] Apache Hadoop MapReduce Client .................... SUCCESS [  3.068 s]
[INFO] Apache Hadoop MapReduce Core ...................... SUCCESS [01:49 min]
[INFO] Apache Hadoop MapReduce Common .................... SUCCESS [ 26.652 s]
[INFO] Apache Hadoop MapReduce Shuffle ................... SUCCESS [  4.890 s]
[INFO] Apache Hadoop MapReduce App ....................... SUCCESS [10:31 min]
[INFO] Apache Hadoop MapReduce HistoryServer ............. SUCCESS [06:37 min]
[INFO] Apache Hadoop MapReduce JobClient ................. FAILURE [  01:48 h]
[INFO] Apache Hadoop MapReduce HistoryServer Plugins ..... SKIPPED
[INFO] Apache Hadoop MapReduce NativeTask ................ SKIPPED
[INFO] Apache Hadoop MapReduce Examples .................. SKIPPED
[INFO] Apache Hadoop MapReduce ........................... SKIPPED
[INFO] ------------------------------------------------------------------------
[INFO] BUILD FAILURE
[INFO] ------------------------------------------------------------------------
[INFO] Total time: 02:07 h
[INFO] Finished at: 2016-05-12T19:09:52+00:00
[INFO] Final Memory: 34M/148M
[INFO] ------------------------------------------------------------------------
[WARNING] The requested profile "parallel-tests" could not be activated because it does not exist.
[ERROR] Failed to execute goal org.apache.maven.plugins:maven-surefire-plugin:2.17:test (default-test) on project hadoop-mapreduce-client-jobclient: There are test failures.
[ERROR] 
[ERROR] Please refer to /home/jenkins/jenkins-slave/workspace/Hadoop-Mapreduce-trunk-Java8/hadoop-mapreduce-project/hadoop-mapreduce-client/hadoop-mapreduce-client-jobclient/target/surefire-reports for the individual test results.
[ERROR] -> [Help 1]
[ERROR] 
[ERROR] To see the full stack trace of the errors, re-run Maven with the -e switch.
[ERROR] Re-run Maven using the -X switch to enable full debug logging.
[ERROR] 
[ERROR] For more information about the errors and possible solutions, please read the following articles:
[ERROR] [Help 1] http://cwiki.apache.org/confluence/display/MAVEN/MojoFailureException
[ERROR] 
[ERROR] After correcting the problems, you can resume the build with the command
[ERROR]   mvn <goals> -rf :hadoop-mapreduce-client-jobclient
Build step 'Execute shell' marked build as failure
[FINDBUGS] Skipping publisher since build result is FAILURE
Archiving artifacts
Recording test results
Email was triggered for: Failure - Any
Sending email for trigger: Failure - Any



###################################################################################
############################## FAILED TESTS (if any) ##############################
2 tests failed.
FAILED:  org.apache.hadoop.mapred.TestMiniMRChildTask.testTaskEnv

Error Message:
The environment checker job failed.

Stack Trace:
java.lang.AssertionError: The environment checker job failed.
	at org.junit.Assert.fail(Assert.java:88)
	at org.junit.Assert.assertTrue(Assert.java:41)
	at org.apache.hadoop.mapred.TestMiniMRChildTask.runTestTaskEnv(TestMiniMRChildTask.java:550)
	at org.apache.hadoop.mapred.TestMiniMRChildTask.testTaskEnv(TestMiniMRChildTask.java:472)


FAILED:  org.apache.hadoop.mapred.TestMiniMRChildTask.testTaskOldEnv

Error Message:
The environment checker job failed.

Stack Trace:
java.lang.AssertionError: The environment checker job failed.
	at org.junit.Assert.fail(Assert.java:88)
	at org.junit.Assert.assertTrue(Assert.java:41)
	at org.apache.hadoop.mapred.TestMiniMRChildTask.runTestTaskEnv(TestMiniMRChildTask.java:550)
	at org.apache.hadoop.mapred.TestMiniMRChildTask.testTaskOldEnv(TestMiniMRChildTask.java:496)




Hadoop-Mapreduce-trunk-Java8 - Build # 1390 - Still Failing

Posted by Apache Jenkins Server <je...@builds.apache.org>.
See https://builds.apache.org/job/Hadoop-Mapreduce-trunk-Java8/1390/

###################################################################################
########################## LAST 60 LINES OF THE CONSOLE ###########################
[...truncated 8434 lines...]
Tests run: 20, Failures: 0, Errors: 0, Skipped: 0, Time elapsed: 4.053 sec - in org.apache.hadoop.mapreduce.lib.output.TestFileOutputCommitter
Java HotSpot(TM) 64-Bit Server VM warning: ignoring option MaxPermSize=768m; support was removed in 8.0
Running org.apache.hadoop.mapreduce.lib.output.TestMapFileOutputFormat
Tests run: 1, Failures: 0, Errors: 0, Skipped: 0, Time elapsed: 0.643 sec - in org.apache.hadoop.mapreduce.lib.output.TestMapFileOutputFormat
Java HotSpot(TM) 64-Bit Server VM warning: ignoring option MaxPermSize=768m; support was removed in 8.0
Running org.apache.hadoop.mapreduce.lib.output.TestPreemptableFileOutputCommitter
Tests run: 1, Failures: 0, Errors: 0, Skipped: 0, Time elapsed: 0.9 sec - in org.apache.hadoop.mapreduce.lib.output.TestPreemptableFileOutputCommitter
Java HotSpot(TM) 64-Bit Server VM warning: ignoring option MaxPermSize=768m; support was removed in 8.0
Running org.apache.hadoop.mapreduce.lib.output.TestFileOutputFormat
Tests run: 2, Failures: 0, Errors: 0, Skipped: 0, Time elapsed: 1.948 sec - in org.apache.hadoop.mapreduce.lib.output.TestFileOutputFormat

Results :

Failed tests: 
  TestCLI.testGetJob:181 null

Tests run: 242, Failures: 1, Errors: 0, Skipped: 0

[INFO] ------------------------------------------------------------------------
[INFO] Reactor Summary:
[INFO] 
[INFO] Apache Hadoop MapReduce Client .................... SUCCESS [  3.922 s]
[INFO] Apache Hadoop MapReduce Core ...................... FAILURE [02:29 min]
[INFO] Apache Hadoop MapReduce Common .................... SKIPPED
[INFO] Apache Hadoop MapReduce Shuffle ................... SKIPPED
[INFO] Apache Hadoop MapReduce App ....................... SKIPPED
[INFO] Apache Hadoop MapReduce HistoryServer ............. SKIPPED
[INFO] Apache Hadoop MapReduce JobClient ................. SKIPPED
[INFO] Apache Hadoop MapReduce HistoryServer Plugins ..... SKIPPED
[INFO] Apache Hadoop MapReduce NativeTask ................ SKIPPED
[INFO] Apache Hadoop MapReduce Examples .................. SKIPPED
[INFO] Apache Hadoop MapReduce ........................... SKIPPED
[INFO] ------------------------------------------------------------------------
[INFO] BUILD FAILURE
[INFO] ------------------------------------------------------------------------
[INFO] Total time: 02:34 min
[INFO] Finished at: 2016-05-12T13:28:16+00:00
[INFO] Final Memory: 32M/203M
[INFO] ------------------------------------------------------------------------
[WARNING] The requested profile "parallel-tests" could not be activated because it does not exist.
[ERROR] Failed to execute goal org.apache.maven.plugins:maven-surefire-plugin:2.17:test (default-test) on project hadoop-mapreduce-client-core: There are test failures.
[ERROR] 
[ERROR] Please refer to /home/jenkins/jenkins-slave/workspace/Hadoop-Mapreduce-trunk-Java8/hadoop-mapreduce-project/hadoop-mapreduce-client/hadoop-mapreduce-client-core/target/surefire-reports for the individual test results.
[ERROR] -> [Help 1]
[ERROR] 
[ERROR] To see the full stack trace of the errors, re-run Maven with the -e switch.
[ERROR] Re-run Maven using the -X switch to enable full debug logging.
[ERROR] 
[ERROR] For more information about the errors and possible solutions, please read the following articles:
[ERROR] [Help 1] http://cwiki.apache.org/confluence/display/MAVEN/MojoFailureException
[ERROR] 
[ERROR] After correcting the problems, you can resume the build with the command
[ERROR]   mvn <goals> -rf :hadoop-mapreduce-client-core
Build step 'Execute shell' marked build as failure
[FINDBUGS] Skipping publisher since build result is FAILURE
Archiving artifacts
Recording test results
Email was triggered for: Failure - Any
Sending email for trigger: Failure - Any



###################################################################################
############################## FAILED TESTS (if any) ##############################
1 tests failed.
FAILED:  org.apache.hadoop.mapreduce.tools.TestCLI.testGetJob

Error Message:
null

Stack Trace:
java.lang.AssertionError: null
	at org.junit.Assert.fail(Assert.java:86)
	at org.junit.Assert.assertTrue(Assert.java:41)
	at org.junit.Assert.assertTrue(Assert.java:52)
	at org.apache.hadoop.mapreduce.tools.TestCLI.testGetJob(TestCLI.java:181)




Hadoop-Mapreduce-trunk-Java8 - Build # 1389 - Still Failing

Posted by Apache Jenkins Server <je...@builds.apache.org>.
See https://builds.apache.org/job/Hadoop-Mapreduce-trunk-Java8/1389/

###################################################################################
########################## LAST 60 LINES OF THE CONSOLE ###########################
[...truncated 8942 lines...]
Running org.apache.hadoop.mapred.TestTaskAttemptListenerImpl
Tests run: 6, Failures: 0, Errors: 0, Skipped: 0, Time elapsed: 1.097 sec - in org.apache.hadoop.mapred.TestTaskAttemptListenerImpl
Java HotSpot(TM) 64-Bit Server VM warning: ignoring option MaxPermSize=768m; support was removed in 8.0
Running org.apache.hadoop.mapred.TestLocalContainerLauncher
Tests run: 2, Failures: 0, Errors: 0, Skipped: 0, Time elapsed: 1.951 sec - in org.apache.hadoop.mapred.TestLocalContainerLauncher

Results :

Tests in error: 
  TestStagingCleanup.testStagingCleanupOrder:469 » NoClassDefFound org/apache/ha...
  TestKill.testKillTaskAttempt:363 » NoClassDefFound org/apache/hadoop/yarn/even...
  TestKill.testKillTaskWaitKillJobAfterTA_DONE:221 » Metrics Metrics source MRAp...
  TestKill.testKillJob:63 » Metrics Metrics source MRAppMetrics already exists!
  TestKill.testKillTaskWaitKillJobBeforeTA_DONE:269 » Metrics Metrics source MRA...
  TestKill.testKillTask:98 » Metrics Metrics source MRAppMetrics already exists!
  TestKill.testKillTaskWait:183 » Metrics Metrics source MRAppMetrics already ex...

Tests run: 325, Failures: 0, Errors: 6, Skipped: 0

[INFO] ------------------------------------------------------------------------
[INFO] Reactor Summary:
[INFO] 
[INFO] Apache Hadoop MapReduce Client .................... SUCCESS [  2.427 s]
[INFO] Apache Hadoop MapReduce Core ...................... SUCCESS [01:40 min]
[INFO] Apache Hadoop MapReduce Common .................... SUCCESS [ 24.904 s]
[INFO] Apache Hadoop MapReduce Shuffle ................... SUCCESS [  4.404 s]
[INFO] Apache Hadoop MapReduce App ....................... FAILURE [08:44 min]
[INFO] Apache Hadoop MapReduce HistoryServer ............. SKIPPED
[INFO] Apache Hadoop MapReduce JobClient ................. SKIPPED
[INFO] Apache Hadoop MapReduce HistoryServer Plugins ..... SKIPPED
[INFO] Apache Hadoop MapReduce NativeTask ................ SKIPPED
[INFO] Apache Hadoop MapReduce Examples .................. SKIPPED
[INFO] Apache Hadoop MapReduce ........................... SKIPPED
[INFO] ------------------------------------------------------------------------
[INFO] BUILD FAILURE
[INFO] ------------------------------------------------------------------------
[INFO] Total time: 10:56 min
[INFO] Finished at: 2016-05-12T10:43:38+00:00
[INFO] Final Memory: 35M/207M
[INFO] ------------------------------------------------------------------------
[WARNING] The requested profile "parallel-tests" could not be activated because it does not exist.
[ERROR] Failed to execute goal org.apache.maven.plugins:maven-surefire-plugin:2.17:test (default-test) on project hadoop-mapreduce-client-app: ExecutionException: java.lang.RuntimeException: The forked VM terminated without properly saying goodbye. VM crash or System.exit called?
[ERROR] Command was /bin/sh -c cd /home/jenkins/jenkins-slave/workspace/Hadoop-Mapreduce-trunk-Java8/hadoop-mapreduce-project/hadoop-mapreduce-client/hadoop-mapreduce-client-app && /home/jenkins/tools/java/jdk1.8.0/jre/bin/java -Xmx2048m -XX:MaxPermSize=768m -XX:+HeapDumpOnOutOfMemoryError -jar /home/jenkins/jenkins-slave/workspace/Hadoop-Mapreduce-trunk-Java8/hadoop-mapreduce-project/hadoop-mapreduce-client/hadoop-mapreduce-client-app/target/surefire/surefirebooter8640392248720330213.jar /home/jenkins/jenkins-slave/workspace/Hadoop-Mapreduce-trunk-Java8/hadoop-mapreduce-project/hadoop-mapreduce-client/hadoop-mapreduce-client-app/target/surefire/surefire6087002405944488634tmp /home/jenkins/jenkins-slave/workspace/Hadoop-Mapreduce-trunk-Java8/hadoop-mapreduce-project/hadoop-mapreduce-client/hadoop-mapreduce-client-app/target/surefire/surefire_782159756869816404064tmp
[ERROR] -> [Help 1]
[ERROR] 
[ERROR] To see the full stack trace of the errors, re-run Maven with the -e switch.
[ERROR] Re-run Maven using the -X switch to enable full debug logging.
[ERROR] 
[ERROR] For more information about the errors and possible solutions, please read the following articles:
[ERROR] [Help 1] http://cwiki.apache.org/confluence/display/MAVEN/MojoFailureException
[ERROR] 
[ERROR] After correcting the problems, you can resume the build with the command
[ERROR]   mvn <goals> -rf :hadoop-mapreduce-client-app
Build step 'Execute shell' marked build as failure
[FINDBUGS] Skipping publisher since build result is FAILURE
Archiving artifacts
Recording test results
Email was triggered for: Failure - Any
Sending email for trigger: Failure - Any



###################################################################################
############################## FAILED TESTS (if any) ##############################
6 tests failed.
FAILED:  org.apache.hadoop.mapreduce.v2.app.TestKill.testKillTaskAttempt

Error Message:
org/apache/hadoop/yarn/event/AsyncDispatcher$1

Stack Trace:
java.lang.NoClassDefFoundError: org/apache/hadoop/yarn/event/AsyncDispatcher$1
	at java.net.URLClassLoader$1.run(URLClassLoader.java:372)
	at java.net.URLClassLoader$1.run(URLClassLoader.java:361)
	at java.security.AccessController.doPrivileged(Native Method)
	at java.net.URLClassLoader.findClass(URLClassLoader.java:360)
	at java.lang.ClassLoader.loadClass(ClassLoader.java:424)
	at sun.misc.Launcher$AppClassLoader.loadClass(Launcher.java:308)
	at java.lang.ClassLoader.loadClass(ClassLoader.java:357)
	at org.apache.hadoop.yarn.event.AsyncDispatcher.createThread(AsyncDispatcher.java:85)
	at org.apache.hadoop.yarn.event.AsyncDispatcher.serviceStart(AsyncDispatcher.java:129)
	at org.apache.hadoop.service.AbstractService.start(AbstractService.java:193)
	at org.apache.hadoop.service.CompositeService.serviceStart(CompositeService.java:120)
	at org.apache.hadoop.mapreduce.v2.app.MRAppMaster.serviceStart(MRAppMaster.java:1226)
	at org.apache.hadoop.service.AbstractService.start(AbstractService.java:193)
	at org.apache.hadoop.mapreduce.v2.app.MRApp.submit(MRApp.java:301)
	at org.apache.hadoop.mapreduce.v2.app.MRApp.submit(MRApp.java:285)
	at org.apache.hadoop.mapreduce.v2.app.TestKill.testKillTaskAttempt(TestKill.java:363)


FAILED:  org.apache.hadoop.mapreduce.v2.app.TestKill.testKillTaskWaitKillJobAfterTA_DONE

Error Message:
Metrics source MRAppMetrics already exists!

Stack Trace:
org.apache.hadoop.metrics2.MetricsException: Metrics source MRAppMetrics already exists!
	at org.apache.hadoop.metrics2.lib.DefaultMetricsSystem.newSourceName(DefaultMetricsSystem.java:143)
	at org.apache.hadoop.metrics2.lib.DefaultMetricsSystem.sourceName(DefaultMetricsSystem.java:120)
	at org.apache.hadoop.metrics2.impl.MetricsSystemImpl.register(MetricsSystemImpl.java:229)
	at org.apache.hadoop.metrics2.MetricsSystem.register(MetricsSystem.java:71)
	at org.apache.hadoop.mapreduce.v2.app.metrics.MRAppMetrics.create(MRAppMetrics.java:59)
	at org.apache.hadoop.mapreduce.v2.app.metrics.MRAppMetrics.create(MRAppMetrics.java:54)
	at org.apache.hadoop.mapreduce.v2.app.MRAppMaster.<init>(MRAppMaster.java:263)
	at org.apache.hadoop.mapreduce.v2.app.MRApp.<init>(MRApp.java:235)
	at org.apache.hadoop.mapreduce.v2.app.MRApp.<init>(MRApp.java:212)
	at org.apache.hadoop.mapreduce.v2.app.MRApp.<init>(MRApp.java:193)
	at org.apache.hadoop.mapreduce.v2.app.MRApp.<init>(MRApp.java:154)
	at org.apache.hadoop.mapreduce.v2.app.TestKill$3.<init>(TestKill.java:221)
	at org.apache.hadoop.mapreduce.v2.app.TestKill.testKillTaskWaitKillJobAfterTA_DONE(TestKill.java:221)


FAILED:  org.apache.hadoop.mapreduce.v2.app.TestKill.testKillJob

Error Message:
Metrics source MRAppMetrics already exists!

Stack Trace:
org.apache.hadoop.metrics2.MetricsException: Metrics source MRAppMetrics already exists!
	at org.apache.hadoop.metrics2.lib.DefaultMetricsSystem.newSourceName(DefaultMetricsSystem.java:143)
	at org.apache.hadoop.metrics2.lib.DefaultMetricsSystem.sourceName(DefaultMetricsSystem.java:120)
	at org.apache.hadoop.metrics2.impl.MetricsSystemImpl.register(MetricsSystemImpl.java:229)
	at org.apache.hadoop.metrics2.MetricsSystem.register(MetricsSystem.java:71)
	at org.apache.hadoop.mapreduce.v2.app.metrics.MRAppMetrics.create(MRAppMetrics.java:59)
	at org.apache.hadoop.mapreduce.v2.app.metrics.MRAppMetrics.create(MRAppMetrics.java:54)
	at org.apache.hadoop.mapreduce.v2.app.MRAppMaster.<init>(MRAppMaster.java:263)
	at org.apache.hadoop.mapreduce.v2.app.MRApp.<init>(MRApp.java:235)
	at org.apache.hadoop.mapreduce.v2.app.MRApp.<init>(MRApp.java:212)
	at org.apache.hadoop.mapreduce.v2.app.MRApp.<init>(MRApp.java:193)
	at org.apache.hadoop.mapreduce.v2.app.MRApp.<init>(MRApp.java:154)
	at org.apache.hadoop.mapreduce.v2.app.TestKill$BlockingMRApp.<init>(TestKill.java:417)
	at org.apache.hadoop.mapreduce.v2.app.TestKill.testKillJob(TestKill.java:63)


FAILED:  org.apache.hadoop.mapreduce.v2.app.TestKill.testKillTaskWaitKillJobBeforeTA_DONE

Error Message:
Metrics source MRAppMetrics already exists!

Stack Trace:
org.apache.hadoop.metrics2.MetricsException: Metrics source MRAppMetrics already exists!
	at org.apache.hadoop.metrics2.lib.DefaultMetricsSystem.newSourceName(DefaultMetricsSystem.java:143)
	at org.apache.hadoop.metrics2.lib.DefaultMetricsSystem.sourceName(DefaultMetricsSystem.java:120)
	at org.apache.hadoop.metrics2.impl.MetricsSystemImpl.register(MetricsSystemImpl.java:229)
	at org.apache.hadoop.metrics2.MetricsSystem.register(MetricsSystem.java:71)
	at org.apache.hadoop.mapreduce.v2.app.metrics.MRAppMetrics.create(MRAppMetrics.java:59)
	at org.apache.hadoop.mapreduce.v2.app.metrics.MRAppMetrics.create(MRAppMetrics.java:54)
	at org.apache.hadoop.mapreduce.v2.app.MRAppMaster.<init>(MRAppMaster.java:263)
	at org.apache.hadoop.mapreduce.v2.app.MRApp.<init>(MRApp.java:235)
	at org.apache.hadoop.mapreduce.v2.app.MRApp.<init>(MRApp.java:212)
	at org.apache.hadoop.mapreduce.v2.app.MRApp.<init>(MRApp.java:193)
	at org.apache.hadoop.mapreduce.v2.app.MRApp.<init>(MRApp.java:154)
	at org.apache.hadoop.mapreduce.v2.app.TestKill$4.<init>(TestKill.java:269)
	at org.apache.hadoop.mapreduce.v2.app.TestKill.testKillTaskWaitKillJobBeforeTA_DONE(TestKill.java:269)


FAILED:  org.apache.hadoop.mapreduce.v2.app.TestKill.testKillTask

Error Message:
Metrics source MRAppMetrics already exists!

Stack Trace:
org.apache.hadoop.metrics2.MetricsException: Metrics source MRAppMetrics already exists!
	at org.apache.hadoop.metrics2.lib.DefaultMetricsSystem.newSourceName(DefaultMetricsSystem.java:143)
	at org.apache.hadoop.metrics2.lib.DefaultMetricsSystem.sourceName(DefaultMetricsSystem.java:120)
	at org.apache.hadoop.metrics2.impl.MetricsSystemImpl.register(MetricsSystemImpl.java:229)
	at org.apache.hadoop.metrics2.MetricsSystem.register(MetricsSystem.java:71)
	at org.apache.hadoop.mapreduce.v2.app.metrics.MRAppMetrics.create(MRAppMetrics.java:59)
	at org.apache.hadoop.mapreduce.v2.app.metrics.MRAppMetrics.create(MRAppMetrics.java:54)
	at org.apache.hadoop.mapreduce.v2.app.MRAppMaster.<init>(MRAppMaster.java:263)
	at org.apache.hadoop.mapreduce.v2.app.MRApp.<init>(MRApp.java:235)
	at org.apache.hadoop.mapreduce.v2.app.MRApp.<init>(MRApp.java:212)
	at org.apache.hadoop.mapreduce.v2.app.MRApp.<init>(MRApp.java:193)
	at org.apache.hadoop.mapreduce.v2.app.MRApp.<init>(MRApp.java:154)
	at org.apache.hadoop.mapreduce.v2.app.TestKill$BlockingMRApp.<init>(TestKill.java:417)
	at org.apache.hadoop.mapreduce.v2.app.TestKill.testKillTask(TestKill.java:98)


FAILED:  org.apache.hadoop.mapreduce.v2.app.TestKill.testKillTaskWait

Error Message:
Metrics source MRAppMetrics already exists!

Stack Trace:
org.apache.hadoop.metrics2.MetricsException: Metrics source MRAppMetrics already exists!
	at org.apache.hadoop.metrics2.lib.DefaultMetricsSystem.newSourceName(DefaultMetricsSystem.java:143)
	at org.apache.hadoop.metrics2.lib.DefaultMetricsSystem.sourceName(DefaultMetricsSystem.java:120)
	at org.apache.hadoop.metrics2.impl.MetricsSystemImpl.register(MetricsSystemImpl.java:229)
	at org.apache.hadoop.metrics2.MetricsSystem.register(MetricsSystem.java:71)
	at org.apache.hadoop.mapreduce.v2.app.metrics.MRAppMetrics.create(MRAppMetrics.java:59)
	at org.apache.hadoop.mapreduce.v2.app.metrics.MRAppMetrics.create(MRAppMetrics.java:54)
	at org.apache.hadoop.mapreduce.v2.app.MRAppMaster.<init>(MRAppMaster.java:263)
	at org.apache.hadoop.mapreduce.v2.app.MRApp.<init>(MRApp.java:235)
	at org.apache.hadoop.mapreduce.v2.app.MRApp.<init>(MRApp.java:212)
	at org.apache.hadoop.mapreduce.v2.app.MRApp.<init>(MRApp.java:193)
	at org.apache.hadoop.mapreduce.v2.app.MRApp.<init>(MRApp.java:154)
	at org.apache.hadoop.mapreduce.v2.app.TestKill$2.<init>(TestKill.java:183)
	at org.apache.hadoop.mapreduce.v2.app.TestKill.testKillTaskWait(TestKill.java:183)




Hadoop-Mapreduce-trunk-Java8 - Build # 1388 - Still Failing

Posted by Apache Jenkins Server <je...@builds.apache.org>.
See https://builds.apache.org/job/Hadoop-Mapreduce-trunk-Java8/1388/

###################################################################################
########################## LAST 60 LINES OF THE CONSOLE ###########################
[...truncated 9269 lines...]
  TestHsWebServicesAcls.testGetJobConfAcls:138 » NoClassDefFound Could not initi...
  TestHsWebServicesAcls.testGetJobTaskAcls:172 » NoClassDefFound Could not initi...
  TestHsWebServicesAcls.testGetJobTasksAcls:155 » NoClassDefFound Could not init...
  TestHsWebServicesAcls.testGetJobTaskAttemptIdCountersAcls:242 » NoClassDefFound
  TestJobHistoryEntities.testCopmletedJobReportWithZeroTasks:125 » NoClassDefFound
  TestJobHistoryEntities.testGetTaskAttemptCompletionEvent:210 » NoClassDefFound
  TestJobHistoryEntities.testCompletedTaskAttempt:171 » NoClassDefFound org/apac...
  TestJobHistoryEntities.testCompletedJob:99 » NoClassDefFound org/apache/hadoop...
  TestJobHistoryEntities.testCompletedJobWithDiagnostics:264 » NoClassDefFound o...
  TestJobHistoryEntities.testCompletedTask:142 » NoClassDefFound org/apache/hado...
  TestJobHistoryEntities.testCopmletedJobReportWithZeroTasks:125 » NoClassDefFound
  TestJobHistoryEntities.testGetTaskAttemptCompletionEvent:210 » NoClassDefFound
  TestJobHistoryEntities.testCompletedTaskAttempt:171 » NoClassDefFound org/apac...
  TestJobHistoryEntities.testCompletedJob:99 » NoClassDefFound org/apache/hadoop...
  TestJobHistoryEntities.testCompletedJobWithDiagnostics:264 » NoClassDefFound o...
  TestJobHistoryEntities.testCompletedTask:142 » NoClassDefFound org/apache/hado...

Tests run: 207, Failures: 8, Errors: 21, Skipped: 0

[INFO] ------------------------------------------------------------------------
[INFO] Reactor Summary:
[INFO] 
[INFO] Apache Hadoop MapReduce Client .................... SUCCESS [  2.412 s]
[INFO] Apache Hadoop MapReduce Core ...................... SUCCESS [01:38 min]
[INFO] Apache Hadoop MapReduce Common .................... SUCCESS [ 25.213 s]
[INFO] Apache Hadoop MapReduce Shuffle ................... SUCCESS [  4.639 s]
[INFO] Apache Hadoop MapReduce App ....................... SUCCESS [10:32 min]
[INFO] Apache Hadoop MapReduce HistoryServer ............. FAILURE [06:05 min]
[INFO] Apache Hadoop MapReduce JobClient ................. SKIPPED
[INFO] Apache Hadoop MapReduce HistoryServer Plugins ..... SKIPPED
[INFO] Apache Hadoop MapReduce NativeTask ................ SKIPPED
[INFO] Apache Hadoop MapReduce Examples .................. SKIPPED
[INFO] Apache Hadoop MapReduce ........................... SKIPPED
[INFO] ------------------------------------------------------------------------
[INFO] BUILD FAILURE
[INFO] ------------------------------------------------------------------------
[INFO] Total time: 18:49 min
[INFO] Finished at: 2016-05-12T03:15:11+00:00
[INFO] Final Memory: 38M/235M
[INFO] ------------------------------------------------------------------------
[WARNING] The requested profile "parallel-tests" could not be activated because it does not exist.
[ERROR] Failed to execute goal org.apache.maven.plugins:maven-surefire-plugin:2.17:test (default-test) on project hadoop-mapreduce-client-hs: ExecutionException: java.lang.RuntimeException: The forked VM terminated without properly saying goodbye. VM crash or System.exit called?
[ERROR] Command was /bin/sh -c cd /home/jenkins/jenkins-slave/workspace/Hadoop-Mapreduce-trunk-Java8/hadoop-mapreduce-project/hadoop-mapreduce-client/hadoop-mapreduce-client-hs && /home/jenkins/tools/java/jdk1.8.0/jre/bin/java -Xmx2048m -XX:MaxPermSize=768m -XX:+HeapDumpOnOutOfMemoryError -jar /home/jenkins/jenkins-slave/workspace/Hadoop-Mapreduce-trunk-Java8/hadoop-mapreduce-project/hadoop-mapreduce-client/hadoop-mapreduce-client-hs/target/surefire/surefirebooter6451416354686986110.jar /home/jenkins/jenkins-slave/workspace/Hadoop-Mapreduce-trunk-Java8/hadoop-mapreduce-project/hadoop-mapreduce-client/hadoop-mapreduce-client-hs/target/surefire/surefire3460155293781293656tmp /home/jenkins/jenkins-slave/workspace/Hadoop-Mapreduce-trunk-Java8/hadoop-mapreduce-project/hadoop-mapreduce-client/hadoop-mapreduce-client-hs/target/surefire/surefire_133938803200588785492tmp
[ERROR] -> [Help 1]
[ERROR] 
[ERROR] To see the full stack trace of the errors, re-run Maven with the -e switch.
[ERROR] Re-run Maven using the -X switch to enable full debug logging.
[ERROR] 
[ERROR] For more information about the errors and possible solutions, please read the following articles:
[ERROR] [Help 1] http://cwiki.apache.org/confluence/display/MAVEN/MojoFailureException
[ERROR] 
[ERROR] After correcting the problems, you can resume the build with the command
[ERROR]   mvn <goals> -rf :hadoop-mapreduce-client-hs
Build step 'Execute shell' marked build as failure
[FINDBUGS] Skipping publisher since build result is FAILURE
Archiving artifacts
Recording test results
Email was triggered for: Failure - Any
Sending email for trigger: Failure - Any



###################################################################################
############################## FAILED TESTS (if any) ##############################
29 tests failed.
FAILED:  org.apache.hadoop.mapreduce.v2.hs.TestJobHistoryEntities.testCopmletedJobReportWithZeroTasks[0]

Error Message:
org/apache/hadoop/yarn/util/ConverterUtils

Stack Trace:
java.lang.NoClassDefFoundError: org/apache/hadoop/yarn/util/ConverterUtils
	at java.net.URLClassLoader$1.run(URLClassLoader.java:372)
	at java.net.URLClassLoader$1.run(URLClassLoader.java:361)
	at java.security.AccessController.doPrivileged(Native Method)
	at java.net.URLClassLoader.findClass(URLClassLoader.java:360)
	at java.lang.ClassLoader.loadClass(ClassLoader.java:424)
	at sun.misc.Launcher$AppClassLoader.loadClass(Launcher.java:308)
	at java.lang.ClassLoader.loadClass(ClassLoader.java:357)
	at org.apache.hadoop.mapreduce.jobhistory.AMStartedEvent.getAppAttemptId(AMStartedEvent.java:110)
	at org.apache.hadoop.mapreduce.jobhistory.JobHistoryParser.handleAMStartedEvent(JobHistoryParser.java:414)
	at org.apache.hadoop.mapreduce.jobhistory.JobHistoryParser.handleEvent(JobHistoryParser.java:237)
	at org.apache.hadoop.mapreduce.jobhistory.JobHistoryParser.parse(JobHistoryParser.java:112)
	at org.apache.hadoop.mapreduce.jobhistory.JobHistoryParser.parse(JobHistoryParser.java:153)
	at org.apache.hadoop.mapreduce.jobhistory.JobHistoryParser.parse(JobHistoryParser.java:139)
	at org.apache.hadoop.mapreduce.v2.hs.CompletedJob.loadFullHistoryData(CompletedJob.java:369)
	at org.apache.hadoop.mapreduce.v2.hs.CompletedJob.<init>(CompletedJob.java:105)
	at org.apache.hadoop.mapreduce.v2.hs.TestJobHistoryEntities.testCopmletedJobReportWithZeroTasks(TestJobHistoryEntities.java:125)


FAILED:  org.apache.hadoop.mapreduce.v2.hs.TestJobHistoryEntities.testGetTaskAttemptCompletionEvent[0]

Error Message:
org/apache/hadoop/yarn/util/ConverterUtils

Stack Trace:
java.lang.NoClassDefFoundError: org/apache/hadoop/yarn/util/ConverterUtils
	at org.apache.hadoop.mapreduce.jobhistory.AMStartedEvent.getAppAttemptId(AMStartedEvent.java:110)
	at org.apache.hadoop.mapreduce.jobhistory.JobHistoryParser.handleAMStartedEvent(JobHistoryParser.java:414)
	at org.apache.hadoop.mapreduce.jobhistory.JobHistoryParser.handleEvent(JobHistoryParser.java:237)
	at org.apache.hadoop.mapreduce.jobhistory.JobHistoryParser.parse(JobHistoryParser.java:112)
	at org.apache.hadoop.mapreduce.jobhistory.JobHistoryParser.parse(JobHistoryParser.java:153)
	at org.apache.hadoop.mapreduce.jobhistory.JobHistoryParser.parse(JobHistoryParser.java:139)
	at org.apache.hadoop.mapreduce.v2.hs.CompletedJob.loadFullHistoryData(CompletedJob.java:369)
	at org.apache.hadoop.mapreduce.v2.hs.CompletedJob.<init>(CompletedJob.java:105)
	at org.apache.hadoop.mapreduce.v2.hs.TestJobHistoryEntities.testGetTaskAttemptCompletionEvent(TestJobHistoryEntities.java:210)


FAILED:  org.apache.hadoop.mapreduce.v2.hs.TestJobHistoryEntities.testCompletedTaskAttempt[0]

Error Message:
org/apache/hadoop/yarn/util/ConverterUtils

Stack Trace:
java.lang.NoClassDefFoundError: org/apache/hadoop/yarn/util/ConverterUtils
	at org.apache.hadoop.mapreduce.jobhistory.AMStartedEvent.getAppAttemptId(AMStartedEvent.java:110)
	at org.apache.hadoop.mapreduce.jobhistory.JobHistoryParser.handleAMStartedEvent(JobHistoryParser.java:414)
	at org.apache.hadoop.mapreduce.jobhistory.JobHistoryParser.handleEvent(JobHistoryParser.java:237)
	at org.apache.hadoop.mapreduce.jobhistory.JobHistoryParser.parse(JobHistoryParser.java:112)
	at org.apache.hadoop.mapreduce.jobhistory.JobHistoryParser.parse(JobHistoryParser.java:153)
	at org.apache.hadoop.mapreduce.jobhistory.JobHistoryParser.parse(JobHistoryParser.java:139)
	at org.apache.hadoop.mapreduce.v2.hs.CompletedJob.loadFullHistoryData(CompletedJob.java:369)
	at org.apache.hadoop.mapreduce.v2.hs.CompletedJob.<init>(CompletedJob.java:105)
	at org.apache.hadoop.mapreduce.v2.hs.TestJobHistoryEntities.testCompletedTaskAttempt(TestJobHistoryEntities.java:171)


FAILED:  org.apache.hadoop.mapreduce.v2.hs.TestJobHistoryEntities.testCompletedJob[0]

Error Message:
org/apache/hadoop/yarn/util/ConverterUtils

Stack Trace:
java.lang.NoClassDefFoundError: org/apache/hadoop/yarn/util/ConverterUtils
	at org.apache.hadoop.mapreduce.jobhistory.AMStartedEvent.getAppAttemptId(AMStartedEvent.java:110)
	at org.apache.hadoop.mapreduce.jobhistory.JobHistoryParser.handleAMStartedEvent(JobHistoryParser.java:414)
	at org.apache.hadoop.mapreduce.jobhistory.JobHistoryParser.handleEvent(JobHistoryParser.java:237)
	at org.apache.hadoop.mapreduce.jobhistory.JobHistoryParser.parse(JobHistoryParser.java:112)
	at org.apache.hadoop.mapreduce.jobhistory.JobHistoryParser.parse(JobHistoryParser.java:153)
	at org.apache.hadoop.mapreduce.jobhistory.JobHistoryParser.parse(JobHistoryParser.java:139)
	at org.apache.hadoop.mapreduce.v2.hs.CompletedJob.loadFullHistoryData(CompletedJob.java:369)
	at org.apache.hadoop.mapreduce.v2.hs.CompletedJob.<init>(CompletedJob.java:105)
	at org.apache.hadoop.mapreduce.v2.hs.TestJobHistoryEntities.testCompletedJob(TestJobHistoryEntities.java:99)


FAILED:  org.apache.hadoop.mapreduce.v2.hs.TestJobHistoryEntities.testCompletedJobWithDiagnostics[0]

Error Message:
org/apache/hadoop/yarn/api/records/impl/pb/ProtoBase

Stack Trace:
java.lang.NoClassDefFoundError: org/apache/hadoop/yarn/api/records/impl/pb/ProtoBase
	at java.net.URLClassLoader$1.run(URLClassLoader.java:372)
	at java.net.URLClassLoader$1.run(URLClassLoader.java:361)
	at java.security.AccessController.doPrivileged(Native Method)
	at java.net.URLClassLoader.findClass(URLClassLoader.java:360)
	at java.lang.ClassLoader.loadClass(ClassLoader.java:424)
	at sun.misc.Launcher$AppClassLoader.loadClass(Launcher.java:308)
	at java.lang.ClassLoader.loadClass(ClassLoader.java:357)
	at java.lang.ClassLoader.defineClass1(Native Method)
	at java.lang.ClassLoader.defineClass(ClassLoader.java:760)
	at java.security.SecureClassLoader.defineClass(SecureClassLoader.java:142)
	at java.net.URLClassLoader.defineClass(URLClassLoader.java:455)
	at java.net.URLClassLoader.access$100(URLClassLoader.java:73)
	at java.net.URLClassLoader$1.run(URLClassLoader.java:367)
	at java.net.URLClassLoader$1.run(URLClassLoader.java:361)
	at java.security.AccessController.doPrivileged(Native Method)
	at java.net.URLClassLoader.findClass(URLClassLoader.java:360)
	at java.lang.ClassLoader.loadClass(ClassLoader.java:424)
	at sun.misc.Launcher$AppClassLoader.loadClass(Launcher.java:308)
	at java.lang.ClassLoader.loadClass(ClassLoader.java:357)
	at java.lang.Class.forName0(Native Method)
	at java.lang.Class.forName(Class.java:340)
	at org.apache.hadoop.conf.Configuration.getClassByNameOrNull(Configuration.java:2211)
	at org.apache.hadoop.conf.Configuration.getClassByName(Configuration.java:2176)
	at org.apache.hadoop.yarn.factories.impl.pb.RecordFactoryPBImpl.newRecordInstance(RecordFactoryPBImpl.java:56)
	at org.apache.hadoop.yarn.util.Records.newRecord(Records.java:36)
	at org.apache.hadoop.mapreduce.v2.hs.CompletedJob.constructJobReport(CompletedJob.java:137)
	at org.apache.hadoop.mapreduce.v2.hs.CompletedJob.getReport(CompletedJob.java:131)
	at org.apache.hadoop.mapreduce.v2.hs.TestJobHistoryEntities.testCompletedJobWithDiagnostics(TestJobHistoryEntities.java:264)


FAILED:  org.apache.hadoop.mapreduce.v2.hs.TestJobHistoryEntities.testCompletedTask[0]

Error Message:
org/apache/hadoop/yarn/util/ConverterUtils

Stack Trace:
java.lang.NoClassDefFoundError: org/apache/hadoop/yarn/util/ConverterUtils
	at org.apache.hadoop.mapreduce.jobhistory.AMStartedEvent.getAppAttemptId(AMStartedEvent.java:110)
	at org.apache.hadoop.mapreduce.jobhistory.JobHistoryParser.handleAMStartedEvent(JobHistoryParser.java:414)
	at org.apache.hadoop.mapreduce.jobhistory.JobHistoryParser.handleEvent(JobHistoryParser.java:237)
	at org.apache.hadoop.mapreduce.jobhistory.JobHistoryParser.parse(JobHistoryParser.java:112)
	at org.apache.hadoop.mapreduce.jobhistory.JobHistoryParser.parse(JobHistoryParser.java:153)
	at org.apache.hadoop.mapreduce.jobhistory.JobHistoryParser.parse(JobHistoryParser.java:139)
	at org.apache.hadoop.mapreduce.v2.hs.CompletedJob.loadFullHistoryData(CompletedJob.java:369)
	at org.apache.hadoop.mapreduce.v2.hs.CompletedJob.<init>(CompletedJob.java:105)
	at org.apache.hadoop.mapreduce.v2.hs.TestJobHistoryEntities.testCompletedTask(TestJobHistoryEntities.java:142)


FAILED:  org.apache.hadoop.mapreduce.v2.hs.TestJobHistoryEntities.testCopmletedJobReportWithZeroTasks[1]

Error Message:
org/apache/hadoop/yarn/util/ConverterUtils

Stack Trace:
java.lang.NoClassDefFoundError: org/apache/hadoop/yarn/util/ConverterUtils
	at org.apache.hadoop.mapreduce.jobhistory.AMStartedEvent.getAppAttemptId(AMStartedEvent.java:110)
	at org.apache.hadoop.mapreduce.jobhistory.JobHistoryParser.handleAMStartedEvent(JobHistoryParser.java:414)
	at org.apache.hadoop.mapreduce.jobhistory.JobHistoryParser.handleEvent(JobHistoryParser.java:237)
	at org.apache.hadoop.mapreduce.jobhistory.JobHistoryParser.parse(JobHistoryParser.java:112)
	at org.apache.hadoop.mapreduce.jobhistory.JobHistoryParser.parse(JobHistoryParser.java:153)
	at org.apache.hadoop.mapreduce.jobhistory.JobHistoryParser.parse(JobHistoryParser.java:139)
	at org.apache.hadoop.mapreduce.v2.hs.CompletedJob.loadFullHistoryData(CompletedJob.java:369)
	at org.apache.hadoop.mapreduce.v2.hs.CompletedJob.<init>(CompletedJob.java:105)
	at org.apache.hadoop.mapreduce.v2.hs.TestJobHistoryEntities.testCopmletedJobReportWithZeroTasks(TestJobHistoryEntities.java:125)


FAILED:  org.apache.hadoop.mapreduce.v2.hs.TestJobHistoryEntities.testGetTaskAttemptCompletionEvent[1]

Error Message:
org/apache/hadoop/yarn/util/ConverterUtils

Stack Trace:
java.lang.NoClassDefFoundError: org/apache/hadoop/yarn/util/ConverterUtils
	at org.apache.hadoop.mapreduce.jobhistory.AMStartedEvent.getAppAttemptId(AMStartedEvent.java:110)
	at org.apache.hadoop.mapreduce.jobhistory.JobHistoryParser.handleAMStartedEvent(JobHistoryParser.java:414)
	at org.apache.hadoop.mapreduce.jobhistory.JobHistoryParser.handleEvent(JobHistoryParser.java:237)
	at org.apache.hadoop.mapreduce.jobhistory.JobHistoryParser.parse(JobHistoryParser.java:112)
	at org.apache.hadoop.mapreduce.jobhistory.JobHistoryParser.parse(JobHistoryParser.java:153)
	at org.apache.hadoop.mapreduce.jobhistory.JobHistoryParser.parse(JobHistoryParser.java:139)
	at org.apache.hadoop.mapreduce.v2.hs.CompletedJob.loadFullHistoryData(CompletedJob.java:369)
	at org.apache.hadoop.mapreduce.v2.hs.CompletedJob.<init>(CompletedJob.java:105)
	at org.apache.hadoop.mapreduce.v2.hs.TestJobHistoryEntities.testGetTaskAttemptCompletionEvent(TestJobHistoryEntities.java:210)


FAILED:  org.apache.hadoop.mapreduce.v2.hs.TestJobHistoryEntities.testCompletedTaskAttempt[1]

Error Message:
org/apache/hadoop/yarn/util/ConverterUtils

Stack Trace:
java.lang.NoClassDefFoundError: org/apache/hadoop/yarn/util/ConverterUtils
	at org.apache.hadoop.mapreduce.jobhistory.AMStartedEvent.getAppAttemptId(AMStartedEvent.java:110)
	at org.apache.hadoop.mapreduce.jobhistory.JobHistoryParser.handleAMStartedEvent(JobHistoryParser.java:414)
	at org.apache.hadoop.mapreduce.jobhistory.JobHistoryParser.handleEvent(JobHistoryParser.java:237)
	at org.apache.hadoop.mapreduce.jobhistory.JobHistoryParser.parse(JobHistoryParser.java:112)
	at org.apache.hadoop.mapreduce.jobhistory.JobHistoryParser.parse(JobHistoryParser.java:153)
	at org.apache.hadoop.mapreduce.jobhistory.JobHistoryParser.parse(JobHistoryParser.java:139)
	at org.apache.hadoop.mapreduce.v2.hs.CompletedJob.loadFullHistoryData(CompletedJob.java:369)
	at org.apache.hadoop.mapreduce.v2.hs.CompletedJob.<init>(CompletedJob.java:105)
	at org.apache.hadoop.mapreduce.v2.hs.TestJobHistoryEntities.testCompletedTaskAttempt(TestJobHistoryEntities.java:171)


FAILED:  org.apache.hadoop.mapreduce.v2.hs.TestJobHistoryEntities.testCompletedJob[1]

Error Message:
org/apache/hadoop/yarn/util/ConverterUtils

Stack Trace:
java.lang.NoClassDefFoundError: org/apache/hadoop/yarn/util/ConverterUtils
	at org.apache.hadoop.mapreduce.jobhistory.AMStartedEvent.getAppAttemptId(AMStartedEvent.java:110)
	at org.apache.hadoop.mapreduce.jobhistory.JobHistoryParser.handleAMStartedEvent(JobHistoryParser.java:414)
	at org.apache.hadoop.mapreduce.jobhistory.JobHistoryParser.handleEvent(JobHistoryParser.java:237)
	at org.apache.hadoop.mapreduce.jobhistory.JobHistoryParser.parse(JobHistoryParser.java:112)
	at org.apache.hadoop.mapreduce.jobhistory.JobHistoryParser.parse(JobHistoryParser.java:153)
	at org.apache.hadoop.mapreduce.jobhistory.JobHistoryParser.parse(JobHistoryParser.java:139)
	at org.apache.hadoop.mapreduce.v2.hs.CompletedJob.loadFullHistoryData(CompletedJob.java:369)
	at org.apache.hadoop.mapreduce.v2.hs.CompletedJob.<init>(CompletedJob.java:105)
	at org.apache.hadoop.mapreduce.v2.hs.TestJobHistoryEntities.testCompletedJob(TestJobHistoryEntities.java:99)


FAILED:  org.apache.hadoop.mapreduce.v2.hs.TestJobHistoryEntities.testCompletedJobWithDiagnostics[1]

Error Message:
org/apache/hadoop/yarn/api/records/impl/pb/ProtoBase

Stack Trace:
java.lang.NoClassDefFoundError: org/apache/hadoop/yarn/api/records/impl/pb/ProtoBase
	at java.net.URLClassLoader$1.run(URLClassLoader.java:372)
	at java.net.URLClassLoader$1.run(URLClassLoader.java:361)
	at java.security.AccessController.doPrivileged(Native Method)
	at java.net.URLClassLoader.findClass(URLClassLoader.java:360)
	at java.lang.ClassLoader.loadClass(ClassLoader.java:424)
	at sun.misc.Launcher$AppClassLoader.loadClass(Launcher.java:308)
	at java.lang.ClassLoader.loadClass(ClassLoader.java:357)
	at java.lang.ClassLoader.defineClass1(Native Method)
	at java.lang.ClassLoader.defineClass(ClassLoader.java:760)
	at java.security.SecureClassLoader.defineClass(SecureClassLoader.java:142)
	at java.net.URLClassLoader.defineClass(URLClassLoader.java:455)
	at java.net.URLClassLoader.access$100(URLClassLoader.java:73)
	at java.net.URLClassLoader$1.run(URLClassLoader.java:367)
	at java.net.URLClassLoader$1.run(URLClassLoader.java:361)
	at java.security.AccessController.doPrivileged(Native Method)
	at java.net.URLClassLoader.findClass(URLClassLoader.java:360)
	at java.lang.ClassLoader.loadClass(ClassLoader.java:424)
	at sun.misc.Launcher$AppClassLoader.loadClass(Launcher.java:308)
	at java.lang.ClassLoader.loadClass(ClassLoader.java:357)
	at java.lang.Class.forName0(Native Method)
	at java.lang.Class.forName(Class.java:340)
	at org.apache.hadoop.conf.Configuration.getClassByNameOrNull(Configuration.java:2211)
	at org.apache.hadoop.conf.Configuration.getClassByName(Configuration.java:2176)
	at org.apache.hadoop.yarn.factories.impl.pb.RecordFactoryPBImpl.newRecordInstance(RecordFactoryPBImpl.java:56)
	at org.apache.hadoop.yarn.util.Records.newRecord(Records.java:36)
	at org.apache.hadoop.mapreduce.v2.hs.CompletedJob.constructJobReport(CompletedJob.java:137)
	at org.apache.hadoop.mapreduce.v2.hs.CompletedJob.getReport(CompletedJob.java:131)
	at org.apache.hadoop.mapreduce.v2.hs.TestJobHistoryEntities.testCompletedJobWithDiagnostics(TestJobHistoryEntities.java:264)


FAILED:  org.apache.hadoop.mapreduce.v2.hs.TestJobHistoryEntities.testCompletedTask[1]

Error Message:
org/apache/hadoop/yarn/util/ConverterUtils

Stack Trace:
java.lang.NoClassDefFoundError: org/apache/hadoop/yarn/util/ConverterUtils
	at org.apache.hadoop.mapreduce.jobhistory.AMStartedEvent.getAppAttemptId(AMStartedEvent.java:110)
	at org.apache.hadoop.mapreduce.jobhistory.JobHistoryParser.handleAMStartedEvent(JobHistoryParser.java:414)
	at org.apache.hadoop.mapreduce.jobhistory.JobHistoryParser.handleEvent(JobHistoryParser.java:237)
	at org.apache.hadoop.mapreduce.jobhistory.JobHistoryParser.parse(JobHistoryParser.java:112)
	at org.apache.hadoop.mapreduce.jobhistory.JobHistoryParser.parse(JobHistoryParser.java:153)
	at org.apache.hadoop.mapreduce.jobhistory.JobHistoryParser.parse(JobHistoryParser.java:139)
	at org.apache.hadoop.mapreduce.v2.hs.CompletedJob.loadFullHistoryData(CompletedJob.java:369)
	at org.apache.hadoop.mapreduce.v2.hs.CompletedJob.<init>(CompletedJob.java:105)
	at org.apache.hadoop.mapreduce.v2.hs.TestJobHistoryEntities.testCompletedTask(TestJobHistoryEntities.java:142)


FAILED:  org.apache.hadoop.mapreduce.v2.hs.webapp.TestHsWebServices.testHSXML

Error Message:
expected:<application/xml> but was:<text/html; charset=ISO-8859-1>

Stack Trace:
java.lang.AssertionError: expected:<application/xml> but was:<text/html; charset=ISO-8859-1>
	at org.junit.Assert.fail(Assert.java:88)
	at org.junit.Assert.failNotEquals(Assert.java:743)
	at org.junit.Assert.assertEquals(Assert.java:118)
	at org.junit.Assert.assertEquals(Assert.java:144)
	at org.apache.hadoop.mapreduce.v2.hs.webapp.TestHsWebServices.testHSXML(TestHsWebServices.java:154)


FAILED:  org.apache.hadoop.mapreduce.v2.hs.webapp.TestHsWebServices.testInfo

Error Message:
expected:<application/json> but was:<text/html; charset=ISO-8859-1>

Stack Trace:
java.lang.AssertionError: expected:<application/json> but was:<text/html; charset=ISO-8859-1>
	at org.junit.Assert.fail(Assert.java:88)
	at org.junit.Assert.failNotEquals(Assert.java:743)
	at org.junit.Assert.assertEquals(Assert.java:118)
	at org.junit.Assert.assertEquals(Assert.java:144)
	at org.apache.hadoop.mapreduce.v2.hs.webapp.TestHsWebServices.testInfo(TestHsWebServices.java:165)


FAILED:  org.apache.hadoop.mapreduce.v2.hs.webapp.TestHsWebServices.testInfoDefault

Error Message:
expected:<application/json> but was:<text/html; charset=ISO-8859-1>

Stack Trace:
java.lang.AssertionError: expected:<application/json> but was:<text/html; charset=ISO-8859-1>
	at org.junit.Assert.fail(Assert.java:88)
	at org.junit.Assert.failNotEquals(Assert.java:743)
	at org.junit.Assert.assertEquals(Assert.java:118)
	at org.junit.Assert.assertEquals(Assert.java:144)
	at org.apache.hadoop.mapreduce.v2.hs.webapp.TestHsWebServices.testInfoDefault(TestHsWebServices.java:188)


FAILED:  org.apache.hadoop.mapreduce.v2.hs.webapp.TestHsWebServices.testHS

Error Message:
expected:<application/json> but was:<text/html; charset=ISO-8859-1>

Stack Trace:
java.lang.AssertionError: expected:<application/json> but was:<text/html; charset=ISO-8859-1>
	at org.junit.Assert.fail(Assert.java:88)
	at org.junit.Assert.failNotEquals(Assert.java:743)
	at org.junit.Assert.assertEquals(Assert.java:118)
	at org.junit.Assert.assertEquals(Assert.java:144)
	at org.apache.hadoop.mapreduce.v2.hs.webapp.TestHsWebServices.testHS(TestHsWebServices.java:121)


FAILED:  org.apache.hadoop.mapreduce.v2.hs.webapp.TestHsWebServices.testHSDefault

Error Message:
expected:<application/json> but was:<text/html; charset=ISO-8859-1>

Stack Trace:
java.lang.AssertionError: expected:<application/json> but was:<text/html; charset=ISO-8859-1>
	at org.junit.Assert.fail(Assert.java:88)
	at org.junit.Assert.failNotEquals(Assert.java:743)
	at org.junit.Assert.assertEquals(Assert.java:118)
	at org.junit.Assert.assertEquals(Assert.java:144)
	at org.apache.hadoop.mapreduce.v2.hs.webapp.TestHsWebServices.testHSDefault(TestHsWebServices.java:143)


FAILED:  org.apache.hadoop.mapreduce.v2.hs.webapp.TestHsWebServices.testHSSlash

Error Message:
expected:<application/json> but was:<text/html; charset=ISO-8859-1>

Stack Trace:
java.lang.AssertionError: expected:<application/json> but was:<text/html; charset=ISO-8859-1>
	at org.junit.Assert.fail(Assert.java:88)
	at org.junit.Assert.failNotEquals(Assert.java:743)
	at org.junit.Assert.assertEquals(Assert.java:118)
	at org.junit.Assert.assertEquals(Assert.java:144)
	at org.apache.hadoop.mapreduce.v2.hs.webapp.TestHsWebServices.testHSSlash(TestHsWebServices.java:132)


FAILED:  org.apache.hadoop.mapreduce.v2.hs.webapp.TestHsWebServices.testInfoXML

Error Message:
expected:<application/xml> but was:<text/html; charset=ISO-8859-1>

Stack Trace:
java.lang.AssertionError: expected:<application/xml> but was:<text/html; charset=ISO-8859-1>
	at org.junit.Assert.fail(Assert.java:88)
	at org.junit.Assert.failNotEquals(Assert.java:743)
	at org.junit.Assert.assertEquals(Assert.java:118)
	at org.junit.Assert.assertEquals(Assert.java:144)
	at org.apache.hadoop.mapreduce.v2.hs.webapp.TestHsWebServices.testInfoXML(TestHsWebServices.java:200)


FAILED:  org.apache.hadoop.mapreduce.v2.hs.webapp.TestHsWebServices.testInfoSlash

Error Message:
expected:<application/json> but was:<text/html; charset=ISO-8859-1>

Stack Trace:
java.lang.AssertionError: expected:<application/json> but was:<text/html; charset=ISO-8859-1>
	at org.junit.Assert.fail(Assert.java:88)
	at org.junit.Assert.failNotEquals(Assert.java:743)
	at org.junit.Assert.assertEquals(Assert.java:118)
	at org.junit.Assert.assertEquals(Assert.java:144)
	at org.apache.hadoop.mapreduce.v2.hs.webapp.TestHsWebServices.testInfoSlash(TestHsWebServices.java:177)


FAILED:  org.apache.hadoop.mapreduce.v2.hs.webapp.TestHsWebServicesAcls.testGetJobCountersAcls

Error Message:
org/apache/hadoop/util/PlatformName

Stack Trace:
java.lang.NoClassDefFoundError: org/apache/hadoop/util/PlatformName
	at java.net.URLClassLoader$1.run(URLClassLoader.java:372)
	at java.net.URLClassLoader$1.run(URLClassLoader.java:361)
	at java.security.AccessController.doPrivileged(Native Method)
	at java.net.URLClassLoader.findClass(URLClassLoader.java:360)
	at java.lang.ClassLoader.loadClass(ClassLoader.java:424)
	at sun.misc.Launcher$AppClassLoader.loadClass(Launcher.java:308)
	at java.lang.ClassLoader.loadClass(ClassLoader.java:357)
	at org.apache.hadoop.security.UserGroupInformation.getOSLoginModuleName(UserGroupInformation.java:393)
	at org.apache.hadoop.security.UserGroupInformation.<clinit>(UserGroupInformation.java:438)
	at org.apache.hadoop.mapreduce.v2.hs.webapp.HsWebServices.hasAccess(HsWebServices.java:90)
	at org.apache.hadoop.mapreduce.v2.hs.webapp.HsWebServices.checkAccess(HsWebServices.java:97)
	at org.apache.hadoop.mapreduce.v2.hs.webapp.HsWebServices.getJobCounters(HsWebServices.java:253)
	at org.apache.hadoop.mapreduce.v2.hs.webapp.TestHsWebServicesAcls.testGetJobCountersAcls(TestHsWebServicesAcls.java:121)


FAILED:  org.apache.hadoop.mapreduce.v2.hs.webapp.TestHsWebServicesAcls.testGetJobTaskAttemptsAcls

Error Message:
Could not initialize class org.apache.hadoop.security.UserGroupInformation

Stack Trace:
java.lang.NoClassDefFoundError: Could not initialize class org.apache.hadoop.security.UserGroupInformation
	at org.apache.hadoop.mapreduce.v2.hs.webapp.HsWebServices.hasAccess(HsWebServices.java:90)
	at org.apache.hadoop.mapreduce.v2.hs.webapp.HsWebServices.checkAccess(HsWebServices.java:97)
	at org.apache.hadoop.mapreduce.v2.hs.webapp.HsWebServices.getJobTaskAttempts(HsWebServices.java:347)
	at org.apache.hadoop.mapreduce.v2.hs.webapp.TestHsWebServicesAcls.testGetJobTaskAttemptsAcls(TestHsWebServicesAcls.java:206)


FAILED:  org.apache.hadoop.mapreduce.v2.hs.webapp.TestHsWebServicesAcls.testGetJobTaskAttemptIdAcls

Error Message:
Could not initialize class org.apache.hadoop.security.UserGroupInformation

Stack Trace:
java.lang.NoClassDefFoundError: Could not initialize class org.apache.hadoop.security.UserGroupInformation
	at org.apache.hadoop.mapreduce.v2.hs.webapp.HsWebServices.hasAccess(HsWebServices.java:90)
	at org.apache.hadoop.mapreduce.v2.hs.webapp.HsWebServices.checkAccess(HsWebServices.java:97)
	at org.apache.hadoop.mapreduce.v2.hs.webapp.HsWebServices.getJobTaskAttemptId(HsWebServices.java:370)
	at org.apache.hadoop.mapreduce.v2.hs.webapp.TestHsWebServicesAcls.testGetJobTaskAttemptIdAcls(TestHsWebServicesAcls.java:223)


FAILED:  org.apache.hadoop.mapreduce.v2.hs.webapp.TestHsWebServicesAcls.testGetSingleTaskCountersAcls

Error Message:
Could not initialize class org.apache.hadoop.security.UserGroupInformation

Stack Trace:
java.lang.NoClassDefFoundError: Could not initialize class org.apache.hadoop.security.UserGroupInformation
	at org.apache.hadoop.mapreduce.v2.hs.webapp.HsWebServices.hasAccess(HsWebServices.java:90)
	at org.apache.hadoop.mapreduce.v2.hs.webapp.HsWebServices.checkAccess(HsWebServices.java:97)
	at org.apache.hadoop.mapreduce.v2.hs.webapp.HsWebServices.getSingleTaskCounters(HsWebServices.java:326)
	at org.apache.hadoop.mapreduce.v2.hs.webapp.TestHsWebServicesAcls.testGetSingleTaskCountersAcls(TestHsWebServicesAcls.java:189)


FAILED:  org.apache.hadoop.mapreduce.v2.hs.webapp.TestHsWebServicesAcls.testGetJobAcls

Error Message:
Could not initialize class org.apache.hadoop.security.UserGroupInformation

Stack Trace:
java.lang.NoClassDefFoundError: Could not initialize class org.apache.hadoop.security.UserGroupInformation
	at org.apache.hadoop.mapreduce.v2.hs.webapp.HsWebServices.hasAccess(HsWebServices.java:90)
	at org.apache.hadoop.mapreduce.v2.hs.webapp.HsWebServices.checkAccess(HsWebServices.java:97)
	at org.apache.hadoop.mapreduce.v2.hs.webapp.HsWebServices.getJob(HsWebServices.java:224)
	at org.apache.hadoop.mapreduce.v2.hs.webapp.TestHsWebServicesAcls.testGetJobAcls(TestHsWebServicesAcls.java:104)


FAILED:  org.apache.hadoop.mapreduce.v2.hs.webapp.TestHsWebServicesAcls.testGetJobConfAcls

Error Message:
Could not initialize class org.apache.hadoop.security.UserGroupInformation

Stack Trace:
java.lang.NoClassDefFoundError: Could not initialize class org.apache.hadoop.security.UserGroupInformation
	at org.apache.hadoop.mapreduce.v2.hs.webapp.HsWebServices.hasAccess(HsWebServices.java:90)
	at org.apache.hadoop.mapreduce.v2.hs.webapp.HsWebServices.checkAccess(HsWebServices.java:97)
	at org.apache.hadoop.mapreduce.v2.hs.webapp.HsWebServices.getJobConf(HsWebServices.java:265)
	at org.apache.hadoop.mapreduce.v2.hs.webapp.TestHsWebServicesAcls.testGetJobConfAcls(TestHsWebServicesAcls.java:138)


FAILED:  org.apache.hadoop.mapreduce.v2.hs.webapp.TestHsWebServicesAcls.testGetJobTaskAcls

Error Message:
Could not initialize class org.apache.hadoop.security.UserGroupInformation

Stack Trace:
java.lang.NoClassDefFoundError: Could not initialize class org.apache.hadoop.security.UserGroupInformation
	at org.apache.hadoop.mapreduce.v2.hs.webapp.HsWebServices.hasAccess(HsWebServices.java:90)
	at org.apache.hadoop.mapreduce.v2.hs.webapp.HsWebServices.checkAccess(HsWebServices.java:97)
	at org.apache.hadoop.mapreduce.v2.hs.webapp.HsWebServices.getJobTask(HsWebServices.java:311)
	at org.apache.hadoop.mapreduce.v2.hs.webapp.TestHsWebServicesAcls.testGetJobTaskAcls(TestHsWebServicesAcls.java:172)


FAILED:  org.apache.hadoop.mapreduce.v2.hs.webapp.TestHsWebServicesAcls.testGetJobTasksAcls

Error Message:
Could not initialize class org.apache.hadoop.security.UserGroupInformation

Stack Trace:
java.lang.NoClassDefFoundError: Could not initialize class org.apache.hadoop.security.UserGroupInformation
	at org.apache.hadoop.mapreduce.v2.hs.webapp.HsWebServices.hasAccess(HsWebServices.java:90)
	at org.apache.hadoop.mapreduce.v2.hs.webapp.HsWebServices.checkAccess(HsWebServices.java:97)
	at org.apache.hadoop.mapreduce.v2.hs.webapp.HsWebServices.getJobTasks(HsWebServices.java:284)
	at org.apache.hadoop.mapreduce.v2.hs.webapp.TestHsWebServicesAcls.testGetJobTasksAcls(TestHsWebServicesAcls.java:155)


FAILED:  org.apache.hadoop.mapreduce.v2.hs.webapp.TestHsWebServicesAcls.testGetJobTaskAttemptIdCountersAcls

Error Message:
Could not initialize class org.apache.hadoop.security.UserGroupInformation

Stack Trace:
java.lang.NoClassDefFoundError: Could not initialize class org.apache.hadoop.security.UserGroupInformation
	at org.apache.hadoop.mapreduce.v2.hs.webapp.HsWebServices.hasAccess(HsWebServices.java:90)
	at org.apache.hadoop.mapreduce.v2.hs.webapp.HsWebServices.checkAccess(HsWebServices.java:97)
	at org.apache.hadoop.mapreduce.v2.hs.webapp.HsWebServices.getJobTaskAttemptIdCounters(HsWebServices.java:390)
	at org.apache.hadoop.mapreduce.v2.hs.webapp.TestHsWebServicesAcls.testGetJobTaskAttemptIdCountersAcls(TestHsWebServicesAcls.java:242)