You are viewing a plain text version of this content. The canonical link for it is here.
Posted to issues@flink.apache.org by "Chesnay Schepler (Jira)" <ji...@apache.org> on 2021/08/17 07:58:00 UTC

[jira] [Assigned] (FLINK-23362) ClientTest.testSimpleRequests fails due to timeout on azure

     [ https://issues.apache.org/jira/browse/FLINK-23362?page=com.atlassian.jira.plugin.system.issuetabpanels:all-tabpanel ]

Chesnay Schepler reassigned FLINK-23362:
----------------------------------------

    Assignee: Chesnay Schepler

> ClientTest.testSimpleRequests fails due to timeout on azure
> -----------------------------------------------------------
>
>                 Key: FLINK-23362
>                 URL: https://issues.apache.org/jira/browse/FLINK-23362
>             Project: Flink
>          Issue Type: Bug
>          Components: Runtime / Queryable State
>    Affects Versions: 1.12.4
>            Reporter: Xintong Song
>            Assignee: Chesnay Schepler
>            Priority: Major
>              Labels: test-stability
>             Fix For: 1.12.6
>
>
> https://dev.azure.com/apache-flink/apache-flink/_build/results?buildId=20347&view=logs&j=d44f43ce-542c-597d-bf94-b0718c71e5e8&t=03dca39c-73e8-5aaf-601d-328ae5c35f20&l=14440
> {code}
> [ERROR] Tests run: 6, Failures: 1, Errors: 0, Skipped: 0, Time elapsed: 22.994 s <<< FAILURE! - in org.apache.flink.queryablestate.network.ClientTest
> [ERROR] testSimpleRequests(org.apache.flink.queryablestate.network.ClientTest)  Time elapsed: 20.055 s  <<< FAILURE!
> java.lang.AssertionError: Receive timed out
> 	at org.junit.Assert.fail(Assert.java:88)
> 	at org.junit.Assert.assertTrue(Assert.java:41)
> 	at org.junit.Assert.assertNotNull(Assert.java:712)
> 	at org.apache.flink.queryablestate.network.ClientTest.testSimpleRequests(ClientTest.java:177)
> 	at sun.reflect.NativeMethodAccessorImpl.invoke0(Native Method)
> 	at sun.reflect.NativeMethodAccessorImpl.invoke(NativeMethodAccessorImpl.java:62)
> 	at sun.reflect.DelegatingMethodAccessorImpl.invoke(DelegatingMethodAccessorImpl.java:43)
> 	at java.lang.reflect.Method.invoke(Method.java:498)
> 	at org.junit.runners.model.FrameworkMethod$1.runReflectiveCall(FrameworkMethod.java:50)
> 	at org.junit.internal.runners.model.ReflectiveCallable.run(ReflectiveCallable.java:12)
> 	at org.junit.runners.model.FrameworkMethod.invokeExplosively(FrameworkMethod.java:47)
> 	at org.junit.internal.runners.statements.InvokeMethod.evaluate(InvokeMethod.java:17)
> 	at org.junit.internal.runners.statements.RunBefores.evaluate(RunBefores.java:26)
> 	at org.junit.internal.runners.statements.RunAfters.evaluate(RunAfters.java:27)
> 	at org.junit.rules.TestWatcher$1.evaluate(TestWatcher.java:55)
> 	at org.junit.rules.RunRules.evaluate(RunRules.java:20)
> 	at org.junit.runners.ParentRunner.runLeaf(ParentRunner.java:325)
> 	at org.junit.runners.BlockJUnit4ClassRunner.runChild(BlockJUnit4ClassRunner.java:78)
> 	at org.junit.runners.BlockJUnit4ClassRunner.runChild(BlockJUnit4ClassRunner.java:57)
> 	at org.junit.runners.ParentRunner$3.run(ParentRunner.java:290)
> 	at org.junit.runners.ParentRunner$1.schedule(ParentRunner.java:71)
> 	at org.junit.runners.ParentRunner.runChildren(ParentRunner.java:288)
> 	at org.junit.runners.ParentRunner.access$000(ParentRunner.java:58)
> 	at org.junit.runners.ParentRunner$2.evaluate(ParentRunner.java:268)
> 	at org.junit.runners.ParentRunner.run(ParentRunner.java:363)
> 	at org.apache.maven.surefire.junit4.JUnit4Provider.execute(JUnit4Provider.java:365)
> 	at org.apache.maven.surefire.junit4.JUnit4Provider.executeWithRerun(JUnit4Provider.java:273)
> 	at org.apache.maven.surefire.junit4.JUnit4Provider.executeTestSet(JUnit4Provider.java:238)
> 	at org.apache.maven.surefire.junit4.JUnit4Provider.invoke(JUnit4Provider.java:159)
> 	at org.apache.maven.surefire.booter.ForkedBooter.invokeProviderInSameClassLoader(ForkedBooter.java:384)
> 	at org.apache.maven.surefire.booter.ForkedBooter.runSuitesInProcess(ForkedBooter.java:345)
> 	at org.apache.maven.surefire.booter.ForkedBooter.execute(ForkedBooter.java:126)
> 	at org.apache.maven.surefire.booter.ForkedBooter.main(ForkedBooter.java:418)
> {code}



--
This message was sent by Atlassian Jira
(v8.3.4#803005)