You are viewing a plain text version of this content. The canonical link for it is here.
Posted to builds@solr.apache.org by Apache Jenkins Server <je...@builds.apache.org> on 2026/01/10 04:08:29 UTC
[JENKINS] Solr » Solr-Test-10.x - Build # 824 - Still Unstable!
Build: https://ci-builds.apache.org/job/Solr/job/Solr-Test-10.x/824/
4 tests failed.
FAILED: org.apache.solr.handler.component.DistributedDebugComponentTest.classMethod
Error Message:
org.apache.solr.client.solrj.RemoteSolrException: Error from server at https://127.0.0.1:38751/solr: org.apache.solr.common.SolrException: Error CREATEing SolrCore 'collection1': Unable to create core [collection1] Caused by: Path /home/jenkins/jenkins-agent/workspace/Solr/Solr-Test-10.x/solr/server/solr/configsets/sample_techproducts_configs must be relative to SOLR_HOME, SOLR_DATA_HOME coreRootDirectory. Set system property 'solr.security.allow.paths' to add other allowed paths.
Stack Trace:
org.apache.solr.client.solrj.RemoteSolrException: Error from server at https://127.0.0.1:38751/solr: org.apache.solr.common.SolrException: Error CREATEing SolrCore 'collection1': Unable to create core [collection1] Caused by: Path /home/jenkins/jenkins-agent/workspace/Solr/Solr-Test-10.x/solr/server/solr/configsets/sample_techproducts_configs must be relative to SOLR_HOME, SOLR_DATA_HOME coreRootDirectory. Set system property 'solr.security.allow.paths' to add other allowed paths.
at __randomizedtesting.SeedInfo.seed([993164B19DAFD46E]:0)
at app//org.apache.solr.client.solrj.apache.HttpSolrClient.executeMethod(HttpSolrClient.java:685)
at app//org.apache.solr.client.solrj.apache.HttpSolrClient.request(HttpSolrClient.java:254)
at app//org.apache.solr.client.solrj.apache.HttpSolrClient.request(HttpSolrClient.java:233)
at app//org.apache.solr.client.solrj.SolrRequest.process(SolrRequest.java:302)
at app//org.apache.solr.client.solrj.SolrRequest.process(SolrRequest.java:348)
at app//org.apache.solr.util.SolrClientTestRule.create(SolrClientTestRule.java:160)
at app//org.apache.solr.util.SolrClientTestRule$NewCollectionBuilder.create(SolrClientTestRule.java:126)
at app//org.apache.solr.handler.component.DistributedDebugComponentTest.createThings(DistributedDebugComponentTest.java:62)
at java.base@21.0.4/jdk.internal.reflect.DirectMethodHandleAccessor.invoke(DirectMethodHandleAccessor.java:103)
at java.base@21.0.4/java.lang.reflect.Method.invoke(Method.java:580)
at app//com.carrotsearch.randomizedtesting.RandomizedRunner.invoke(RandomizedRunner.java:1763)
at app//com.carrotsearch.randomizedtesting.RandomizedRunner$6.evaluate(RandomizedRunner.java:886)
at app//com.carrotsearch.randomizedtesting.RandomizedRunner$7.evaluate(RandomizedRunner.java:902)
at app//org.junit.rules.ExternalResource$1.evaluate(ExternalResource.java:54)
at app//com.carrotsearch.randomizedtesting.rules.StatementAdapter.evaluate(StatementAdapter.java:36)
at app//com.carrotsearch.randomizedtesting.rules.StatementAdapter.evaluate(StatementAdapter.java:36)
at app//org.apache.lucene.tests.util.AbstractBeforeAfterRule$1.evaluate(AbstractBeforeAfterRule.java:43)
at app//com.carrotsearch.randomizedtesting.rules.SystemPropertiesRestoreRule$1.evaluate(SystemPropertiesRestoreRule.java:80)
at app//org.junit.rules.RunRules.evaluate(RunRules.java:20)
at app//org.apache.lucene.tests.util.AbstractBeforeAfterRule$1.evaluate(AbstractBeforeAfterRule.java:43)
at app//com.carrotsearch.randomizedtesting.rules.StatementAdapter.evaluate(StatementAdapter.java:36)
at app//org.apache.lucene.tests.util.TestRuleStoreClassName$1.evaluate(TestRuleStoreClassName.java:38)
at app//com.carrotsearch.randomizedtesting.rules.NoShadowingOrOverridesOnMethodsRule$1.evaluate(NoShadowingOrOverridesOnMethodsRule.java:40)
at app//com.carrotsearch.randomizedtesting.rules.NoShadowingOrOverridesOnMethodsRule$1.evaluate(NoShadowingOrOverridesOnMethodsRule.java:40)
at app//com.carrotsearch.randomizedtesting.rules.StatementAdapter.evaluate(StatementAdapter.java:36)
at app//com.carrotsearch.randomizedtesting.rules.StatementAdapter.evaluate(StatementAdapter.java:36)
at app//org.apache.lucene.tests.util.TestRuleAssertionsRequired$1.evaluate(TestRuleAssertionsRequired.java:53)
at app//org.apache.lucene.tests.util.AbstractBeforeAfterRule$1.evaluate(AbstractBeforeAfterRule.java:43)
at app//org.apache.lucene.tests.util.TestRuleMarkFailure$1.evaluate(TestRuleMarkFailure.java:44)
at app//org.apache.lucene.tests.util.TestRuleIgnoreAfterMaxFailures$1.evaluate(TestRuleIgnoreAfterMaxFailures.java:60)
at app//org.apache.lucene.tests.util.TestRuleIgnoreTestSuites$1.evaluate(TestRuleIgnoreTestSuites.java:47)
at app//org.junit.rules.RunRules.evaluate(RunRules.java:20)
at app//com.carrotsearch.randomizedtesting.rules.StatementAdapter.evaluate(StatementAdapter.java:36)
at app//com.carrotsearch.randomizedtesting.ThreadLeakControl$StatementRunner.run(ThreadLeakControl.java:390)
at app//com.carrotsearch.randomizedtesting.ThreadLeakControl.lambda$forkTimeoutingTask$0(ThreadLeakControl.java:850)
at java.base@21.0.4/java.lang.Thread.run(Thread.java:1583)
FAILED: org.apache.solr.handler.component.DistributedDebugComponentTest.classMethod
Error Message:
org.apache.solr.client.solrj.RemoteSolrException: Error from server at https://127.0.0.1:37397/solr: org.apache.solr.common.SolrException: Error CREATEing SolrCore 'collection1': Unable to create core [collection1] Caused by: Path /home/jenkins/jenkins-agent/workspace/Solr/Solr-Test-10.x/solr/server/solr/configsets/sample_techproducts_configs must be relative to SOLR_HOME, SOLR_DATA_HOME coreRootDirectory. Set system property 'solr.security.allow.paths' to add other allowed paths.
Stack Trace:
org.apache.solr.client.solrj.RemoteSolrException: Error from server at https://127.0.0.1:37397/solr: org.apache.solr.common.SolrException: Error CREATEing SolrCore 'collection1': Unable to create core [collection1] Caused by: Path /home/jenkins/jenkins-agent/workspace/Solr/Solr-Test-10.x/solr/server/solr/configsets/sample_techproducts_configs must be relative to SOLR_HOME, SOLR_DATA_HOME coreRootDirectory. Set system property 'solr.security.allow.paths' to add other allowed paths.
at __randomizedtesting.SeedInfo.seed([993164B19DAFD46E]:0)
at app//org.apache.solr.client.solrj.apache.HttpSolrClient.executeMethod(HttpSolrClient.java:685)
at app//org.apache.solr.client.solrj.apache.HttpSolrClient.request(HttpSolrClient.java:254)
at app//org.apache.solr.client.solrj.apache.HttpSolrClient.request(HttpSolrClient.java:233)
at app//org.apache.solr.client.solrj.SolrRequest.process(SolrRequest.java:302)
at app//org.apache.solr.client.solrj.SolrRequest.process(SolrRequest.java:348)
at app//org.apache.solr.util.SolrClientTestRule.create(SolrClientTestRule.java:160)
at app//org.apache.solr.util.SolrClientTestRule$NewCollectionBuilder.create(SolrClientTestRule.java:126)
at app//org.apache.solr.handler.component.DistributedDebugComponentTest.createThings(DistributedDebugComponentTest.java:62)
at java.base@21.0.4/jdk.internal.reflect.DirectMethodHandleAccessor.invoke(DirectMethodHandleAccessor.java:103)
at java.base@21.0.4/java.lang.reflect.Method.invoke(Method.java:580)
at app//com.carrotsearch.randomizedtesting.RandomizedRunner.invoke(RandomizedRunner.java:1763)
at app//com.carrotsearch.randomizedtesting.RandomizedRunner$6.evaluate(RandomizedRunner.java:886)
at app//com.carrotsearch.randomizedtesting.RandomizedRunner$7.evaluate(RandomizedRunner.java:902)
at app//org.junit.rules.ExternalResource$1.evaluate(ExternalResource.java:54)
at app//com.carrotsearch.randomizedtesting.rules.StatementAdapter.evaluate(StatementAdapter.java:36)
at app//com.carrotsearch.randomizedtesting.rules.StatementAdapter.evaluate(StatementAdapter.java:36)
at app//org.apache.lucene.tests.util.AbstractBeforeAfterRule$1.evaluate(AbstractBeforeAfterRule.java:43)
at app//com.carrotsearch.randomizedtesting.rules.SystemPropertiesRestoreRule$1.evaluate(SystemPropertiesRestoreRule.java:80)
at app//org.junit.rules.RunRules.evaluate(RunRules.java:20)
at app//org.apache.lucene.tests.util.AbstractBeforeAfterRule$1.evaluate(AbstractBeforeAfterRule.java:43)
at app//com.carrotsearch.randomizedtesting.rules.StatementAdapter.evaluate(StatementAdapter.java:36)
at app//org.apache.lucene.tests.util.TestRuleStoreClassName$1.evaluate(TestRuleStoreClassName.java:38)
at app//com.carrotsearch.randomizedtesting.rules.NoShadowingOrOverridesOnMethodsRule$1.evaluate(NoShadowingOrOverridesOnMethodsRule.java:40)
at app//com.carrotsearch.randomizedtesting.rules.NoShadowingOrOverridesOnMethodsRule$1.evaluate(NoShadowingOrOverridesOnMethodsRule.java:40)
at app//com.carrotsearch.randomizedtesting.rules.StatementAdapter.evaluate(StatementAdapter.java:36)
at app//com.carrotsearch.randomizedtesting.rules.StatementAdapter.evaluate(StatementAdapter.java:36)
at app//org.apache.lucene.tests.util.TestRuleAssertionsRequired$1.evaluate(TestRuleAssertionsRequired.java:53)
at app//org.apache.lucene.tests.util.AbstractBeforeAfterRule$1.evaluate(AbstractBeforeAfterRule.java:43)
at app//org.apache.lucene.tests.util.TestRuleMarkFailure$1.evaluate(TestRuleMarkFailure.java:44)
at app//org.apache.lucene.tests.util.TestRuleIgnoreAfterMaxFailures$1.evaluate(TestRuleIgnoreAfterMaxFailures.java:60)
at app//org.apache.lucene.tests.util.TestRuleIgnoreTestSuites$1.evaluate(TestRuleIgnoreTestSuites.java:47)
at app//org.junit.rules.RunRules.evaluate(RunRules.java:20)
at app//com.carrotsearch.randomizedtesting.rules.StatementAdapter.evaluate(StatementAdapter.java:36)
at app//com.carrotsearch.randomizedtesting.ThreadLeakControl$StatementRunner.run(ThreadLeakControl.java:390)
at app//com.carrotsearch.randomizedtesting.ThreadLeakControl.lambda$forkTimeoutingTask$0(ThreadLeakControl.java:850)
at java.base@21.0.4/java.lang.Thread.run(Thread.java:1583)
FAILED: org.apache.solr.handler.component.DistributedDebugComponentTest.classMethod
Error Message:
org.apache.solr.client.solrj.RemoteSolrException: Error from server at https://127.0.0.1:41213/solr: org.apache.solr.common.SolrException: Error CREATEing SolrCore 'collection1': Unable to create core [collection1] Caused by: Path /home/jenkins/jenkins-agent/workspace/Solr/Solr-Test-10.x/solr/server/solr/configsets/sample_techproducts_configs must be relative to SOLR_HOME, SOLR_DATA_HOME coreRootDirectory. Set system property 'solr.security.allow.paths' to add other allowed paths.
Stack Trace:
org.apache.solr.client.solrj.RemoteSolrException: Error from server at https://127.0.0.1:41213/solr: org.apache.solr.common.SolrException: Error CREATEing SolrCore 'collection1': Unable to create core [collection1] Caused by: Path /home/jenkins/jenkins-agent/workspace/Solr/Solr-Test-10.x/solr/server/solr/configsets/sample_techproducts_configs must be relative to SOLR_HOME, SOLR_DATA_HOME coreRootDirectory. Set system property 'solr.security.allow.paths' to add other allowed paths.
at __randomizedtesting.SeedInfo.seed([993164B19DAFD46E]:0)
at app//org.apache.solr.client.solrj.apache.HttpSolrClient.executeMethod(HttpSolrClient.java:685)
at app//org.apache.solr.client.solrj.apache.HttpSolrClient.request(HttpSolrClient.java:254)
at app//org.apache.solr.client.solrj.apache.HttpSolrClient.request(HttpSolrClient.java:233)
at app//org.apache.solr.client.solrj.SolrRequest.process(SolrRequest.java:302)
at app//org.apache.solr.client.solrj.SolrRequest.process(SolrRequest.java:348)
at app//org.apache.solr.util.SolrClientTestRule.create(SolrClientTestRule.java:160)
at app//org.apache.solr.util.SolrClientTestRule$NewCollectionBuilder.create(SolrClientTestRule.java:126)
at app//org.apache.solr.handler.component.DistributedDebugComponentTest.createThings(DistributedDebugComponentTest.java:62)
at java.base@21.0.4/jdk.internal.reflect.DirectMethodHandleAccessor.invoke(DirectMethodHandleAccessor.java:103)
at java.base@21.0.4/java.lang.reflect.Method.invoke(Method.java:580)
at app//com.carrotsearch.randomizedtesting.RandomizedRunner.invoke(RandomizedRunner.java:1763)
at app//com.carrotsearch.randomizedtesting.RandomizedRunner$6.evaluate(RandomizedRunner.java:886)
at app//com.carrotsearch.randomizedtesting.RandomizedRunner$7.evaluate(RandomizedRunner.java:902)
at app//org.junit.rules.ExternalResource$1.evaluate(ExternalResource.java:54)
at app//com.carrotsearch.randomizedtesting.rules.StatementAdapter.evaluate(StatementAdapter.java:36)
at app//com.carrotsearch.randomizedtesting.rules.StatementAdapter.evaluate(StatementAdapter.java:36)
at app//org.apache.lucene.tests.util.AbstractBeforeAfterRule$1.evaluate(AbstractBeforeAfterRule.java:43)
at app//com.carrotsearch.randomizedtesting.rules.SystemPropertiesRestoreRule$1.evaluate(SystemPropertiesRestoreRule.java:80)
at app//org.junit.rules.RunRules.evaluate(RunRules.java:20)
at app//org.apache.lucene.tests.util.AbstractBeforeAfterRule$1.evaluate(AbstractBeforeAfterRule.java:43)
at app//com.carrotsearch.randomizedtesting.rules.StatementAdapter.evaluate(StatementAdapter.java:36)
at app//org.apache.lucene.tests.util.TestRuleStoreClassName$1.evaluate(TestRuleStoreClassName.java:38)
at app//com.carrotsearch.randomizedtesting.rules.NoShadowingOrOverridesOnMethodsRule$1.evaluate(NoShadowingOrOverridesOnMethodsRule.java:40)
at app//com.carrotsearch.randomizedtesting.rules.NoShadowingOrOverridesOnMethodsRule$1.evaluate(NoShadowingOrOverridesOnMethodsRule.java:40)
at app//com.carrotsearch.randomizedtesting.rules.StatementAdapter.evaluate(StatementAdapter.java:36)
at app//com.carrotsearch.randomizedtesting.rules.StatementAdapter.evaluate(StatementAdapter.java:36)
at app//org.apache.lucene.tests.util.TestRuleAssertionsRequired$1.evaluate(TestRuleAssertionsRequired.java:53)
at app//org.apache.lucene.tests.util.AbstractBeforeAfterRule$1.evaluate(AbstractBeforeAfterRule.java:43)
at app//org.apache.lucene.tests.util.TestRuleMarkFailure$1.evaluate(TestRuleMarkFailure.java:44)
at app//org.apache.lucene.tests.util.TestRuleIgnoreAfterMaxFailures$1.evaluate(TestRuleIgnoreAfterMaxFailures.java:60)
at app//org.apache.lucene.tests.util.TestRuleIgnoreTestSuites$1.evaluate(TestRuleIgnoreTestSuites.java:47)
at app//org.junit.rules.RunRules.evaluate(RunRules.java:20)
at app//com.carrotsearch.randomizedtesting.rules.StatementAdapter.evaluate(StatementAdapter.java:36)
at app//com.carrotsearch.randomizedtesting.ThreadLeakControl$StatementRunner.run(ThreadLeakControl.java:390)
at app//com.carrotsearch.randomizedtesting.ThreadLeakControl.lambda$forkTimeoutingTask$0(ThreadLeakControl.java:850)
at java.base@21.0.4/java.lang.Thread.run(Thread.java:1583)
FAILED: org.apache.solr.handler.component.DistributedDebugComponentTest.classMethod
Error Message:
org.apache.solr.client.solrj.RemoteSolrException: Error from server at https://127.0.0.1:35151/solr: org.apache.solr.common.SolrException: Error CREATEing SolrCore 'collection1': Unable to create core [collection1] Caused by: Path /home/jenkins/jenkins-agent/workspace/Solr/Solr-Test-10.x/solr/server/solr/configsets/sample_techproducts_configs must be relative to SOLR_HOME, SOLR_DATA_HOME coreRootDirectory. Set system property 'solr.security.allow.paths' to add other allowed paths.
Stack Trace:
org.apache.solr.client.solrj.RemoteSolrException: Error from server at https://127.0.0.1:35151/solr: org.apache.solr.common.SolrException: Error CREATEing SolrCore 'collection1': Unable to create core [collection1] Caused by: Path /home/jenkins/jenkins-agent/workspace/Solr/Solr-Test-10.x/solr/server/solr/configsets/sample_techproducts_configs must be relative to SOLR_HOME, SOLR_DATA_HOME coreRootDirectory. Set system property 'solr.security.allow.paths' to add other allowed paths.
at __randomizedtesting.SeedInfo.seed([993164B19DAFD46E]:0)
at app//org.apache.solr.client.solrj.apache.HttpSolrClient.executeMethod(HttpSolrClient.java:685)
at app//org.apache.solr.client.solrj.apache.HttpSolrClient.request(HttpSolrClient.java:254)
at app//org.apache.solr.client.solrj.apache.HttpSolrClient.request(HttpSolrClient.java:233)
at app//org.apache.solr.client.solrj.SolrRequest.process(SolrRequest.java:302)
at app//org.apache.solr.client.solrj.SolrRequest.process(SolrRequest.java:348)
at app//org.apache.solr.util.SolrClientTestRule.create(SolrClientTestRule.java:160)
at app//org.apache.solr.util.SolrClientTestRule$NewCollectionBuilder.create(SolrClientTestRule.java:126)
at app//org.apache.solr.handler.component.DistributedDebugComponentTest.createThings(DistributedDebugComponentTest.java:62)
at java.base@21.0.4/jdk.internal.reflect.DirectMethodHandleAccessor.invoke(DirectMethodHandleAccessor.java:103)
at java.base@21.0.4/java.lang.reflect.Method.invoke(Method.java:580)
at app//com.carrotsearch.randomizedtesting.RandomizedRunner.invoke(RandomizedRunner.java:1763)
at app//com.carrotsearch.randomizedtesting.RandomizedRunner$6.evaluate(RandomizedRunner.java:886)
at app//com.carrotsearch.randomizedtesting.RandomizedRunner$7.evaluate(RandomizedRunner.java:902)
at app//org.junit.rules.ExternalResource$1.evaluate(ExternalResource.java:54)
at app//com.carrotsearch.randomizedtesting.rules.StatementAdapter.evaluate(StatementAdapter.java:36)
at app//com.carrotsearch.randomizedtesting.rules.StatementAdapter.evaluate(StatementAdapter.java:36)
at app//org.apache.lucene.tests.util.AbstractBeforeAfterRule$1.evaluate(AbstractBeforeAfterRule.java:43)
at app//com.carrotsearch.randomizedtesting.rules.SystemPropertiesRestoreRule$1.evaluate(SystemPropertiesRestoreRule.java:80)
at app//org.junit.rules.RunRules.evaluate(RunRules.java:20)
at app//org.apache.lucene.tests.util.AbstractBeforeAfterRule$1.evaluate(AbstractBeforeAfterRule.java:43)
at app//com.carrotsearch.randomizedtesting.rules.StatementAdapter.evaluate(StatementAdapter.java:36)
at app//org.apache.lucene.tests.util.TestRuleStoreClassName$1.evaluate(TestRuleStoreClassName.java:38)
at app//com.carrotsearch.randomizedtesting.rules.NoShadowingOrOverridesOnMethodsRule$1.evaluate(NoShadowingOrOverridesOnMethodsRule.java:40)
at app//com.carrotsearch.randomizedtesting.rules.NoShadowingOrOverridesOnMethodsRule$1.evaluate(NoShadowingOrOverridesOnMethodsRule.java:40)
at app//com.carrotsearch.randomizedtesting.rules.StatementAdapter.evaluate(StatementAdapter.java:36)
at app//com.carrotsearch.randomizedtesting.rules.StatementAdapter.evaluate(StatementAdapter.java:36)
at app//org.apache.lucene.tests.util.TestRuleAssertionsRequired$1.evaluate(TestRuleAssertionsRequired.java:53)
at app//org.apache.lucene.tests.util.AbstractBeforeAfterRule$1.evaluate(AbstractBeforeAfterRule.java:43)
at app//org.apache.lucene.tests.util.TestRuleMarkFailure$1.evaluate(TestRuleMarkFailure.java:44)
at app//org.apache.lucene.tests.util.TestRuleIgnoreAfterMaxFailures$1.evaluate(TestRuleIgnoreAfterMaxFailures.java:60)
at app//org.apache.lucene.tests.util.TestRuleIgnoreTestSuites$1.evaluate(TestRuleIgnoreTestSuites.java:47)
at app//org.junit.rules.RunRules.evaluate(RunRules.java:20)
at app//com.carrotsearch.randomizedtesting.rules.StatementAdapter.evaluate(StatementAdapter.java:36)
at app//com.carrotsearch.randomizedtesting.ThreadLeakControl$StatementRunner.run(ThreadLeakControl.java:390)
at app//com.carrotsearch.randomizedtesting.ThreadLeakControl.lambda$forkTimeoutingTask$0(ThreadLeakControl.java:850)
at java.base@21.0.4/java.lang.Thread.run(Thread.java:1583)
Build Log:
[...truncated 1843 lines...]
ERROR: The following test(s) have failed:
- org.apache.solr.handler.component.DistributedDebugComponentTest (:solr:core)
Test history: https://develocity.apache.org/scans/tests?search.rootProjectNames=solr-root&tests.container=org.apache.solr.handler.component.DistributedDebugComponentTest
Test output: /home/jenkins/jenkins-agent/workspace/Solr/Solr-Test-10.x/solr/core/build/test-results/test/outputs/OUTPUT-org.apache.solr.handler.component.DistributedDebugComponentTest.txt
Reproduce with: ./gradlew :solr:core:test --tests "org.apache.solr.handler.component.DistributedDebugComponentTest" -Ptests.haltonfailure=false "-Ptests.jvmargs=-XX:TieredStopAtLevel=1 -XX:+UseParallelGC -XX:ActiveProcessorCount=1 -XX:ReservedCodeCacheSize=120m" -Ptests.seed=993164B19DAFD46E -Ptests.multiplier=2 -Ptests.useSecurityManager=true -Ptests.badapples=false -Ptests.file.encoding=ISO-8859-1
Deprecated Gradle features were used in this build, making it incompatible with Gradle 9.0.
You can use '--warning-mode all' to show the individual deprecation warnings and determine if they come from your own scripts or plugins.
For more on this, please refer to https://docs.gradle.org/8.10/userguide/command_line_interface.html#sec:command_line_warnings in the Gradle documentation.
BUILD SUCCESSFUL in 40m 15s
146 actionable tasks: 146 executed
Publishing build scan...
https://develocity.apache.org/s/ghlpvpb3wbdtq
Build step 'Invoke Gradle script' changed build result to SUCCESS
Archiving artifacts
‘**/*.events’ doesn’t match anything: ‘**’ exists but not ‘**/*.events’
No artifacts found that match the file pattern "**/*.events,heapdumps/**,**/hs_err_pid*". Configuration error?
Recording test results
[Checks API] No suitable checks publisher found.
Build step 'Publish JUnit test result report' changed build result to UNSTABLE
Email was triggered for: Unstable (Test Failures)
Sending email for trigger: Unstable (Test Failures)
[JENKINS] Solr » Solr-Test-10.x - Build # 825 - Still Unstable!
Posted by Apache Jenkins Server <je...@builds.apache.org>.
Build: https://ci-builds.apache.org/job/Solr/job/Solr-Test-10.x/825/
4 tests failed.
FAILED: org.apache.solr.handler.component.DistributedDebugComponentTest.classMethod
Error Message:
org.apache.solr.client.solrj.RemoteSolrException: Error from server at http://127.0.0.1:37981/solr: org.apache.solr.common.SolrException: Error CREATEing SolrCore 'collection1': Unable to create core [collection1] Caused by: Path /home/jenkins/jenkins-agent/workspace/Solr/Solr-Test-10.x/solr/server/solr/configsets/sample_techproducts_configs must be relative to SOLR_HOME, SOLR_DATA_HOME coreRootDirectory. Set system property 'solr.security.allow.paths' to add other allowed paths.
Stack Trace:
org.apache.solr.client.solrj.RemoteSolrException: Error from server at http://127.0.0.1:37981/solr: org.apache.solr.common.SolrException: Error CREATEing SolrCore 'collection1': Unable to create core [collection1] Caused by: Path /home/jenkins/jenkins-agent/workspace/Solr/Solr-Test-10.x/solr/server/solr/configsets/sample_techproducts_configs must be relative to SOLR_HOME, SOLR_DATA_HOME coreRootDirectory. Set system property 'solr.security.allow.paths' to add other allowed paths.
at __randomizedtesting.SeedInfo.seed([7D371FB148813902]:0)
at app//org.apache.solr.client.solrj.apache.HttpSolrClient.executeMethod(HttpSolrClient.java:685)
at app//org.apache.solr.client.solrj.apache.HttpSolrClient.request(HttpSolrClient.java:254)
at app//org.apache.solr.client.solrj.apache.HttpSolrClient.request(HttpSolrClient.java:233)
at app//org.apache.solr.client.solrj.SolrRequest.process(SolrRequest.java:302)
at app//org.apache.solr.client.solrj.SolrRequest.process(SolrRequest.java:348)
at app//org.apache.solr.util.SolrClientTestRule.create(SolrClientTestRule.java:160)
at app//org.apache.solr.util.SolrClientTestRule$NewCollectionBuilder.create(SolrClientTestRule.java:126)
at app//org.apache.solr.handler.component.DistributedDebugComponentTest.createThings(DistributedDebugComponentTest.java:62)
at java.base@21.0.4/jdk.internal.reflect.DirectMethodHandleAccessor.invoke(DirectMethodHandleAccessor.java:103)
at java.base@21.0.4/java.lang.reflect.Method.invoke(Method.java:580)
at app//com.carrotsearch.randomizedtesting.RandomizedRunner.invoke(RandomizedRunner.java:1763)
at app//com.carrotsearch.randomizedtesting.RandomizedRunner$6.evaluate(RandomizedRunner.java:886)
at app//com.carrotsearch.randomizedtesting.RandomizedRunner$7.evaluate(RandomizedRunner.java:902)
at app//org.junit.rules.ExternalResource$1.evaluate(ExternalResource.java:54)
at app//com.carrotsearch.randomizedtesting.rules.StatementAdapter.evaluate(StatementAdapter.java:36)
at app//com.carrotsearch.randomizedtesting.rules.StatementAdapter.evaluate(StatementAdapter.java:36)
at app//org.apache.lucene.tests.util.AbstractBeforeAfterRule$1.evaluate(AbstractBeforeAfterRule.java:43)
at app//com.carrotsearch.randomizedtesting.rules.SystemPropertiesRestoreRule$1.evaluate(SystemPropertiesRestoreRule.java:80)
at app//org.junit.rules.RunRules.evaluate(RunRules.java:20)
at app//org.apache.lucene.tests.util.AbstractBeforeAfterRule$1.evaluate(AbstractBeforeAfterRule.java:43)
at app//com.carrotsearch.randomizedtesting.rules.StatementAdapter.evaluate(StatementAdapter.java:36)
at app//org.apache.lucene.tests.util.TestRuleStoreClassName$1.evaluate(TestRuleStoreClassName.java:38)
at app//com.carrotsearch.randomizedtesting.rules.NoShadowingOrOverridesOnMethodsRule$1.evaluate(NoShadowingOrOverridesOnMethodsRule.java:40)
at app//com.carrotsearch.randomizedtesting.rules.NoShadowingOrOverridesOnMethodsRule$1.evaluate(NoShadowingOrOverridesOnMethodsRule.java:40)
at app//com.carrotsearch.randomizedtesting.rules.StatementAdapter.evaluate(StatementAdapter.java:36)
at app//com.carrotsearch.randomizedtesting.rules.StatementAdapter.evaluate(StatementAdapter.java:36)
at app//org.apache.lucene.tests.util.TestRuleAssertionsRequired$1.evaluate(TestRuleAssertionsRequired.java:53)
at app//org.apache.lucene.tests.util.AbstractBeforeAfterRule$1.evaluate(AbstractBeforeAfterRule.java:43)
at app//org.apache.lucene.tests.util.TestRuleMarkFailure$1.evaluate(TestRuleMarkFailure.java:44)
at app//org.apache.lucene.tests.util.TestRuleIgnoreAfterMaxFailures$1.evaluate(TestRuleIgnoreAfterMaxFailures.java:60)
at app//org.apache.lucene.tests.util.TestRuleIgnoreTestSuites$1.evaluate(TestRuleIgnoreTestSuites.java:47)
at app//org.junit.rules.RunRules.evaluate(RunRules.java:20)
at app//com.carrotsearch.randomizedtesting.rules.StatementAdapter.evaluate(StatementAdapter.java:36)
at app//com.carrotsearch.randomizedtesting.ThreadLeakControl$StatementRunner.run(ThreadLeakControl.java:390)
at app//com.carrotsearch.randomizedtesting.ThreadLeakControl.lambda$forkTimeoutingTask$0(ThreadLeakControl.java:850)
at java.base@21.0.4/java.lang.Thread.run(Thread.java:1583)
FAILED: org.apache.solr.handler.component.DistributedDebugComponentTest.classMethod
Error Message:
org.apache.solr.client.solrj.RemoteSolrException: Error from server at http://127.0.0.1:36175/solr: org.apache.solr.common.SolrException: Error CREATEing SolrCore 'collection1': Unable to create core [collection1] Caused by: Path /home/jenkins/jenkins-agent/workspace/Solr/Solr-Test-10.x/solr/server/solr/configsets/sample_techproducts_configs must be relative to SOLR_HOME, SOLR_DATA_HOME coreRootDirectory. Set system property 'solr.security.allow.paths' to add other allowed paths.
Stack Trace:
org.apache.solr.client.solrj.RemoteSolrException: Error from server at http://127.0.0.1:36175/solr: org.apache.solr.common.SolrException: Error CREATEing SolrCore 'collection1': Unable to create core [collection1] Caused by: Path /home/jenkins/jenkins-agent/workspace/Solr/Solr-Test-10.x/solr/server/solr/configsets/sample_techproducts_configs must be relative to SOLR_HOME, SOLR_DATA_HOME coreRootDirectory. Set system property 'solr.security.allow.paths' to add other allowed paths.
at __randomizedtesting.SeedInfo.seed([7D371FB148813902]:0)
at app//org.apache.solr.client.solrj.apache.HttpSolrClient.executeMethod(HttpSolrClient.java:685)
at app//org.apache.solr.client.solrj.apache.HttpSolrClient.request(HttpSolrClient.java:254)
at app//org.apache.solr.client.solrj.apache.HttpSolrClient.request(HttpSolrClient.java:233)
at app//org.apache.solr.client.solrj.SolrRequest.process(SolrRequest.java:302)
at app//org.apache.solr.client.solrj.SolrRequest.process(SolrRequest.java:348)
at app//org.apache.solr.util.SolrClientTestRule.create(SolrClientTestRule.java:160)
at app//org.apache.solr.util.SolrClientTestRule$NewCollectionBuilder.create(SolrClientTestRule.java:126)
at app//org.apache.solr.handler.component.DistributedDebugComponentTest.createThings(DistributedDebugComponentTest.java:62)
at java.base@21.0.4/jdk.internal.reflect.DirectMethodHandleAccessor.invoke(DirectMethodHandleAccessor.java:103)
at java.base@21.0.4/java.lang.reflect.Method.invoke(Method.java:580)
at app//com.carrotsearch.randomizedtesting.RandomizedRunner.invoke(RandomizedRunner.java:1763)
at app//com.carrotsearch.randomizedtesting.RandomizedRunner$6.evaluate(RandomizedRunner.java:886)
at app//com.carrotsearch.randomizedtesting.RandomizedRunner$7.evaluate(RandomizedRunner.java:902)
at app//org.junit.rules.ExternalResource$1.evaluate(ExternalResource.java:54)
at app//com.carrotsearch.randomizedtesting.rules.StatementAdapter.evaluate(StatementAdapter.java:36)
at app//com.carrotsearch.randomizedtesting.rules.StatementAdapter.evaluate(StatementAdapter.java:36)
at app//org.apache.lucene.tests.util.AbstractBeforeAfterRule$1.evaluate(AbstractBeforeAfterRule.java:43)
at app//com.carrotsearch.randomizedtesting.rules.SystemPropertiesRestoreRule$1.evaluate(SystemPropertiesRestoreRule.java:80)
at app//org.junit.rules.RunRules.evaluate(RunRules.java:20)
at app//org.apache.lucene.tests.util.AbstractBeforeAfterRule$1.evaluate(AbstractBeforeAfterRule.java:43)
at app//com.carrotsearch.randomizedtesting.rules.StatementAdapter.evaluate(StatementAdapter.java:36)
at app//org.apache.lucene.tests.util.TestRuleStoreClassName$1.evaluate(TestRuleStoreClassName.java:38)
at app//com.carrotsearch.randomizedtesting.rules.NoShadowingOrOverridesOnMethodsRule$1.evaluate(NoShadowingOrOverridesOnMethodsRule.java:40)
at app//com.carrotsearch.randomizedtesting.rules.NoShadowingOrOverridesOnMethodsRule$1.evaluate(NoShadowingOrOverridesOnMethodsRule.java:40)
at app//com.carrotsearch.randomizedtesting.rules.StatementAdapter.evaluate(StatementAdapter.java:36)
at app//com.carrotsearch.randomizedtesting.rules.StatementAdapter.evaluate(StatementAdapter.java:36)
at app//org.apache.lucene.tests.util.TestRuleAssertionsRequired$1.evaluate(TestRuleAssertionsRequired.java:53)
at app//org.apache.lucene.tests.util.AbstractBeforeAfterRule$1.evaluate(AbstractBeforeAfterRule.java:43)
at app//org.apache.lucene.tests.util.TestRuleMarkFailure$1.evaluate(TestRuleMarkFailure.java:44)
at app//org.apache.lucene.tests.util.TestRuleIgnoreAfterMaxFailures$1.evaluate(TestRuleIgnoreAfterMaxFailures.java:60)
at app//org.apache.lucene.tests.util.TestRuleIgnoreTestSuites$1.evaluate(TestRuleIgnoreTestSuites.java:47)
at app//org.junit.rules.RunRules.evaluate(RunRules.java:20)
at app//com.carrotsearch.randomizedtesting.rules.StatementAdapter.evaluate(StatementAdapter.java:36)
at app//com.carrotsearch.randomizedtesting.ThreadLeakControl$StatementRunner.run(ThreadLeakControl.java:390)
at app//com.carrotsearch.randomizedtesting.ThreadLeakControl.lambda$forkTimeoutingTask$0(ThreadLeakControl.java:850)
at java.base@21.0.4/java.lang.Thread.run(Thread.java:1583)
FAILED: org.apache.solr.handler.component.DistributedDebugComponentTest.classMethod
Error Message:
org.apache.solr.client.solrj.RemoteSolrException: Error from server at http://127.0.0.1:44881/solr: org.apache.solr.common.SolrException: Error CREATEing SolrCore 'collection1': Unable to create core [collection1] Caused by: Path /home/jenkins/jenkins-agent/workspace/Solr/Solr-Test-10.x/solr/server/solr/configsets/sample_techproducts_configs must be relative to SOLR_HOME, SOLR_DATA_HOME coreRootDirectory. Set system property 'solr.security.allow.paths' to add other allowed paths.
Stack Trace:
org.apache.solr.client.solrj.RemoteSolrException: Error from server at http://127.0.0.1:44881/solr: org.apache.solr.common.SolrException: Error CREATEing SolrCore 'collection1': Unable to create core [collection1] Caused by: Path /home/jenkins/jenkins-agent/workspace/Solr/Solr-Test-10.x/solr/server/solr/configsets/sample_techproducts_configs must be relative to SOLR_HOME, SOLR_DATA_HOME coreRootDirectory. Set system property 'solr.security.allow.paths' to add other allowed paths.
at __randomizedtesting.SeedInfo.seed([7D371FB148813902]:0)
at app//org.apache.solr.client.solrj.apache.HttpSolrClient.executeMethod(HttpSolrClient.java:685)
at app//org.apache.solr.client.solrj.apache.HttpSolrClient.request(HttpSolrClient.java:254)
at app//org.apache.solr.client.solrj.apache.HttpSolrClient.request(HttpSolrClient.java:233)
at app//org.apache.solr.client.solrj.SolrRequest.process(SolrRequest.java:302)
at app//org.apache.solr.client.solrj.SolrRequest.process(SolrRequest.java:348)
at app//org.apache.solr.util.SolrClientTestRule.create(SolrClientTestRule.java:160)
at app//org.apache.solr.util.SolrClientTestRule$NewCollectionBuilder.create(SolrClientTestRule.java:126)
at app//org.apache.solr.handler.component.DistributedDebugComponentTest.createThings(DistributedDebugComponentTest.java:62)
at java.base@21.0.4/jdk.internal.reflect.DirectMethodHandleAccessor.invoke(DirectMethodHandleAccessor.java:103)
at java.base@21.0.4/java.lang.reflect.Method.invoke(Method.java:580)
at app//com.carrotsearch.randomizedtesting.RandomizedRunner.invoke(RandomizedRunner.java:1763)
at app//com.carrotsearch.randomizedtesting.RandomizedRunner$6.evaluate(RandomizedRunner.java:886)
at app//com.carrotsearch.randomizedtesting.RandomizedRunner$7.evaluate(RandomizedRunner.java:902)
at app//org.junit.rules.ExternalResource$1.evaluate(ExternalResource.java:54)
at app//com.carrotsearch.randomizedtesting.rules.StatementAdapter.evaluate(StatementAdapter.java:36)
at app//com.carrotsearch.randomizedtesting.rules.StatementAdapter.evaluate(StatementAdapter.java:36)
at app//org.apache.lucene.tests.util.AbstractBeforeAfterRule$1.evaluate(AbstractBeforeAfterRule.java:43)
at app//com.carrotsearch.randomizedtesting.rules.SystemPropertiesRestoreRule$1.evaluate(SystemPropertiesRestoreRule.java:80)
at app//org.junit.rules.RunRules.evaluate(RunRules.java:20)
at app//org.apache.lucene.tests.util.AbstractBeforeAfterRule$1.evaluate(AbstractBeforeAfterRule.java:43)
at app//com.carrotsearch.randomizedtesting.rules.StatementAdapter.evaluate(StatementAdapter.java:36)
at app//org.apache.lucene.tests.util.TestRuleStoreClassName$1.evaluate(TestRuleStoreClassName.java:38)
at app//com.carrotsearch.randomizedtesting.rules.NoShadowingOrOverridesOnMethodsRule$1.evaluate(NoShadowingOrOverridesOnMethodsRule.java:40)
at app//com.carrotsearch.randomizedtesting.rules.NoShadowingOrOverridesOnMethodsRule$1.evaluate(NoShadowingOrOverridesOnMethodsRule.java:40)
at app//com.carrotsearch.randomizedtesting.rules.StatementAdapter.evaluate(StatementAdapter.java:36)
at app//com.carrotsearch.randomizedtesting.rules.StatementAdapter.evaluate(StatementAdapter.java:36)
at app//org.apache.lucene.tests.util.TestRuleAssertionsRequired$1.evaluate(TestRuleAssertionsRequired.java:53)
at app//org.apache.lucene.tests.util.AbstractBeforeAfterRule$1.evaluate(AbstractBeforeAfterRule.java:43)
at app//org.apache.lucene.tests.util.TestRuleMarkFailure$1.evaluate(TestRuleMarkFailure.java:44)
at app//org.apache.lucene.tests.util.TestRuleIgnoreAfterMaxFailures$1.evaluate(TestRuleIgnoreAfterMaxFailures.java:60)
at app//org.apache.lucene.tests.util.TestRuleIgnoreTestSuites$1.evaluate(TestRuleIgnoreTestSuites.java:47)
at app//org.junit.rules.RunRules.evaluate(RunRules.java:20)
at app//com.carrotsearch.randomizedtesting.rules.StatementAdapter.evaluate(StatementAdapter.java:36)
at app//com.carrotsearch.randomizedtesting.ThreadLeakControl$StatementRunner.run(ThreadLeakControl.java:390)
at app//com.carrotsearch.randomizedtesting.ThreadLeakControl.lambda$forkTimeoutingTask$0(ThreadLeakControl.java:850)
at java.base@21.0.4/java.lang.Thread.run(Thread.java:1583)
FAILED: org.apache.solr.handler.component.DistributedDebugComponentTest.classMethod
Error Message:
org.apache.solr.client.solrj.RemoteSolrException: Error from server at http://127.0.0.1:42293/solr: org.apache.solr.common.SolrException: Error CREATEing SolrCore 'collection1': Unable to create core [collection1] Caused by: Path /home/jenkins/jenkins-agent/workspace/Solr/Solr-Test-10.x/solr/server/solr/configsets/sample_techproducts_configs must be relative to SOLR_HOME, SOLR_DATA_HOME coreRootDirectory. Set system property 'solr.security.allow.paths' to add other allowed paths.
Stack Trace:
org.apache.solr.client.solrj.RemoteSolrException: Error from server at http://127.0.0.1:42293/solr: org.apache.solr.common.SolrException: Error CREATEing SolrCore 'collection1': Unable to create core [collection1] Caused by: Path /home/jenkins/jenkins-agent/workspace/Solr/Solr-Test-10.x/solr/server/solr/configsets/sample_techproducts_configs must be relative to SOLR_HOME, SOLR_DATA_HOME coreRootDirectory. Set system property 'solr.security.allow.paths' to add other allowed paths.
at __randomizedtesting.SeedInfo.seed([7D371FB148813902]:0)
at app//org.apache.solr.client.solrj.apache.HttpSolrClient.executeMethod(HttpSolrClient.java:685)
at app//org.apache.solr.client.solrj.apache.HttpSolrClient.request(HttpSolrClient.java:254)
at app//org.apache.solr.client.solrj.apache.HttpSolrClient.request(HttpSolrClient.java:233)
at app//org.apache.solr.client.solrj.SolrRequest.process(SolrRequest.java:302)
at app//org.apache.solr.client.solrj.SolrRequest.process(SolrRequest.java:348)
at app//org.apache.solr.util.SolrClientTestRule.create(SolrClientTestRule.java:160)
at app//org.apache.solr.util.SolrClientTestRule$NewCollectionBuilder.create(SolrClientTestRule.java:126)
at app//org.apache.solr.handler.component.DistributedDebugComponentTest.createThings(DistributedDebugComponentTest.java:62)
at java.base@21.0.4/jdk.internal.reflect.DirectMethodHandleAccessor.invoke(DirectMethodHandleAccessor.java:103)
at java.base@21.0.4/java.lang.reflect.Method.invoke(Method.java:580)
at app//com.carrotsearch.randomizedtesting.RandomizedRunner.invoke(RandomizedRunner.java:1763)
at app//com.carrotsearch.randomizedtesting.RandomizedRunner$6.evaluate(RandomizedRunner.java:886)
at app//com.carrotsearch.randomizedtesting.RandomizedRunner$7.evaluate(RandomizedRunner.java:902)
at app//org.junit.rules.ExternalResource$1.evaluate(ExternalResource.java:54)
at app//com.carrotsearch.randomizedtesting.rules.StatementAdapter.evaluate(StatementAdapter.java:36)
at app//com.carrotsearch.randomizedtesting.rules.StatementAdapter.evaluate(StatementAdapter.java:36)
at app//org.apache.lucene.tests.util.AbstractBeforeAfterRule$1.evaluate(AbstractBeforeAfterRule.java:43)
at app//com.carrotsearch.randomizedtesting.rules.SystemPropertiesRestoreRule$1.evaluate(SystemPropertiesRestoreRule.java:80)
at app//org.junit.rules.RunRules.evaluate(RunRules.java:20)
at app//org.apache.lucene.tests.util.AbstractBeforeAfterRule$1.evaluate(AbstractBeforeAfterRule.java:43)
at app//com.carrotsearch.randomizedtesting.rules.StatementAdapter.evaluate(StatementAdapter.java:36)
at app//org.apache.lucene.tests.util.TestRuleStoreClassName$1.evaluate(TestRuleStoreClassName.java:38)
at app//com.carrotsearch.randomizedtesting.rules.NoShadowingOrOverridesOnMethodsRule$1.evaluate(NoShadowingOrOverridesOnMethodsRule.java:40)
at app//com.carrotsearch.randomizedtesting.rules.NoShadowingOrOverridesOnMethodsRule$1.evaluate(NoShadowingOrOverridesOnMethodsRule.java:40)
at app//com.carrotsearch.randomizedtesting.rules.StatementAdapter.evaluate(StatementAdapter.java:36)
at app//com.carrotsearch.randomizedtesting.rules.StatementAdapter.evaluate(StatementAdapter.java:36)
at app//org.apache.lucene.tests.util.TestRuleAssertionsRequired$1.evaluate(TestRuleAssertionsRequired.java:53)
at app//org.apache.lucene.tests.util.AbstractBeforeAfterRule$1.evaluate(AbstractBeforeAfterRule.java:43)
at app//org.apache.lucene.tests.util.TestRuleMarkFailure$1.evaluate(TestRuleMarkFailure.java:44)
at app//org.apache.lucene.tests.util.TestRuleIgnoreAfterMaxFailures$1.evaluate(TestRuleIgnoreAfterMaxFailures.java:60)
at app//org.apache.lucene.tests.util.TestRuleIgnoreTestSuites$1.evaluate(TestRuleIgnoreTestSuites.java:47)
at app//org.junit.rules.RunRules.evaluate(RunRules.java:20)
at app//com.carrotsearch.randomizedtesting.rules.StatementAdapter.evaluate(StatementAdapter.java:36)
at app//com.carrotsearch.randomizedtesting.ThreadLeakControl$StatementRunner.run(ThreadLeakControl.java:390)
at app//com.carrotsearch.randomizedtesting.ThreadLeakControl.lambda$forkTimeoutingTask$0(ThreadLeakControl.java:850)
at java.base@21.0.4/java.lang.Thread.run(Thread.java:1583)
Build Log:
[...truncated 1810 lines...]
ERROR: The following test(s) have failed:
- org.apache.solr.handler.component.DistributedDebugComponentTest (:solr:core)
Test history: https://develocity.apache.org/scans/tests?search.rootProjectNames=solr-root&tests.container=org.apache.solr.handler.component.DistributedDebugComponentTest
Test output: /home/jenkins/jenkins-agent/workspace/Solr/Solr-Test-10.x/solr/core/build/test-results/test/outputs/OUTPUT-org.apache.solr.handler.component.DistributedDebugComponentTest.txt
Reproduce with: ./gradlew :solr:core:test --tests "org.apache.solr.handler.component.DistributedDebugComponentTest" -Ptests.haltonfailure=false "-Ptests.jvmargs=-XX:TieredStopAtLevel=1 -XX:+UseParallelGC -XX:ActiveProcessorCount=1 -XX:ReservedCodeCacheSize=120m" -Ptests.seed=7D371FB148813902 -Ptests.multiplier=2 -Ptests.useSecurityManager=true -Ptests.badapples=false -Ptests.file.encoding=UTF-8
Deprecated Gradle features were used in this build, making it incompatible with Gradle 9.0.
You can use '--warning-mode all' to show the individual deprecation warnings and determine if they come from your own scripts or plugins.
For more on this, please refer to https://docs.gradle.org/8.10/userguide/command_line_interface.html#sec:command_line_warnings in the Gradle documentation.
BUILD SUCCESSFUL in 40m 20s
146 actionable tasks: 146 executed
Publishing build scan...
https://develocity.apache.org/s/4qjbzhjif2j6w
Build step 'Invoke Gradle script' changed build result to SUCCESS
Archiving artifacts
‘**/*.events’ doesn’t match anything: ‘**’ exists but not ‘**/*.events’
No artifacts found that match the file pattern "**/*.events,heapdumps/**,**/hs_err_pid*". Configuration error?
Recording test results
[Checks API] No suitable checks publisher found.
Build step 'Publish JUnit test result report' changed build result to UNSTABLE
Email was triggered for: Unstable (Test Failures)
Sending email for trigger: Unstable (Test Failures)