You are viewing a plain text version of this content. The canonical link for it is here.
Posted to dev@lucene.apache.org by Policeman Jenkins Server <je...@thetaphi.de> on 2016/02/27 18:55:51 UTC

[JENKINS-EA] Lucene-Solr-trunk-Linux (32bit/jdk-9-ea+106) - Build # 16025 - Still Failing!

Build: http://jenkins.thetaphi.de/job/Lucene-Solr-trunk-Linux/16025/
Java: 32bit/jdk-9-ea+106 -server -XX:+UseG1GC

37 tests failed.
FAILED:  org.apache.lucene.codecs.autoprefix.TestAutoPrefixPostingsFormat.test

Error Message:
Unable to unmap the mapped buffer: MMapIndexInput(path="/home/jenkins/workspace/Lucene-Solr-trunk-Linux/lucene/build/codecs/test/J1/temp/lucene.codecs.autoprefix.TestAutoPrefixPostingsFormat_4AD4CB7CC8B872A6-001/autoprefix-001/_0_AutoPrefix_0.doc")

Stack Trace:
java.io.IOException: Unable to unmap the mapped buffer: MMapIndexInput(path="/home/jenkins/workspace/Lucene-Solr-trunk-Linux/lucene/build/codecs/test/J1/temp/lucene.codecs.autoprefix.TestAutoPrefixPostingsFormat_4AD4CB7CC8B872A6-001/autoprefix-001/_0_AutoPrefix_0.doc")
	at __randomizedtesting.SeedInfo.seed([4AD4CB7CC8B872A6:C280F4A666441F5E]:0)
	at org.apache.lucene.store.MMapDirectory.lambda$initUnmapHack$1(MMapDirectory.java:384)
	at org.apache.lucene.store.ByteBufferIndexInput.freeBuffer(ByteBufferIndexInput.java:376)
	at org.apache.lucene.store.ByteBufferIndexInput.close(ByteBufferIndexInput.java:355)
	at org.apache.lucene.util.LuceneTestCase.slowFileExists(LuceneTestCase.java:2680)
	at org.apache.lucene.store.MockDirectoryWrapper.openInput(MockDirectoryWrapper.java:732)
	at org.apache.lucene.codecs.lucene50.Lucene50PostingsReader.<init>(Lucene50PostingsReader.java:81)
	at org.apache.lucene.codecs.autoprefix.AutoPrefixPostingsFormat.fieldsProducer(AutoPrefixPostingsFormat.java:113)
	at org.apache.lucene.codecs.perfield.PerFieldPostingsFormat$FieldsReader.<init>(PerFieldPostingsFormat.java:261)
	at org.apache.lucene.codecs.perfield.PerFieldPostingsFormat.fieldsProducer(PerFieldPostingsFormat.java:341)
	at org.apache.lucene.index.RandomPostingsTester.buildIndex(RandomPostingsTester.java:680)
	at org.apache.lucene.index.RandomPostingsTester.testFull(RandomPostingsTester.java:1253)
	at org.apache.lucene.codecs.autoprefix.TestAutoPrefixPostingsFormat.test(TestAutoPrefixPostingsFormat.java:33)
	at sun.reflect.NativeMethodAccessorImpl.invoke0(Native Method)
	at sun.reflect.NativeMethodAccessorImpl.invoke(NativeMethodAccessorImpl.java:62)
	at sun.reflect.DelegatingMethodAccessorImpl.invoke(DelegatingMethodAccessorImpl.java:43)
	at java.lang.reflect.Method.invoke(Method.java:520)
	at com.carrotsearch.randomizedtesting.RandomizedRunner.invoke(RandomizedRunner.java:1764)
	at com.carrotsearch.randomizedtesting.RandomizedRunner$8.evaluate(RandomizedRunner.java:871)
	at com.carrotsearch.randomizedtesting.RandomizedRunner$9.evaluate(RandomizedRunner.java:907)
	at com.carrotsearch.randomizedtesting.RandomizedRunner$10.evaluate(RandomizedRunner.java:921)
	at org.apache.lucene.util.TestRuleSetupTeardownChained$1.evaluate(TestRuleSetupTeardownChained.java:49)
	at org.apache.lucene.util.AbstractBeforeAfterRule$1.evaluate(AbstractBeforeAfterRule.java:45)
	at org.apache.lucene.util.TestRuleThreadAndTestName$1.evaluate(TestRuleThreadAndTestName.java:48)
	at org.apache.lucene.util.TestRuleIgnoreAfterMaxFailures$1.evaluate(TestRuleIgnoreAfterMaxFailures.java:64)
	at org.apache.lucene.util.TestRuleMarkFailure$1.evaluate(TestRuleMarkFailure.java:47)
	at com.carrotsearch.randomizedtesting.rules.StatementAdapter.evaluate(StatementAdapter.java:36)
	at com.carrotsearch.randomizedtesting.ThreadLeakControl$StatementRunner.run(ThreadLeakControl.java:367)
	at com.carrotsearch.randomizedtesting.ThreadLeakControl.forkTimeoutingTask(ThreadLeakControl.java:809)
	at com.carrotsearch.randomizedtesting.ThreadLeakControl$3.evaluate(ThreadLeakControl.java:460)
	at com.carrotsearch.randomizedtesting.RandomizedRunner.runSingleTest(RandomizedRunner.java:880)
	at com.carrotsearch.randomizedtesting.RandomizedRunner$5.evaluate(RandomizedRunner.java:781)
	at com.carrotsearch.randomizedtesting.RandomizedRunner$6.evaluate(RandomizedRunner.java:816)
	at com.carrotsearch.randomizedtesting.RandomizedRunner$7.evaluate(RandomizedRunner.java:827)
	at org.apache.lucene.util.AbstractBeforeAfterRule$1.evaluate(AbstractBeforeAfterRule.java:45)
	at com.carrotsearch.randomizedtesting.rules.StatementAdapter.evaluate(StatementAdapter.java:36)
	at org.apache.lucene.util.TestRuleStoreClassName$1.evaluate(TestRuleStoreClassName.java:41)
	at com.carrotsearch.randomizedtesting.rules.NoShadowingOrOverridesOnMethodsRule$1.evaluate(NoShadowingOrOverridesOnMethodsRule.java:40)
	at com.carrotsearch.randomizedtesting.rules.NoShadowingOrOverridesOnMethodsRule$1.evaluate(NoShadowingOrOverridesOnMethodsRule.java:40)
	at com.carrotsearch.randomizedtesting.rules.StatementAdapter.evaluate(StatementAdapter.java:36)
	at com.carrotsearch.randomizedtesting.rules.StatementAdapter.evaluate(StatementAdapter.java:36)
	at com.carrotsearch.randomizedtesting.rules.StatementAdapter.evaluate(StatementAdapter.java:36)
	at org.apache.lucene.util.TestRuleAssertionsRequired$1.evaluate(TestRuleAssertionsRequired.java:53)
	at org.apache.lucene.util.TestRuleMarkFailure$1.evaluate(TestRuleMarkFailure.java:47)
	at org.apache.lucene.util.TestRuleIgnoreAfterMaxFailures$1.evaluate(TestRuleIgnoreAfterMaxFailures.java:64)
	at org.apache.lucene.util.TestRuleIgnoreTestSuites$1.evaluate(TestRuleIgnoreTestSuites.java:54)
	at com.carrotsearch.randomizedtesting.rules.StatementAdapter.evaluate(StatementAdapter.java:36)
	at com.carrotsearch.randomizedtesting.ThreadLeakControl$StatementRunner.run(ThreadLeakControl.java:367)
	at java.lang.Thread.run(Thread.java:804)
Caused by: java.lang.IncompatibleClassChangeError: Found class jdk.internal.ref.Cleaner, but interface was expected
	at org.apache.lucene.store.MMapDirectory.lambda$initUnmapHack$0(MMapDirectory.java:377)
	at java.security.AccessController.doPrivileged(Native Method)
	at org.apache.lucene.store.MMapDirectory.lambda$initUnmapHack$1(MMapDirectory.java:375)
	... 47 more


FAILED:  org.apache.lucene.codecs.blockterms.TestVarGapFixedIntervalPostingsFormat.testRandom

Error Message:
Unable to unmap the mapped buffer: MMapIndexInput(path="/home/jenkins/workspace/Lucene-Solr-trunk-Linux/lucene/build/codecs/test/J1/temp/lucene.codecs.blockterms.TestVarGapFixedIntervalPostingsFormat_4AD4CB7CC8B872A6-001/testPostingsFormat-002/_0_LuceneVarGapDocFreqInterval_0.doc")

Stack Trace:
java.io.IOException: Unable to unmap the mapped buffer: MMapIndexInput(path="/home/jenkins/workspace/Lucene-Solr-trunk-Linux/lucene/build/codecs/test/J1/temp/lucene.codecs.blockterms.TestVarGapFixedIntervalPostingsFormat_4AD4CB7CC8B872A6-001/testPostingsFormat-002/_0_LuceneVarGapDocFreqInterval_0.doc")
	at __randomizedtesting.SeedInfo.seed([4AD4CB7CC8B872A6:3898EE7379D8C4D5]:0)
	at org.apache.lucene.store.MMapDirectory.lambda$initUnmapHack$1(MMapDirectory.java:384)
	at org.apache.lucene.store.ByteBufferIndexInput.freeBuffer(ByteBufferIndexInput.java:376)
	at org.apache.lucene.store.ByteBufferIndexInput.close(ByteBufferIndexInput.java:355)
	at org.apache.lucene.util.LuceneTestCase.slowFileExists(LuceneTestCase.java:2680)
	at org.apache.lucene.store.MockDirectoryWrapper.openInput(MockDirectoryWrapper.java:732)
	at org.apache.lucene.codecs.lucene50.Lucene50PostingsReader.<init>(Lucene50PostingsReader.java:81)
	at org.apache.lucene.codecs.blockterms.LuceneVarGapDocFreqInterval.fieldsProducer(LuceneVarGapDocFreqInterval.java:100)
	at org.apache.lucene.codecs.perfield.PerFieldPostingsFormat$FieldsReader.<init>(PerFieldPostingsFormat.java:261)
	at org.apache.lucene.codecs.perfield.PerFieldPostingsFormat.fieldsProducer(PerFieldPostingsFormat.java:341)
	at org.apache.lucene.index.RandomPostingsTester.buildIndex(RandomPostingsTester.java:680)
	at org.apache.lucene.index.BasePostingsFormatTestCase.testRandom(BasePostingsFormatTestCase.java:135)
	at sun.reflect.NativeMethodAccessorImpl.invoke0(Native Method)
	at sun.reflect.NativeMethodAccessorImpl.invoke(NativeMethodAccessorImpl.java:62)
	at sun.reflect.DelegatingMethodAccessorImpl.invoke(DelegatingMethodAccessorImpl.java:43)
	at java.lang.reflect.Method.invoke(Method.java:520)
	at com.carrotsearch.randomizedtesting.RandomizedRunner.invoke(RandomizedRunner.java:1764)
	at com.carrotsearch.randomizedtesting.RandomizedRunner$8.evaluate(RandomizedRunner.java:871)
	at com.carrotsearch.randomizedtesting.RandomizedRunner$9.evaluate(RandomizedRunner.java:907)
	at com.carrotsearch.randomizedtesting.RandomizedRunner$10.evaluate(RandomizedRunner.java:921)
	at org.apache.lucene.util.TestRuleSetupTeardownChained$1.evaluate(TestRuleSetupTeardownChained.java:49)
	at org.apache.lucene.util.AbstractBeforeAfterRule$1.evaluate(AbstractBeforeAfterRule.java:45)
	at org.apache.lucene.util.TestRuleThreadAndTestName$1.evaluate(TestRuleThreadAndTestName.java:48)
	at org.apache.lucene.util.TestRuleIgnoreAfterMaxFailures$1.evaluate(TestRuleIgnoreAfterMaxFailures.java:64)
	at org.apache.lucene.util.TestRuleMarkFailure$1.evaluate(TestRuleMarkFailure.java:47)
	at com.carrotsearch.randomizedtesting.rules.StatementAdapter.evaluate(StatementAdapter.java:36)
	at com.carrotsearch.randomizedtesting.ThreadLeakControl$StatementRunner.run(ThreadLeakControl.java:367)
	at com.carrotsearch.randomizedtesting.ThreadLeakControl.forkTimeoutingTask(ThreadLeakControl.java:809)
	at com.carrotsearch.randomizedtesting.ThreadLeakControl$3.evaluate(ThreadLeakControl.java:460)
	at com.carrotsearch.randomizedtesting.RandomizedRunner.runSingleTest(RandomizedRunner.java:880)
	at com.carrotsearch.randomizedtesting.RandomizedRunner$5.evaluate(RandomizedRunner.java:781)
	at com.carrotsearch.randomizedtesting.RandomizedRunner$6.evaluate(RandomizedRunner.java:816)
	at com.carrotsearch.randomizedtesting.RandomizedRunner$7.evaluate(RandomizedRunner.java:827)
	at org.apache.lucene.util.AbstractBeforeAfterRule$1.evaluate(AbstractBeforeAfterRule.java:45)
	at com.carrotsearch.randomizedtesting.rules.StatementAdapter.evaluate(StatementAdapter.java:36)
	at org.apache.lucene.util.TestRuleStoreClassName$1.evaluate(TestRuleStoreClassName.java:41)
	at com.carrotsearch.randomizedtesting.rules.NoShadowingOrOverridesOnMethodsRule$1.evaluate(NoShadowingOrOverridesOnMethodsRule.java:40)
	at com.carrotsearch.randomizedtesting.rules.NoShadowingOrOverridesOnMethodsRule$1.evaluate(NoShadowingOrOverridesOnMethodsRule.java:40)
	at com.carrotsearch.randomizedtesting.rules.StatementAdapter.evaluate(StatementAdapter.java:36)
	at com.carrotsearch.randomizedtesting.rules.StatementAdapter.evaluate(StatementAdapter.java:36)
	at com.carrotsearch.randomizedtesting.rules.StatementAdapter.evaluate(StatementAdapter.java:36)
	at org.apache.lucene.util.TestRuleAssertionsRequired$1.evaluate(TestRuleAssertionsRequired.java:53)
	at org.apache.lucene.util.TestRuleMarkFailure$1.evaluate(TestRuleMarkFailure.java:47)
	at org.apache.lucene.util.TestRuleIgnoreAfterMaxFailures$1.evaluate(TestRuleIgnoreAfterMaxFailures.java:64)
	at org.apache.lucene.util.TestRuleIgnoreTestSuites$1.evaluate(TestRuleIgnoreTestSuites.java:54)
	at com.carrotsearch.randomizedtesting.rules.StatementAdapter.evaluate(StatementAdapter.java:36)
	at com.carrotsearch.randomizedtesting.ThreadLeakControl$StatementRunner.run(ThreadLeakControl.java:367)
	at java.lang.Thread.run(Thread.java:804)
Caused by: java.lang.IncompatibleClassChangeError: Found class jdk.internal.ref.Cleaner, but interface was expected
	at org.apache.lucene.store.MMapDirectory.lambda$initUnmapHack$0(MMapDirectory.java:377)
	at java.security.AccessController.doPrivileged(Native Method)
	at org.apache.lucene.store.MMapDirectory.lambda$initUnmapHack$1(MMapDirectory.java:375)
	... 46 more


FAILED:  org.apache.lucene.codecs.blockterms.TestVarGapFixedIntervalPostingsFormat.testDocsAndFreqsAndPositionsAndOffsets

Error Message:
Unable to unmap the mapped buffer: MMapIndexInput(path="/home/jenkins/workspace/Lucene-Solr-trunk-Linux/lucene/build/codecs/test/J1/temp/lucene.codecs.blockterms.TestVarGapFixedIntervalPostingsFormat_4AD4CB7CC8B872A6-001/testPostingsFormat.testExact-001/_0_LuceneVarGapDocFreqInterval_0.doc")

Stack Trace:
java.io.IOException: Unable to unmap the mapped buffer: MMapIndexInput(path="/home/jenkins/workspace/Lucene-Solr-trunk-Linux/lucene/build/codecs/test/J1/temp/lucene.codecs.blockterms.TestVarGapFixedIntervalPostingsFormat_4AD4CB7CC8B872A6-001/testPostingsFormat.testExact-001/_0_LuceneVarGapDocFreqInterval_0.doc")
	at __randomizedtesting.SeedInfo.seed([4AD4CB7CC8B872A6:73E7265422CB7F42]:0)
	at org.apache.lucene.store.MMapDirectory.lambda$initUnmapHack$1(MMapDirectory.java:384)
	at org.apache.lucene.store.ByteBufferIndexInput.freeBuffer(ByteBufferIndexInput.java:376)
	at org.apache.lucene.store.ByteBufferIndexInput.close(ByteBufferIndexInput.java:355)
	at org.apache.lucene.util.LuceneTestCase.slowFileExists(LuceneTestCase.java:2680)
	at org.apache.lucene.store.MockDirectoryWrapper.openInput(MockDirectoryWrapper.java:732)
	at org.apache.lucene.codecs.lucene50.Lucene50PostingsReader.<init>(Lucene50PostingsReader.java:81)
	at org.apache.lucene.codecs.blockterms.LuceneVarGapDocFreqInterval.fieldsProducer(LuceneVarGapDocFreqInterval.java:100)
	at org.apache.lucene.codecs.perfield.PerFieldPostingsFormat$FieldsReader.<init>(PerFieldPostingsFormat.java:261)
	at org.apache.lucene.codecs.perfield.PerFieldPostingsFormat.fieldsProducer(PerFieldPostingsFormat.java:341)
	at org.apache.lucene.index.RandomPostingsTester.buildIndex(RandomPostingsTester.java:680)
	at org.apache.lucene.index.RandomPostingsTester.testFull(RandomPostingsTester.java:1253)
	at org.apache.lucene.index.BasePostingsFormatTestCase.testDocsAndFreqsAndPositionsAndOffsets(BasePostingsFormatTestCase.java:118)
	at sun.reflect.NativeMethodAccessorImpl.invoke0(Native Method)
	at sun.reflect.NativeMethodAccessorImpl.invoke(NativeMethodAccessorImpl.java:62)
	at sun.reflect.DelegatingMethodAccessorImpl.invoke(DelegatingMethodAccessorImpl.java:43)
	at java.lang.reflect.Method.invoke(Method.java:520)
	at com.carrotsearch.randomizedtesting.RandomizedRunner.invoke(RandomizedRunner.java:1764)
	at com.carrotsearch.randomizedtesting.RandomizedRunner$8.evaluate(RandomizedRunner.java:871)
	at com.carrotsearch.randomizedtesting.RandomizedRunner$9.evaluate(RandomizedRunner.java:907)
	at com.carrotsearch.randomizedtesting.RandomizedRunner$10.evaluate(RandomizedRunner.java:921)
	at org.apache.lucene.util.TestRuleSetupTeardownChained$1.evaluate(TestRuleSetupTeardownChained.java:49)
	at org.apache.lucene.util.AbstractBeforeAfterRule$1.evaluate(AbstractBeforeAfterRule.java:45)
	at org.apache.lucene.util.TestRuleThreadAndTestName$1.evaluate(TestRuleThreadAndTestName.java:48)
	at org.apache.lucene.util.TestRuleIgnoreAfterMaxFailures$1.evaluate(TestRuleIgnoreAfterMaxFailures.java:64)
	at org.apache.lucene.util.TestRuleMarkFailure$1.evaluate(TestRuleMarkFailure.java:47)
	at com.carrotsearch.randomizedtesting.rules.StatementAdapter.evaluate(StatementAdapter.java:36)
	at com.carrotsearch.randomizedtesting.ThreadLeakControl$StatementRunner.run(ThreadLeakControl.java:367)
	at com.carrotsearch.randomizedtesting.ThreadLeakControl.forkTimeoutingTask(ThreadLeakControl.java:809)
	at com.carrotsearch.randomizedtesting.ThreadLeakControl$3.evaluate(ThreadLeakControl.java:460)
	at com.carrotsearch.randomizedtesting.RandomizedRunner.runSingleTest(RandomizedRunner.java:880)
	at com.carrotsearch.randomizedtesting.RandomizedRunner$5.evaluate(RandomizedRunner.java:781)
	at com.carrotsearch.randomizedtesting.RandomizedRunner$6.evaluate(RandomizedRunner.java:816)
	at com.carrotsearch.randomizedtesting.RandomizedRunner$7.evaluate(RandomizedRunner.java:827)
	at org.apache.lucene.util.AbstractBeforeAfterRule$1.evaluate(AbstractBeforeAfterRule.java:45)
	at com.carrotsearch.randomizedtesting.rules.StatementAdapter.evaluate(StatementAdapter.java:36)
	at org.apache.lucene.util.TestRuleStoreClassName$1.evaluate(TestRuleStoreClassName.java:41)
	at com.carrotsearch.randomizedtesting.rules.NoShadowingOrOverridesOnMethodsRule$1.evaluate(NoShadowingOrOverridesOnMethodsRule.java:40)
	at com.carrotsearch.randomizedtesting.rules.NoShadowingOrOverridesOnMethodsRule$1.evaluate(NoShadowingOrOverridesOnMethodsRule.java:40)
	at com.carrotsearch.randomizedtesting.rules.StatementAdapter.evaluate(StatementAdapter.java:36)
	at com.carrotsearch.randomizedtesting.rules.StatementAdapter.evaluate(StatementAdapter.java:36)
	at com.carrotsearch.randomizedtesting.rules.StatementAdapter.evaluate(StatementAdapter.java:36)
	at org.apache.lucene.util.TestRuleAssertionsRequired$1.evaluate(TestRuleAssertionsRequired.java:53)
	at org.apache.lucene.util.TestRuleMarkFailure$1.evaluate(TestRuleMarkFailure.java:47)
	at org.apache.lucene.util.TestRuleIgnoreAfterMaxFailures$1.evaluate(TestRuleIgnoreAfterMaxFailures.java:64)
	at org.apache.lucene.util.TestRuleIgnoreTestSuites$1.evaluate(TestRuleIgnoreTestSuites.java:54)
	at com.carrotsearch.randomizedtesting.rules.StatementAdapter.evaluate(StatementAdapter.java:36)
	at com.carrotsearch.randomizedtesting.ThreadLeakControl$StatementRunner.run(ThreadLeakControl.java:367)
	at java.lang.Thread.run(Thread.java:804)
Caused by: java.lang.IncompatibleClassChangeError: Found class jdk.internal.ref.Cleaner, but interface was expected
	at org.apache.lucene.store.MMapDirectory.lambda$initUnmapHack$0(MMapDirectory.java:377)
	at java.security.AccessController.doPrivileged(Native Method)
	at org.apache.lucene.store.MMapDirectory.lambda$initUnmapHack$1(MMapDirectory.java:375)
	... 47 more


FAILED:  org.apache.lucene.codecs.blockterms.TestVarGapFixedIntervalPostingsFormat.testMultiClose

Error Message:
Unable to unmap the mapped buffer: MMapIndexInput(path="/home/jenkins/workspace/Lucene-Solr-trunk-Linux/lucene/build/codecs/test/J1/temp/lucene.codecs.blockterms.TestVarGapFixedIntervalPostingsFormat_4AD4CB7CC8B872A6-001/justSoYouGetSomeChannelErrors-001/_0_LuceneVarGapDocFreqInterval_0.doc")

Stack Trace:
java.io.IOException: Unable to unmap the mapped buffer: MMapIndexInput(path="/home/jenkins/workspace/Lucene-Solr-trunk-Linux/lucene/build/codecs/test/J1/temp/lucene.codecs.blockterms.TestVarGapFixedIntervalPostingsFormat_4AD4CB7CC8B872A6-001/justSoYouGetSomeChannelErrors-001/_0_LuceneVarGapDocFreqInterval_0.doc")
	at __randomizedtesting.SeedInfo.seed([4AD4CB7CC8B872A6:CEE92747D7DA1BBE]:0)
	at org.apache.lucene.store.MMapDirectory.lambda$initUnmapHack$1(MMapDirectory.java:384)
	at org.apache.lucene.store.ByteBufferIndexInput.freeBuffer(ByteBufferIndexInput.java:376)
	at org.apache.lucene.store.ByteBufferIndexInput.close(ByteBufferIndexInput.java:355)
	at org.apache.lucene.util.LuceneTestCase.slowFileExists(LuceneTestCase.java:2680)
	at org.apache.lucene.store.MockDirectoryWrapper.openInput(MockDirectoryWrapper.java:732)
	at org.apache.lucene.codecs.lucene50.Lucene50PostingsReader.<init>(Lucene50PostingsReader.java:81)
	at org.apache.lucene.codecs.blockterms.LuceneVarGapDocFreqInterval.fieldsProducer(LuceneVarGapDocFreqInterval.java:100)
	at org.apache.lucene.codecs.perfield.PerFieldPostingsFormat$FieldsReader.<init>(PerFieldPostingsFormat.java:261)
	at org.apache.lucene.codecs.perfield.PerFieldPostingsFormat.fieldsProducer(PerFieldPostingsFormat.java:341)
	at org.apache.lucene.index.BaseIndexFileFormatTestCase.testMultiClose(BaseIndexFileFormatTestCase.java:326)
	at org.apache.lucene.index.BasePostingsFormatTestCase.testMultiClose(BasePostingsFormatTestCase.java:85)
	at sun.reflect.NativeMethodAccessorImpl.invoke0(Native Method)
	at sun.reflect.NativeMethodAccessorImpl.invoke(NativeMethodAccessorImpl.java:62)
	at sun.reflect.DelegatingMethodAccessorImpl.invoke(DelegatingMethodAccessorImpl.java:43)
	at java.lang.reflect.Method.invoke(Method.java:520)
	at com.carrotsearch.randomizedtesting.RandomizedRunner.invoke(RandomizedRunner.java:1764)
	at com.carrotsearch.randomizedtesting.RandomizedRunner$8.evaluate(RandomizedRunner.java:871)
	at com.carrotsearch.randomizedtesting.RandomizedRunner$9.evaluate(RandomizedRunner.java:907)
	at com.carrotsearch.randomizedtesting.RandomizedRunner$10.evaluate(RandomizedRunner.java:921)
	at org.apache.lucene.util.TestRuleSetupTeardownChained$1.evaluate(TestRuleSetupTeardownChained.java:49)
	at org.apache.lucene.util.AbstractBeforeAfterRule$1.evaluate(AbstractBeforeAfterRule.java:45)
	at org.apache.lucene.util.TestRuleThreadAndTestName$1.evaluate(TestRuleThreadAndTestName.java:48)
	at org.apache.lucene.util.TestRuleIgnoreAfterMaxFailures$1.evaluate(TestRuleIgnoreAfterMaxFailures.java:64)
	at org.apache.lucene.util.TestRuleMarkFailure$1.evaluate(TestRuleMarkFailure.java:47)
	at com.carrotsearch.randomizedtesting.rules.StatementAdapter.evaluate(StatementAdapter.java:36)
	at com.carrotsearch.randomizedtesting.ThreadLeakControl$StatementRunner.run(ThreadLeakControl.java:367)
	at com.carrotsearch.randomizedtesting.ThreadLeakControl.forkTimeoutingTask(ThreadLeakControl.java:809)
	at com.carrotsearch.randomizedtesting.ThreadLeakControl$3.evaluate(ThreadLeakControl.java:460)
	at com.carrotsearch.randomizedtesting.RandomizedRunner.runSingleTest(RandomizedRunner.java:880)
	at com.carrotsearch.randomizedtesting.RandomizedRunner$5.evaluate(RandomizedRunner.java:781)
	at com.carrotsearch.randomizedtesting.RandomizedRunner$6.evaluate(RandomizedRunner.java:816)
	at com.carrotsearch.randomizedtesting.RandomizedRunner$7.evaluate(RandomizedRunner.java:827)
	at org.apache.lucene.util.AbstractBeforeAfterRule$1.evaluate(AbstractBeforeAfterRule.java:45)
	at com.carrotsearch.randomizedtesting.rules.StatementAdapter.evaluate(StatementAdapter.java:36)
	at org.apache.lucene.util.TestRuleStoreClassName$1.evaluate(TestRuleStoreClassName.java:41)
	at com.carrotsearch.randomizedtesting.rules.NoShadowingOrOverridesOnMethodsRule$1.evaluate(NoShadowingOrOverridesOnMethodsRule.java:40)
	at com.carrotsearch.randomizedtesting.rules.NoShadowingOrOverridesOnMethodsRule$1.evaluate(NoShadowingOrOverridesOnMethodsRule.java:40)
	at com.carrotsearch.randomizedtesting.rules.StatementAdapter.evaluate(StatementAdapter.java:36)
	at com.carrotsearch.randomizedtesting.rules.StatementAdapter.evaluate(StatementAdapter.java:36)
	at com.carrotsearch.randomizedtesting.rules.StatementAdapter.evaluate(StatementAdapter.java:36)
	at org.apache.lucene.util.TestRuleAssertionsRequired$1.evaluate(TestRuleAssertionsRequired.java:53)
	at org.apache.lucene.util.TestRuleMarkFailure$1.evaluate(TestRuleMarkFailure.java:47)
	at org.apache.lucene.util.TestRuleIgnoreAfterMaxFailures$1.evaluate(TestRuleIgnoreAfterMaxFailures.java:64)
	at org.apache.lucene.util.TestRuleIgnoreTestSuites$1.evaluate(TestRuleIgnoreTestSuites.java:54)
	at com.carrotsearch.randomizedtesting.rules.StatementAdapter.evaluate(StatementAdapter.java:36)
	at com.carrotsearch.randomizedtesting.ThreadLeakControl$StatementRunner.run(ThreadLeakControl.java:367)
	at java.lang.Thread.run(Thread.java:804)
Caused by: java.lang.IncompatibleClassChangeError: Found class jdk.internal.ref.Cleaner, but interface was expected
	at org.apache.lucene.store.MMapDirectory.lambda$initUnmapHack$0(MMapDirectory.java:377)
	at java.security.AccessController.doPrivileged(Native Method)
	at org.apache.lucene.store.MMapDirectory.lambda$initUnmapHack$1(MMapDirectory.java:375)
	... 46 more


FAILED:  org.apache.lucene.codecs.blockterms.TestVarGapFixedIntervalPostingsFormat.testDocsAndFreqs

Error Message:
Unable to unmap the mapped buffer: MMapIndexInput(path="/home/jenkins/workspace/Lucene-Solr-trunk-Linux/lucene/build/codecs/test/J1/temp/lucene.codecs.blockterms.TestVarGapFixedIntervalPostingsFormat_4AD4CB7CC8B872A6-001/testPostingsFormat.testExact-002/_0_LuceneVarGapDocFreqInterval_0.doc")

Stack Trace:
java.io.IOException: Unable to unmap the mapped buffer: MMapIndexInput(path="/home/jenkins/workspace/Lucene-Solr-trunk-Linux/lucene/build/codecs/test/J1/temp/lucene.codecs.blockterms.TestVarGapFixedIntervalPostingsFormat_4AD4CB7CC8B872A6-001/testPostingsFormat.testExact-002/_0_LuceneVarGapDocFreqInterval_0.doc")
	at __randomizedtesting.SeedInfo.seed([4AD4CB7CC8B872A6:5D1BF1FBCED21280]:0)
	at org.apache.lucene.store.MMapDirectory.lambda$initUnmapHack$1(MMapDirectory.java:384)
	at org.apache.lucene.store.ByteBufferIndexInput.freeBuffer(ByteBufferIndexInput.java:376)
	at org.apache.lucene.store.ByteBufferIndexInput.close(ByteBufferIndexInput.java:355)
	at org.apache.lucene.util.LuceneTestCase.slowFileExists(LuceneTestCase.java:2680)
	at org.apache.lucene.store.MockDirectoryWrapper.openInput(MockDirectoryWrapper.java:732)
	at org.apache.lucene.codecs.lucene50.Lucene50PostingsReader.<init>(Lucene50PostingsReader.java:81)
	at org.apache.lucene.codecs.blockterms.LuceneVarGapDocFreqInterval.fieldsProducer(LuceneVarGapDocFreqInterval.java:100)
	at org.apache.lucene.codecs.perfield.PerFieldPostingsFormat$FieldsReader.<init>(PerFieldPostingsFormat.java:261)
	at org.apache.lucene.codecs.perfield.PerFieldPostingsFormat.fieldsProducer(PerFieldPostingsFormat.java:341)
	at org.apache.lucene.index.RandomPostingsTester.buildIndex(RandomPostingsTester.java:680)
	at org.apache.lucene.index.RandomPostingsTester.testFull(RandomPostingsTester.java:1253)
	at org.apache.lucene.index.BasePostingsFormatTestCase.testDocsAndFreqs(BasePostingsFormatTestCase.java:106)
	at sun.reflect.NativeMethodAccessorImpl.invoke0(Native Method)
	at sun.reflect.NativeMethodAccessorImpl.invoke(NativeMethodAccessorImpl.java:62)
	at sun.reflect.DelegatingMethodAccessorImpl.invoke(DelegatingMethodAccessorImpl.java:43)
	at java.lang.reflect.Method.invoke(Method.java:520)
	at com.carrotsearch.randomizedtesting.RandomizedRunner.invoke(RandomizedRunner.java:1764)
	at com.carrotsearch.randomizedtesting.RandomizedRunner$8.evaluate(RandomizedRunner.java:871)
	at com.carrotsearch.randomizedtesting.RandomizedRunner$9.evaluate(RandomizedRunner.java:907)
	at com.carrotsearch.randomizedtesting.RandomizedRunner$10.evaluate(RandomizedRunner.java:921)
	at org.apache.lucene.util.TestRuleSetupTeardownChained$1.evaluate(TestRuleSetupTeardownChained.java:49)
	at org.apache.lucene.util.AbstractBeforeAfterRule$1.evaluate(AbstractBeforeAfterRule.java:45)
	at org.apache.lucene.util.TestRuleThreadAndTestName$1.evaluate(TestRuleThreadAndTestName.java:48)
	at org.apache.lucene.util.TestRuleIgnoreAfterMaxFailures$1.evaluate(TestRuleIgnoreAfterMaxFailures.java:64)
	at org.apache.lucene.util.TestRuleMarkFailure$1.evaluate(TestRuleMarkFailure.java:47)
	at com.carrotsearch.randomizedtesting.rules.StatementAdapter.evaluate(StatementAdapter.java:36)
	at com.carrotsearch.randomizedtesting.ThreadLeakControl$StatementRunner.run(ThreadLeakControl.java:367)
	at com.carrotsearch.randomizedtesting.ThreadLeakControl.forkTimeoutingTask(ThreadLeakControl.java:809)
	at com.carrotsearch.randomizedtesting.ThreadLeakControl$3.evaluate(ThreadLeakControl.java:460)
	at com.carrotsearch.randomizedtesting.RandomizedRunner.runSingleTest(RandomizedRunner.java:880)
	at com.carrotsearch.randomizedtesting.RandomizedRunner$5.evaluate(RandomizedRunner.java:781)
	at com.carrotsearch.randomizedtesting.RandomizedRunner$6.evaluate(RandomizedRunner.java:816)
	at com.carrotsearch.randomizedtesting.RandomizedRunner$7.evaluate(RandomizedRunner.java:827)
	at org.apache.lucene.util.AbstractBeforeAfterRule$1.evaluate(AbstractBeforeAfterRule.java:45)
	at com.carrotsearch.randomizedtesting.rules.StatementAdapter.evaluate(StatementAdapter.java:36)
	at org.apache.lucene.util.TestRuleStoreClassName$1.evaluate(TestRuleStoreClassName.java:41)
	at com.carrotsearch.randomizedtesting.rules.NoShadowingOrOverridesOnMethodsRule$1.evaluate(NoShadowingOrOverridesOnMethodsRule.java:40)
	at com.carrotsearch.randomizedtesting.rules.NoShadowingOrOverridesOnMethodsRule$1.evaluate(NoShadowingOrOverridesOnMethodsRule.java:40)
	at com.carrotsearch.randomizedtesting.rules.StatementAdapter.evaluate(StatementAdapter.java:36)
	at com.carrotsearch.randomizedtesting.rules.StatementAdapter.evaluate(StatementAdapter.java:36)
	at com.carrotsearch.randomizedtesting.rules.StatementAdapter.evaluate(StatementAdapter.java:36)
	at org.apache.lucene.util.TestRuleAssertionsRequired$1.evaluate(TestRuleAssertionsRequired.java:53)
	at org.apache.lucene.util.TestRuleMarkFailure$1.evaluate(TestRuleMarkFailure.java:47)
	at org.apache.lucene.util.TestRuleIgnoreAfterMaxFailures$1.evaluate(TestRuleIgnoreAfterMaxFailures.java:64)
	at org.apache.lucene.util.TestRuleIgnoreTestSuites$1.evaluate(TestRuleIgnoreTestSuites.java:54)
	at com.carrotsearch.randomizedtesting.rules.StatementAdapter.evaluate(StatementAdapter.java:36)
	at com.carrotsearch.randomizedtesting.ThreadLeakControl$StatementRunner.run(ThreadLeakControl.java:367)
	at java.lang.Thread.run(Thread.java:804)
Caused by: java.lang.IncompatibleClassChangeError: Found class jdk.internal.ref.Cleaner, but interface was expected
	at org.apache.lucene.store.MMapDirectory.lambda$initUnmapHack$0(MMapDirectory.java:377)
	at java.security.AccessController.doPrivileged(Native Method)
	at org.apache.lucene.store.MMapDirectory.lambda$initUnmapHack$1(MMapDirectory.java:375)
	... 47 more


FAILED:  org.apache.lucene.codecs.blockterms.TestVarGapFixedIntervalPostingsFormat.testDocsOnly

Error Message:
Unable to unmap the mapped buffer: MMapIndexInput(path="/home/jenkins/workspace/Lucene-Solr-trunk-Linux/lucene/build/codecs/test/J1/temp/lucene.codecs.blockterms.TestVarGapFixedIntervalPostingsFormat_4AD4CB7CC8B872A6-001/testPostingsFormat.testExact-003/_0_LuceneVarGapDocFreqInterval_0.doc")

Stack Trace:
java.io.IOException: Unable to unmap the mapped buffer: MMapIndexInput(path="/home/jenkins/workspace/Lucene-Solr-trunk-Linux/lucene/build/codecs/test/J1/temp/lucene.codecs.blockterms.TestVarGapFixedIntervalPostingsFormat_4AD4CB7CC8B872A6-001/testPostingsFormat.testExact-003/_0_LuceneVarGapDocFreqInterval_0.doc")
	at __randomizedtesting.SeedInfo.seed([4AD4CB7CC8B872A6:3690616EC26907F6]:0)
	at org.apache.lucene.store.MMapDirectory.lambda$initUnmapHack$1(MMapDirectory.java:384)
	at org.apache.lucene.store.ByteBufferIndexInput.freeBuffer(ByteBufferIndexInput.java:376)
	at org.apache.lucene.store.ByteBufferIndexInput.close(ByteBufferIndexInput.java:355)
	at org.apache.lucene.util.LuceneTestCase.slowFileExists(LuceneTestCase.java:2680)
	at org.apache.lucene.store.MockDirectoryWrapper.openInput(MockDirectoryWrapper.java:732)
	at org.apache.lucene.codecs.lucene50.Lucene50PostingsReader.<init>(Lucene50PostingsReader.java:81)
	at org.apache.lucene.codecs.blockterms.LuceneVarGapDocFreqInterval.fieldsProducer(LuceneVarGapDocFreqInterval.java:100)
	at org.apache.lucene.codecs.perfield.PerFieldPostingsFormat$FieldsReader.<init>(PerFieldPostingsFormat.java:261)
	at org.apache.lucene.codecs.perfield.PerFieldPostingsFormat.fieldsProducer(PerFieldPostingsFormat.java:341)
	at org.apache.lucene.index.RandomPostingsTester.buildIndex(RandomPostingsTester.java:680)
	at org.apache.lucene.index.RandomPostingsTester.testFull(RandomPostingsTester.java:1253)
	at org.apache.lucene.index.BasePostingsFormatTestCase.testDocsOnly(BasePostingsFormatTestCase.java:102)
	at sun.reflect.NativeMethodAccessorImpl.invoke0(Native Method)
	at sun.reflect.NativeMethodAccessorImpl.invoke(NativeMethodAccessorImpl.java:62)
	at sun.reflect.DelegatingMethodAccessorImpl.invoke(DelegatingMethodAccessorImpl.java:43)
	at java.lang.reflect.Method.invoke(Method.java:520)
	at com.carrotsearch.randomizedtesting.RandomizedRunner.invoke(RandomizedRunner.java:1764)
	at com.carrotsearch.randomizedtesting.RandomizedRunner$8.evaluate(RandomizedRunner.java:871)
	at com.carrotsearch.randomizedtesting.RandomizedRunner$9.evaluate(RandomizedRunner.java:907)
	at com.carrotsearch.randomizedtesting.RandomizedRunner$10.evaluate(RandomizedRunner.java:921)
	at org.apache.lucene.util.TestRuleSetupTeardownChained$1.evaluate(TestRuleSetupTeardownChained.java:49)
	at org.apache.lucene.util.AbstractBeforeAfterRule$1.evaluate(AbstractBeforeAfterRule.java:45)
	at org.apache.lucene.util.TestRuleThreadAndTestName$1.evaluate(TestRuleThreadAndTestName.java:48)
	at org.apache.lucene.util.TestRuleIgnoreAfterMaxFailures$1.evaluate(TestRuleIgnoreAfterMaxFailures.java:64)
	at org.apache.lucene.util.TestRuleMarkFailure$1.evaluate(TestRuleMarkFailure.java:47)
	at com.carrotsearch.randomizedtesting.rules.StatementAdapter.evaluate(StatementAdapter.java:36)
	at com.carrotsearch.randomizedtesting.ThreadLeakControl$StatementRunner.run(ThreadLeakControl.java:367)
	at com.carrotsearch.randomizedtesting.ThreadLeakControl.forkTimeoutingTask(ThreadLeakControl.java:809)
	at com.carrotsearch.randomizedtesting.ThreadLeakControl$3.evaluate(ThreadLeakControl.java:460)
	at com.carrotsearch.randomizedtesting.RandomizedRunner.runSingleTest(RandomizedRunner.java:880)
	at com.carrotsearch.randomizedtesting.RandomizedRunner$5.evaluate(RandomizedRunner.java:781)
	at com.carrotsearch.randomizedtesting.RandomizedRunner$6.evaluate(RandomizedRunner.java:816)
	at com.carrotsearch.randomizedtesting.RandomizedRunner$7.evaluate(RandomizedRunner.java:827)
	at org.apache.lucene.util.AbstractBeforeAfterRule$1.evaluate(AbstractBeforeAfterRule.java:45)
	at com.carrotsearch.randomizedtesting.rules.StatementAdapter.evaluate(StatementAdapter.java:36)
	at org.apache.lucene.util.TestRuleStoreClassName$1.evaluate(TestRuleStoreClassName.java:41)
	at com.carrotsearch.randomizedtesting.rules.NoShadowingOrOverridesOnMethodsRule$1.evaluate(NoShadowingOrOverridesOnMethodsRule.java:40)
	at com.carrotsearch.randomizedtesting.rules.NoShadowingOrOverridesOnMethodsRule$1.evaluate(NoShadowingOrOverridesOnMethodsRule.java:40)
	at com.carrotsearch.randomizedtesting.rules.StatementAdapter.evaluate(StatementAdapter.java:36)
	at com.carrotsearch.randomizedtesting.rules.StatementAdapter.evaluate(StatementAdapter.java:36)
	at com.carrotsearch.randomizedtesting.rules.StatementAdapter.evaluate(StatementAdapter.java:36)
	at org.apache.lucene.util.TestRuleAssertionsRequired$1.evaluate(TestRuleAssertionsRequired.java:53)
	at org.apache.lucene.util.TestRuleMarkFailure$1.evaluate(TestRuleMarkFailure.java:47)
	at org.apache.lucene.util.TestRuleIgnoreAfterMaxFailures$1.evaluate(TestRuleIgnoreAfterMaxFailures.java:64)
	at org.apache.lucene.util.TestRuleIgnoreTestSuites$1.evaluate(TestRuleIgnoreTestSuites.java:54)
	at com.carrotsearch.randomizedtesting.rules.StatementAdapter.evaluate(StatementAdapter.java:36)
	at com.carrotsearch.randomizedtesting.ThreadLeakControl$StatementRunner.run(ThreadLeakControl.java:367)
	at java.lang.Thread.run(Thread.java:804)
Caused by: java.lang.IncompatibleClassChangeError: Found class jdk.internal.ref.Cleaner, but interface was expected
	at org.apache.lucene.store.MMapDirectory.lambda$initUnmapHack$0(MMapDirectory.java:377)
	at java.security.AccessController.doPrivileged(Native Method)
	at org.apache.lucene.store.MMapDirectory.lambda$initUnmapHack$1(MMapDirectory.java:375)
	... 47 more


FAILED:  org.apache.lucene.codecs.blockterms.TestVarGapFixedIntervalPostingsFormat.testDocsAndFreqsAndPositionsAndOffsetsAndPayloads

Error Message:
Unable to unmap the mapped buffer: MMapIndexInput(path="/home/jenkins/workspace/Lucene-Solr-trunk-Linux/lucene/build/codecs/test/J1/temp/lucene.codecs.blockterms.TestVarGapFixedIntervalPostingsFormat_4AD4CB7CC8B872A6-001/testPostingsFormat.testExact-004/_0_LuceneVarGapDocFreqInterval_0.doc")

Stack Trace:
java.io.IOException: Unable to unmap the mapped buffer: MMapIndexInput(path="/home/jenkins/workspace/Lucene-Solr-trunk-Linux/lucene/build/codecs/test/J1/temp/lucene.codecs.blockterms.TestVarGapFixedIntervalPostingsFormat_4AD4CB7CC8B872A6-001/testPostingsFormat.testExact-004/_0_LuceneVarGapDocFreqInterval_0.doc")
	at __randomizedtesting.SeedInfo.seed([4AD4CB7CC8B872A6:A4F1D284704FEEA8]:0)
	at org.apache.lucene.store.MMapDirectory.lambda$initUnmapHack$1(MMapDirectory.java:384)
	at org.apache.lucene.store.ByteBufferIndexInput.freeBuffer(ByteBufferIndexInput.java:376)
	at org.apache.lucene.store.ByteBufferIndexInput.close(ByteBufferIndexInput.java:355)
	at org.apache.lucene.util.LuceneTestCase.slowFileExists(LuceneTestCase.java:2680)
	at org.apache.lucene.store.MockDirectoryWrapper.openInput(MockDirectoryWrapper.java:732)
	at org.apache.lucene.codecs.lucene50.Lucene50PostingsReader.<init>(Lucene50PostingsReader.java:81)
	at org.apache.lucene.codecs.blockterms.LuceneVarGapDocFreqInterval.fieldsProducer(LuceneVarGapDocFreqInterval.java:100)
	at org.apache.lucene.codecs.perfield.PerFieldPostingsFormat$FieldsReader.<init>(PerFieldPostingsFormat.java:261)
	at org.apache.lucene.codecs.perfield.PerFieldPostingsFormat.fieldsProducer(PerFieldPostingsFormat.java:341)
	at org.apache.lucene.index.RandomPostingsTester.buildIndex(RandomPostingsTester.java:680)
	at org.apache.lucene.index.RandomPostingsTester.testFull(RandomPostingsTester.java:1253)
	at org.apache.lucene.index.BasePostingsFormatTestCase.testDocsAndFreqsAndPositionsAndOffsetsAndPayloads(BasePostingsFormatTestCase.java:122)
	at sun.reflect.NativeMethodAccessorImpl.invoke0(Native Method)
	at sun.reflect.NativeMethodAccessorImpl.invoke(NativeMethodAccessorImpl.java:62)
	at sun.reflect.DelegatingMethodAccessorImpl.invoke(DelegatingMethodAccessorImpl.java:43)
	at java.lang.reflect.Method.invoke(Method.java:520)
	at com.carrotsearch.randomizedtesting.RandomizedRunner.invoke(RandomizedRunner.java:1764)
	at com.carrotsearch.randomizedtesting.RandomizedRunner$8.evaluate(RandomizedRunner.java:871)
	at com.carrotsearch.randomizedtesting.RandomizedRunner$9.evaluate(RandomizedRunner.java:907)
	at com.carrotsearch.randomizedtesting.RandomizedRunner$10.evaluate(RandomizedRunner.java:921)
	at org.apache.lucene.util.TestRuleSetupTeardownChained$1.evaluate(TestRuleSetupTeardownChained.java:49)
	at org.apache.lucene.util.AbstractBeforeAfterRule$1.evaluate(AbstractBeforeAfterRule.java:45)
	at org.apache.lucene.util.TestRuleThreadAndTestName$1.evaluate(TestRuleThreadAndTestName.java:48)
	at org.apache.lucene.util.TestRuleIgnoreAfterMaxFailures$1.evaluate(TestRuleIgnoreAfterMaxFailures.java:64)
	at org.apache.lucene.util.TestRuleMarkFailure$1.evaluate(TestRuleMarkFailure.java:47)
	at com.carrotsearch.randomizedtesting.rules.StatementAdapter.evaluate(StatementAdapter.java:36)
	at com.carrotsearch.randomizedtesting.ThreadLeakControl$StatementRunner.run(ThreadLeakControl.java:367)
	at com.carrotsearch.randomizedtesting.ThreadLeakControl.forkTimeoutingTask(ThreadLeakControl.java:809)
	at com.carrotsearch.randomizedtesting.ThreadLeakControl$3.evaluate(ThreadLeakControl.java:460)
	at com.carrotsearch.randomizedtesting.RandomizedRunner.runSingleTest(RandomizedRunner.java:880)
	at com.carrotsearch.randomizedtesting.RandomizedRunner$5.evaluate(RandomizedRunner.java:781)
	at com.carrotsearch.randomizedtesting.RandomizedRunner$6.evaluate(RandomizedRunner.java:816)
	at com.carrotsearch.randomizedtesting.RandomizedRunner$7.evaluate(RandomizedRunner.java:827)
	at org.apache.lucene.util.AbstractBeforeAfterRule$1.evaluate(AbstractBeforeAfterRule.java:45)
	at com.carrotsearch.randomizedtesting.rules.StatementAdapter.evaluate(StatementAdapter.java:36)
	at org.apache.lucene.util.TestRuleStoreClassName$1.evaluate(TestRuleStoreClassName.java:41)
	at com.carrotsearch.randomizedtesting.rules.NoShadowingOrOverridesOnMethodsRule$1.evaluate(NoShadowingOrOverridesOnMethodsRule.java:40)
	at com.carrotsearch.randomizedtesting.rules.NoShadowingOrOverridesOnMethodsRule$1.evaluate(NoShadowingOrOverridesOnMethodsRule.java:40)
	at com.carrotsearch.randomizedtesting.rules.StatementAdapter.evaluate(StatementAdapter.java:36)
	at com.carrotsearch.randomizedtesting.rules.StatementAdapter.evaluate(StatementAdapter.java:36)
	at com.carrotsearch.randomizedtesting.rules.StatementAdapter.evaluate(StatementAdapter.java:36)
	at org.apache.lucene.util.TestRuleAssertionsRequired$1.evaluate(TestRuleAssertionsRequired.java:53)
	at org.apache.lucene.util.TestRuleMarkFailure$1.evaluate(TestRuleMarkFailure.java:47)
	at org.apache.lucene.util.TestRuleIgnoreAfterMaxFailures$1.evaluate(TestRuleIgnoreAfterMaxFailures.java:64)
	at org.apache.lucene.util.TestRuleIgnoreTestSuites$1.evaluate(TestRuleIgnoreTestSuites.java:54)
	at com.carrotsearch.randomizedtesting.rules.StatementAdapter.evaluate(StatementAdapter.java:36)
	at com.carrotsearch.randomizedtesting.ThreadLeakControl$StatementRunner.run(ThreadLeakControl.java:367)
	at java.lang.Thread.run(Thread.java:804)
Caused by: java.lang.IncompatibleClassChangeError: Found class jdk.internal.ref.Cleaner, but interface was expected
	at org.apache.lucene.store.MMapDirectory.lambda$initUnmapHack$0(MMapDirectory.java:377)
	at java.security.AccessController.doPrivileged(Native Method)
	at org.apache.lucene.store.MMapDirectory.lambda$initUnmapHack$1(MMapDirectory.java:375)
	... 47 more


FAILED:  org.apache.lucene.codecs.blockterms.TestVarGapFixedIntervalPostingsFormat.testDocsAndFreqsAndPositionsAndPayloads

Error Message:
Unable to unmap the mapped buffer: MMapIndexInput(path="/home/jenkins/workspace/Lucene-Solr-trunk-Linux/lucene/build/codecs/test/J1/temp/lucene.codecs.blockterms.TestVarGapFixedIntervalPostingsFormat_4AD4CB7CC8B872A6-001/testPostingsFormat.testExact-006/_0_LuceneVarGapDocFreqInterval_0.doc")

Stack Trace:
java.io.IOException: Unable to unmap the mapped buffer: MMapIndexInput(path="/home/jenkins/workspace/Lucene-Solr-trunk-Linux/lucene/build/codecs/test/J1/temp/lucene.codecs.blockterms.TestVarGapFixedIntervalPostingsFormat_4AD4CB7CC8B872A6-001/testPostingsFormat.testExact-006/_0_LuceneVarGapDocFreqInterval_0.doc")
	at __randomizedtesting.SeedInfo.seed([4AD4CB7CC8B872A6:FC74CACAF05BB530]:0)
	at org.apache.lucene.store.MMapDirectory.lambda$initUnmapHack$1(MMapDirectory.java:384)
	at org.apache.lucene.store.ByteBufferIndexInput.freeBuffer(ByteBufferIndexInput.java:376)
	at org.apache.lucene.store.ByteBufferIndexInput.close(ByteBufferIndexInput.java:355)
	at org.apache.lucene.util.LuceneTestCase.slowFileExists(LuceneTestCase.java:2680)
	at org.apache.lucene.store.MockDirectoryWrapper.openInput(MockDirectoryWrapper.java:732)
	at org.apache.lucene.codecs.lucene50.Lucene50PostingsReader.<init>(Lucene50PostingsReader.java:81)
	at org.apache.lucene.codecs.blockterms.LuceneVarGapDocFreqInterval.fieldsProducer(LuceneVarGapDocFreqInterval.java:100)
	at org.apache.lucene.codecs.perfield.PerFieldPostingsFormat$FieldsReader.<init>(PerFieldPostingsFormat.java:261)
	at org.apache.lucene.codecs.perfield.PerFieldPostingsFormat.fieldsProducer(PerFieldPostingsFormat.java:341)
	at org.apache.lucene.index.RandomPostingsTester.buildIndex(RandomPostingsTester.java:680)
	at org.apache.lucene.index.RandomPostingsTester.testFull(RandomPostingsTester.java:1253)
	at org.apache.lucene.index.BasePostingsFormatTestCase.testDocsAndFreqsAndPositionsAndPayloads(BasePostingsFormatTestCase.java:114)
	at sun.reflect.NativeMethodAccessorImpl.invoke0(Native Method)
	at sun.reflect.NativeMethodAccessorImpl.invoke(NativeMethodAccessorImpl.java:62)
	at sun.reflect.DelegatingMethodAccessorImpl.invoke(DelegatingMethodAccessorImpl.java:43)
	at java.lang.reflect.Method.invoke(Method.java:520)
	at com.carrotsearch.randomizedtesting.RandomizedRunner.invoke(RandomizedRunner.java:1764)
	at com.carrotsearch.randomizedtesting.RandomizedRunner$8.evaluate(RandomizedRunner.java:871)
	at com.carrotsearch.randomizedtesting.RandomizedRunner$9.evaluate(RandomizedRunner.java:907)
	at com.carrotsearch.randomizedtesting.RandomizedRunner$10.evaluate(RandomizedRunner.java:921)
	at org.apache.lucene.util.TestRuleSetupTeardownChained$1.evaluate(TestRuleSetupTeardownChained.java:49)
	at org.apache.lucene.util.AbstractBeforeAfterRule$1.evaluate(AbstractBeforeAfterRule.java:45)
	at org.apache.lucene.util.TestRuleThreadAndTestName$1.evaluate(TestRuleThreadAndTestName.java:48)
	at org.apache.lucene.util.TestRuleIgnoreAfterMaxFailures$1.evaluate(TestRuleIgnoreAfterMaxFailures.java:64)
	at org.apache.lucene.util.TestRuleMarkFailure$1.evaluate(TestRuleMarkFailure.java:47)
	at com.carrotsearch.randomizedtesting.rules.StatementAdapter.evaluate(StatementAdapter.java:36)
	at com.carrotsearch.randomizedtesting.ThreadLeakControl$StatementRunner.run(ThreadLeakControl.java:367)
	at com.carrotsearch.randomizedtesting.ThreadLeakControl.forkTimeoutingTask(ThreadLeakControl.java:809)
	at com.carrotsearch.randomizedtesting.ThreadLeakControl$3.evaluate(ThreadLeakControl.java:460)
	at com.carrotsearch.randomizedtesting.RandomizedRunner.runSingleTest(RandomizedRunner.java:880)
	at com.carrotsearch.randomizedtesting.RandomizedRunner$5.evaluate(RandomizedRunner.java:781)
	at com.carrotsearch.randomizedtesting.RandomizedRunner$6.evaluate(RandomizedRunner.java:816)
	at com.carrotsearch.randomizedtesting.RandomizedRunner$7.evaluate(RandomizedRunner.java:827)
	at org.apache.lucene.util.AbstractBeforeAfterRule$1.evaluate(AbstractBeforeAfterRule.java:45)
	at com.carrotsearch.randomizedtesting.rules.StatementAdapter.evaluate(StatementAdapter.java:36)
	at org.apache.lucene.util.TestRuleStoreClassName$1.evaluate(TestRuleStoreClassName.java:41)
	at com.carrotsearch.randomizedtesting.rules.NoShadowingOrOverridesOnMethodsRule$1.evaluate(NoShadowingOrOverridesOnMethodsRule.java:40)
	at com.carrotsearch.randomizedtesting.rules.NoShadowingOrOverridesOnMethodsRule$1.evaluate(NoShadowingOrOverridesOnMethodsRule.java:40)
	at com.carrotsearch.randomizedtesting.rules.StatementAdapter.evaluate(StatementAdapter.java:36)
	at com.carrotsearch.randomizedtesting.rules.StatementAdapter.evaluate(StatementAdapter.java:36)
	at com.carrotsearch.randomizedtesting.rules.StatementAdapter.evaluate(StatementAdapter.java:36)
	at org.apache.lucene.util.TestRuleAssertionsRequired$1.evaluate(TestRuleAssertionsRequired.java:53)
	at org.apache.lucene.util.TestRuleMarkFailure$1.evaluate(TestRuleMarkFailure.java:47)
	at org.apache.lucene.util.TestRuleIgnoreAfterMaxFailures$1.evaluate(TestRuleIgnoreAfterMaxFailures.java:64)
	at org.apache.lucene.util.TestRuleIgnoreTestSuites$1.evaluate(TestRuleIgnoreTestSuites.java:54)
	at com.carrotsearch.randomizedtesting.rules.StatementAdapter.evaluate(StatementAdapter.java:36)
	at com.carrotsearch.randomizedtesting.ThreadLeakControl$StatementRunner.run(ThreadLeakControl.java:367)
	at java.lang.Thread.run(Thread.java:804)
Caused by: java.lang.IncompatibleClassChangeError: Found class jdk.internal.ref.Cleaner, but interface was expected
	at org.apache.lucene.store.MMapDirectory.lambda$initUnmapHack$0(MMapDirectory.java:377)
	at java.security.AccessController.doPrivileged(Native Method)
	at org.apache.lucene.store.MMapDirectory.lambda$initUnmapHack$1(MMapDirectory.java:375)
	... 47 more


FAILED:  org.apache.lucene.codecs.blocktreeords.TestOrdsBlockTree.testRandom

Error Message:
Unable to unmap the mapped buffer: MMapIndexInput(path="/home/jenkins/workspace/Lucene-Solr-trunk-Linux/lucene/build/codecs/test/J1/temp/lucene.codecs.blocktreeords.TestOrdsBlockTree_4AD4CB7CC8B872A6-001/testPostingsFormat-002/_0_BlockTreeOrds_0.doc")

Stack Trace:
java.io.IOException: Unable to unmap the mapped buffer: MMapIndexInput(path="/home/jenkins/workspace/Lucene-Solr-trunk-Linux/lucene/build/codecs/test/J1/temp/lucene.codecs.blocktreeords.TestOrdsBlockTree_4AD4CB7CC8B872A6-001/testPostingsFormat-002/_0_BlockTreeOrds_0.doc")
	at __randomizedtesting.SeedInfo.seed([4AD4CB7CC8B872A6:3898EE7379D8C4D5]:0)
	at org.apache.lucene.store.MMapDirectory.lambda$initUnmapHack$1(MMapDirectory.java:384)
	at org.apache.lucene.store.ByteBufferIndexInput.freeBuffer(ByteBufferIndexInput.java:376)
	at org.apache.lucene.store.ByteBufferIndexInput.close(ByteBufferIndexInput.java:355)
	at org.apache.lucene.util.LuceneTestCase.slowFileExists(LuceneTestCase.java:2680)
	at org.apache.lucene.store.MockDirectoryWrapper.openInput(MockDirectoryWrapper.java:732)
	at org.apache.lucene.codecs.lucene50.Lucene50PostingsReader.<init>(Lucene50PostingsReader.java:81)
	at org.apache.lucene.codecs.blocktreeords.BlockTreeOrdsPostingsFormat.fieldsProducer(BlockTreeOrdsPostingsFormat.java:90)
	at org.apache.lucene.codecs.perfield.PerFieldPostingsFormat$FieldsReader.<init>(PerFieldPostingsFormat.java:261)
	at org.apache.lucene.codecs.perfield.PerFieldPostingsFormat.fieldsProducer(PerFieldPostingsFormat.java:341)
	at org.apache.lucene.index.RandomPostingsTester.buildIndex(RandomPostingsTester.java:680)
	at org.apache.lucene.index.BasePostingsFormatTestCase.testRandom(BasePostingsFormatTestCase.java:135)
	at sun.reflect.NativeMethodAccessorImpl.invoke0(Native Method)
	at sun.reflect.NativeMethodAccessorImpl.invoke(NativeMethodAccessorImpl.java:62)
	at sun.reflect.DelegatingMethodAccessorImpl.invoke(DelegatingMethodAccessorImpl.java:43)
	at java.lang.reflect.Method.invoke(Method.java:520)
	at com.carrotsearch.randomizedtesting.RandomizedRunner.invoke(RandomizedRunner.java:1764)
	at com.carrotsearch.randomizedtesting.RandomizedRunner$8.evaluate(RandomizedRunner.java:871)
	at com.carrotsearch.randomizedtesting.RandomizedRunner$9.evaluate(RandomizedRunner.java:907)
	at com.carrotsearch.randomizedtesting.RandomizedRunner$10.evaluate(RandomizedRunner.java:921)
	at org.apache.lucene.util.TestRuleSetupTeardownChained$1.evaluate(TestRuleSetupTeardownChained.java:49)
	at org.apache.lucene.util.AbstractBeforeAfterRule$1.evaluate(AbstractBeforeAfterRule.java:45)
	at org.apache.lucene.util.TestRuleThreadAndTestName$1.evaluate(TestRuleThreadAndTestName.java:48)
	at org.apache.lucene.util.TestRuleIgnoreAfterMaxFailures$1.evaluate(TestRuleIgnoreAfterMaxFailures.java:64)
	at org.apache.lucene.util.TestRuleMarkFailure$1.evaluate(TestRuleMarkFailure.java:47)
	at com.carrotsearch.randomizedtesting.rules.StatementAdapter.evaluate(StatementAdapter.java:36)
	at com.carrotsearch.randomizedtesting.ThreadLeakControl$StatementRunner.run(ThreadLeakControl.java:367)
	at com.carrotsearch.randomizedtesting.ThreadLeakControl.forkTimeoutingTask(ThreadLeakControl.java:809)
	at com.carrotsearch.randomizedtesting.ThreadLeakControl$3.evaluate(ThreadLeakControl.java:460)
	at com.carrotsearch.randomizedtesting.RandomizedRunner.runSingleTest(RandomizedRunner.java:880)
	at com.carrotsearch.randomizedtesting.RandomizedRunner$5.evaluate(RandomizedRunner.java:781)
	at com.carrotsearch.randomizedtesting.RandomizedRunner$6.evaluate(RandomizedRunner.java:816)
	at com.carrotsearch.randomizedtesting.RandomizedRunner$7.evaluate(RandomizedRunner.java:827)
	at org.apache.lucene.util.AbstractBeforeAfterRule$1.evaluate(AbstractBeforeAfterRule.java:45)
	at com.carrotsearch.randomizedtesting.rules.StatementAdapter.evaluate(StatementAdapter.java:36)
	at org.apache.lucene.util.TestRuleStoreClassName$1.evaluate(TestRuleStoreClassName.java:41)
	at com.carrotsearch.randomizedtesting.rules.NoShadowingOrOverridesOnMethodsRule$1.evaluate(NoShadowingOrOverridesOnMethodsRule.java:40)
	at com.carrotsearch.randomizedtesting.rules.NoShadowingOrOverridesOnMethodsRule$1.evaluate(NoShadowingOrOverridesOnMethodsRule.java:40)
	at com.carrotsearch.randomizedtesting.rules.StatementAdapter.evaluate(StatementAdapter.java:36)
	at com.carrotsearch.randomizedtesting.rules.StatementAdapter.evaluate(StatementAdapter.java:36)
	at com.carrotsearch.randomizedtesting.rules.StatementAdapter.evaluate(StatementAdapter.java:36)
	at org.apache.lucene.util.TestRuleAssertionsRequired$1.evaluate(TestRuleAssertionsRequired.java:53)
	at org.apache.lucene.util.TestRuleMarkFailure$1.evaluate(TestRuleMarkFailure.java:47)
	at org.apache.lucene.util.TestRuleIgnoreAfterMaxFailures$1.evaluate(TestRuleIgnoreAfterMaxFailures.java:64)
	at org.apache.lucene.util.TestRuleIgnoreTestSuites$1.evaluate(TestRuleIgnoreTestSuites.java:54)
	at com.carrotsearch.randomizedtesting.rules.StatementAdapter.evaluate(StatementAdapter.java:36)
	at com.carrotsearch.randomizedtesting.ThreadLeakControl$StatementRunner.run(ThreadLeakControl.java:367)
	at java.lang.Thread.run(Thread.java:804)
Caused by: java.lang.IncompatibleClassChangeError: Found class jdk.internal.ref.Cleaner, but interface was expected
	at org.apache.lucene.store.MMapDirectory.lambda$initUnmapHack$0(MMapDirectory.java:377)
	at java.security.AccessController.doPrivileged(Native Method)
	at org.apache.lucene.store.MMapDirectory.lambda$initUnmapHack$1(MMapDirectory.java:375)
	... 46 more


FAILED:  org.apache.lucene.codecs.blocktreeords.TestOrdsBlockTree.testDocsAndFreqsAndPositionsAndOffsetsAndPayloads

Error Message:
Unable to unmap the mapped buffer: MMapIndexInput(path="/home/jenkins/workspace/Lucene-Solr-trunk-Linux/lucene/build/codecs/test/J1/temp/lucene.codecs.blocktreeords.TestOrdsBlockTree_4AD4CB7CC8B872A6-001/testPostingsFormat.testExact-002/_0_BlockTreeOrds_0.doc")

Stack Trace:
java.io.IOException: Unable to unmap the mapped buffer: MMapIndexInput(path="/home/jenkins/workspace/Lucene-Solr-trunk-Linux/lucene/build/codecs/test/J1/temp/lucene.codecs.blocktreeords.TestOrdsBlockTree_4AD4CB7CC8B872A6-001/testPostingsFormat.testExact-002/_0_BlockTreeOrds_0.doc")
	at __randomizedtesting.SeedInfo.seed([4AD4CB7CC8B872A6:A4F1D284704FEEA8]:0)
	at org.apache.lucene.store.MMapDirectory.lambda$initUnmapHack$1(MMapDirectory.java:384)
	at org.apache.lucene.store.ByteBufferIndexInput.freeBuffer(ByteBufferIndexInput.java:376)
	at org.apache.lucene.store.ByteBufferIndexInput.close(ByteBufferIndexInput.java:355)
	at org.apache.lucene.util.LuceneTestCase.slowFileExists(LuceneTestCase.java:2680)
	at org.apache.lucene.store.MockDirectoryWrapper.openInput(MockDirectoryWrapper.java:732)
	at org.apache.lucene.codecs.lucene50.Lucene50PostingsReader.<init>(Lucene50PostingsReader.java:81)
	at org.apache.lucene.codecs.blocktreeords.BlockTreeOrdsPostingsFormat.fieldsProducer(BlockTreeOrdsPostingsFormat.java:90)
	at org.apache.lucene.codecs.perfield.PerFieldPostingsFormat$FieldsReader.<init>(PerFieldPostingsFormat.java:261)
	at org.apache.lucene.codecs.perfield.PerFieldPostingsFormat.fieldsProducer(PerFieldPostingsFormat.java:341)
	at org.apache.lucene.index.RandomPostingsTester.buildIndex(RandomPostingsTester.java:680)
	at org.apache.lucene.index.RandomPostingsTester.testFull(RandomPostingsTester.java:1253)
	at org.apache.lucene.index.BasePostingsFormatTestCase.testDocsAndFreqsAndPositionsAndOffsetsAndPayloads(BasePostingsFormatTestCase.java:122)
	at sun.reflect.NativeMethodAccessorImpl.invoke0(Native Method)
	at sun.reflect.NativeMethodAccessorImpl.invoke(NativeMethodAccessorImpl.java:62)
	at sun.reflect.DelegatingMethodAccessorImpl.invoke(DelegatingMethodAccessorImpl.java:43)
	at java.lang.reflect.Method.invoke(Method.java:520)
	at com.carrotsearch.randomizedtesting.RandomizedRunner.invoke(RandomizedRunner.java:1764)
	at com.carrotsearch.randomizedtesting.RandomizedRunner$8.evaluate(RandomizedRunner.java:871)
	at com.carrotsearch.randomizedtesting.RandomizedRunner$9.evaluate(RandomizedRunner.java:907)
	at com.carrotsearch.randomizedtesting.RandomizedRunner$10.evaluate(RandomizedRunner.java:921)
	at org.apache.lucene.util.TestRuleSetupTeardownChained$1.evaluate(TestRuleSetupTeardownChained.java:49)
	at org.apache.lucene.util.AbstractBeforeAfterRule$1.evaluate(AbstractBeforeAfterRule.java:45)
	at org.apache.lucene.util.TestRuleThreadAndTestName$1.evaluate(TestRuleThreadAndTestName.java:48)
	at org.apache.lucene.util.TestRuleIgnoreAfterMaxFailures$1.evaluate(TestRuleIgnoreAfterMaxFailures.java:64)
	at org.apache.lucene.util.TestRuleMarkFailure$1.evaluate(TestRuleMarkFailure.java:47)
	at com.carrotsearch.randomizedtesting.rules.StatementAdapter.evaluate(StatementAdapter.java:36)
	at com.carrotsearch.randomizedtesting.ThreadLeakControl$StatementRunner.run(ThreadLeakControl.java:367)
	at com.carrotsearch.randomizedtesting.ThreadLeakControl.forkTimeoutingTask(ThreadLeakControl.java:809)
	at com.carrotsearch.randomizedtesting.ThreadLeakControl$3.evaluate(ThreadLeakControl.java:460)
	at com.carrotsearch.randomizedtesting.RandomizedRunner.runSingleTest(RandomizedRunner.java:880)
	at com.carrotsearch.randomizedtesting.RandomizedRunner$5.evaluate(RandomizedRunner.java:781)
	at com.carrotsearch.randomizedtesting.RandomizedRunner$6.evaluate(RandomizedRunner.java:816)
	at com.carrotsearch.randomizedtesting.RandomizedRunner$7.evaluate(RandomizedRunner.java:827)
	at org.apache.lucene.util.AbstractBeforeAfterRule$1.evaluate(AbstractBeforeAfterRule.java:45)
	at com.carrotsearch.randomizedtesting.rules.StatementAdapter.evaluate(StatementAdapter.java:36)
	at org.apache.lucene.util.TestRuleStoreClassName$1.evaluate(TestRuleStoreClassName.java:41)
	at com.carrotsearch.randomizedtesting.rules.NoShadowingOrOverridesOnMethodsRule$1.evaluate(NoShadowingOrOverridesOnMethodsRule.java:40)
	at com.carrotsearch.randomizedtesting.rules.NoShadowingOrOverridesOnMethodsRule$1.evaluate(NoShadowingOrOverridesOnMethodsRule.java:40)
	at com.carrotsearch.randomizedtesting.rules.StatementAdapter.evaluate(StatementAdapter.java:36)
	at com.carrotsearch.randomizedtesting.rules.StatementAdapter.evaluate(StatementAdapter.java:36)
	at com.carrotsearch.randomizedtesting.rules.StatementAdapter.evaluate(StatementAdapter.java:36)
	at org.apache.lucene.util.TestRuleAssertionsRequired$1.evaluate(TestRuleAssertionsRequired.java:53)
	at org.apache.lucene.util.TestRuleMarkFailure$1.evaluate(TestRuleMarkFailure.java:47)
	at org.apache.lucene.util.TestRuleIgnoreAfterMaxFailures$1.evaluate(TestRuleIgnoreAfterMaxFailures.java:64)
	at org.apache.lucene.util.TestRuleIgnoreTestSuites$1.evaluate(TestRuleIgnoreTestSuites.java:54)
	at com.carrotsearch.randomizedtesting.rules.StatementAdapter.evaluate(StatementAdapter.java:36)
	at com.carrotsearch.randomizedtesting.ThreadLeakControl$StatementRunner.run(ThreadLeakControl.java:367)
	at java.lang.Thread.run(Thread.java:804)
Caused by: java.lang.IncompatibleClassChangeError: Found class jdk.internal.ref.Cleaner, but interface was expected
	at org.apache.lucene.store.MMapDirectory.lambda$initUnmapHack$0(MMapDirectory.java:377)
	at java.security.AccessController.doPrivileged(Native Method)
	at org.apache.lucene.store.MMapDirectory.lambda$initUnmapHack$1(MMapDirectory.java:375)
	... 47 more


FAILED:  org.apache.lucene.codecs.blocktreeords.TestOrdsBlockTree.testDocsAndFreqsAndPositionsAndOffsets

Error Message:
Unable to unmap the mapped buffer: MMapIndexInput(path="/home/jenkins/workspace/Lucene-Solr-trunk-Linux/lucene/build/codecs/test/J1/temp/lucene.codecs.blocktreeords.TestOrdsBlockTree_4AD4CB7CC8B872A6-001/testPostingsFormat.testExact-003/_0_BlockTreeOrds_0.doc")

Stack Trace:
java.io.IOException: Unable to unmap the mapped buffer: MMapIndexInput(path="/home/jenkins/workspace/Lucene-Solr-trunk-Linux/lucene/build/codecs/test/J1/temp/lucene.codecs.blocktreeords.TestOrdsBlockTree_4AD4CB7CC8B872A6-001/testPostingsFormat.testExact-003/_0_BlockTreeOrds_0.doc")
	at __randomizedtesting.SeedInfo.seed([4AD4CB7CC8B872A6:73E7265422CB7F42]:0)
	at org.apache.lucene.store.MMapDirectory.lambda$initUnmapHack$1(MMapDirectory.java:384)
	at org.apache.lucene.store.ByteBufferIndexInput.freeBuffer(ByteBufferIndexInput.java:376)
	at org.apache.lucene.store.ByteBufferIndexInput.close(ByteBufferIndexInput.java:355)
	at org.apache.lucene.util.LuceneTestCase.slowFileExists(LuceneTestCase.java:2680)
	at org.apache.lucene.store.MockDirectoryWrapper.openInput(MockDirectoryWrapper.java:732)
	at org.apache.lucene.codecs.lucene50.Lucene50PostingsReader.<init>(Lucene50PostingsReader.java:81)
	at org.apache.lucene.codecs.blocktreeords.BlockTreeOrdsPostingsFormat.fieldsProducer(BlockTreeOrdsPostingsFormat.java:90)
	at org.apache.lucene.codecs.perfield.PerFieldPostingsFormat$FieldsReader.<init>(PerFieldPostingsFormat.java:261)
	at org.apache.lucene.codecs.perfield.PerFieldPostingsFormat.fieldsProducer(PerFieldPostingsFormat.java:341)
	at org.apache.lucene.index.RandomPostingsTester.buildIndex(RandomPostingsTester.java:680)
	at org.apache.lucene.index.RandomPostingsTester.testFull(RandomPostingsTester.java:1253)
	at org.apache.lucene.index.BasePostingsFormatTestCase.testDocsAndFreqsAndPositionsAndOffsets(BasePostingsFormatTestCase.java:118)
	at sun.reflect.NativeMethodAccessorImpl.invoke0(Native Method)
	at sun.reflect.NativeMethodAccessorImpl.invoke(NativeMethodAccessorImpl.java:62)
	at sun.reflect.DelegatingMethodAccessorImpl.invoke(DelegatingMethodAccessorImpl.java:43)
	at java.lang.reflect.Method.invoke(Method.java:520)
	at com.carrotsearch.randomizedtesting.RandomizedRunner.invoke(RandomizedRunner.java:1764)
	at com.carrotsearch.randomizedtesting.RandomizedRunner$8.evaluate(RandomizedRunner.java:871)
	at com.carrotsearch.randomizedtesting.RandomizedRunner$9.evaluate(RandomizedRunner.java:907)
	at com.carrotsearch.randomizedtesting.RandomizedRunner$10.evaluate(RandomizedRunner.java:921)
	at org.apache.lucene.util.TestRuleSetupTeardownChained$1.evaluate(TestRuleSetupTeardownChained.java:49)
	at org.apache.lucene.util.AbstractBeforeAfterRule$1.evaluate(AbstractBeforeAfterRule.java:45)
	at org.apache.lucene.util.TestRuleThreadAndTestName$1.evaluate(TestRuleThreadAndTestName.java:48)
	at org.apache.lucene.util.TestRuleIgnoreAfterMaxFailures$1.evaluate(TestRuleIgnoreAfterMaxFailures.java:64)
	at org.apache.lucene.util.TestRuleMarkFailure$1.evaluate(TestRuleMarkFailure.java:47)
	at com.carrotsearch.randomizedtesting.rules.StatementAdapter.evaluate(StatementAdapter.java:36)
	at com.carrotsearch.randomizedtesting.ThreadLeakControl$StatementRunner.run(ThreadLeakControl.java:367)
	at com.carrotsearch.randomizedtesting.ThreadLeakControl.forkTimeoutingTask(ThreadLeakControl.java:809)
	at com.carrotsearch.randomizedtesting.ThreadLeakControl$3.evaluate(ThreadLeakControl.java:460)
	at com.carrotsearch.randomizedtesting.RandomizedRunner.runSingleTest(RandomizedRunner.java:880)
	at com.carrotsearch.randomizedtesting.RandomizedRunner$5.evaluate(RandomizedRunner.java:781)
	at com.carrotsearch.randomizedtesting.RandomizedRunner$6.evaluate(RandomizedRunner.java:816)
	at com.carrotsearch.randomizedtesting.RandomizedRunner$7.evaluate(RandomizedRunner.java:827)
	at org.apache.lucene.util.AbstractBeforeAfterRule$1.evaluate(AbstractBeforeAfterRule.java:45)
	at com.carrotsearch.randomizedtesting.rules.StatementAdapter.evaluate(StatementAdapter.java:36)
	at org.apache.lucene.util.TestRuleStoreClassName$1.evaluate(TestRuleStoreClassName.java:41)
	at com.carrotsearch.randomizedtesting.rules.NoShadowingOrOverridesOnMethodsRule$1.evaluate(NoShadowingOrOverridesOnMethodsRule.java:40)
	at com.carrotsearch.randomizedtesting.rules.NoShadowingOrOverridesOnMethodsRule$1.evaluate(NoShadowingOrOverridesOnMethodsRule.java:40)
	at com.carrotsearch.randomizedtesting.rules.StatementAdapter.evaluate(StatementAdapter.java:36)
	at com.carrotsearch.randomizedtesting.rules.StatementAdapter.evaluate(StatementAdapter.java:36)
	at com.carrotsearch.randomizedtesting.rules.StatementAdapter.evaluate(StatementAdapter.java:36)
	at org.apache.lucene.util.TestRuleAssertionsRequired$1.evaluate(TestRuleAssertionsRequired.java:53)
	at org.apache.lucene.util.TestRuleMarkFailure$1.evaluate(TestRuleMarkFailure.java:47)
	at org.apache.lucene.util.TestRuleIgnoreAfterMaxFailures$1.evaluate(TestRuleIgnoreAfterMaxFailures.java:64)
	at org.apache.lucene.util.TestRuleIgnoreTestSuites$1.evaluate(TestRuleIgnoreTestSuites.java:54)
	at com.carrotsearch.randomizedtesting.rules.StatementAdapter.evaluate(StatementAdapter.java:36)
	at com.carrotsearch.randomizedtesting.ThreadLeakControl$StatementRunner.run(ThreadLeakControl.java:367)
	at java.lang.Thread.run(Thread.java:804)
Caused by: java.lang.IncompatibleClassChangeError: Found class jdk.internal.ref.Cleaner, but interface was expected
	at org.apache.lucene.store.MMapDirectory.lambda$initUnmapHack$0(MMapDirectory.java:377)
	at java.security.AccessController.doPrivileged(Native Method)
	at org.apache.lucene.store.MMapDirectory.lambda$initUnmapHack$1(MMapDirectory.java:375)
	... 47 more


FAILED:  org.apache.lucene.codecs.blocktreeords.TestOrdsBlockTree.testDocsAndFreqsAndPositionsAndPayloads

Error Message:
Unable to unmap the mapped buffer: MMapIndexInput(path="/home/jenkins/workspace/Lucene-Solr-trunk-Linux/lucene/build/codecs/test/J1/temp/lucene.codecs.blocktreeords.TestOrdsBlockTree_4AD4CB7CC8B872A6-001/testPostingsFormat.testExact-005/_0_BlockTreeOrds_0.doc")

Stack Trace:
java.io.IOException: Unable to unmap the mapped buffer: MMapIndexInput(path="/home/jenkins/workspace/Lucene-Solr-trunk-Linux/lucene/build/codecs/test/J1/temp/lucene.codecs.blocktreeords.TestOrdsBlockTree_4AD4CB7CC8B872A6-001/testPostingsFormat.testExact-005/_0_BlockTreeOrds_0.doc")
	at __randomizedtesting.SeedInfo.seed([4AD4CB7CC8B872A6:FC74CACAF05BB530]:0)
	at org.apache.lucene.store.MMapDirectory.lambda$initUnmapHack$1(MMapDirectory.java:384)
	at org.apache.lucene.store.ByteBufferIndexInput.freeBuffer(ByteBufferIndexInput.java:376)
	at org.apache.lucene.store.ByteBufferIndexInput.close(ByteBufferIndexInput.java:355)
	at org.apache.lucene.util.LuceneTestCase.slowFileExists(LuceneTestCase.java:2680)
	at org.apache.lucene.store.MockDirectoryWrapper.openInput(MockDirectoryWrapper.java:732)
	at org.apache.lucene.codecs.lucene50.Lucene50PostingsReader.<init>(Lucene50PostingsReader.java:81)
	at org.apache.lucene.codecs.blocktreeords.BlockTreeOrdsPostingsFormat.fieldsProducer(BlockTreeOrdsPostingsFormat.java:90)
	at org.apache.lucene.codecs.perfield.PerFieldPostingsFormat$FieldsReader.<init>(PerFieldPostingsFormat.java:261)
	at org.apache.lucene.codecs.perfield.PerFieldPostingsFormat.fieldsProducer(PerFieldPostingsFormat.java:341)
	at org.apache.lucene.index.RandomPostingsTester.buildIndex(RandomPostingsTester.java:680)
	at org.apache.lucene.index.RandomPostingsTester.testFull(RandomPostingsTester.java:1253)
	at org.apache.lucene.index.BasePostingsFormatTestCase.testDocsAndFreqsAndPositionsAndPayloads(BasePostingsFormatTestCase.java:114)
	at sun.reflect.NativeMethodAccessorImpl.invoke0(Native Method)
	at sun.reflect.NativeMethodAccessorImpl.invoke(NativeMethodAccessorImpl.java:62)
	at sun.reflect.DelegatingMethodAccessorImpl.invoke(DelegatingMethodAccessorImpl.java:43)
	at java.lang.reflect.Method.invoke(Method.java:520)
	at com.carrotsearch.randomizedtesting.RandomizedRunner.invoke(RandomizedRunner.java:1764)
	at com.carrotsearch.randomizedtesting.RandomizedRunner$8.evaluate(RandomizedRunner.java:871)
	at com.carrotsearch.randomizedtesting.RandomizedRunner$9.evaluate(RandomizedRunner.java:907)
	at com.carrotsearch.randomizedtesting.RandomizedRunner$10.evaluate(RandomizedRunner.java:921)
	at org.apache.lucene.util.TestRuleSetupTeardownChained$1.evaluate(TestRuleSetupTeardownChained.java:49)
	at org.apache.lucene.util.AbstractBeforeAfterRule$1.evaluate(AbstractBeforeAfterRule.java:45)
	at org.apache.lucene.util.TestRuleThreadAndTestName$1.evaluate(TestRuleThreadAndTestName.java:48)
	at org.apache.lucene.util.TestRuleIgnoreAfterMaxFailures$1.evaluate(TestRuleIgnoreAfterMaxFailures.java:64)
	at org.apache.lucene.util.TestRuleMarkFailure$1.evaluate(TestRuleMarkFailure.java:47)
	at com.carrotsearch.randomizedtesting.rules.StatementAdapter.evaluate(StatementAdapter.java:36)
	at com.carrotsearch.randomizedtesting.ThreadLeakControl$StatementRunner.run(ThreadLeakControl.java:367)
	at com.carrotsearch.randomizedtesting.ThreadLeakControl.forkTimeoutingTask(ThreadLeakControl.java:809)
	at com.carrotsearch.randomizedtesting.ThreadLeakControl$3.evaluate(ThreadLeakControl.java:460)
	at com.carrotsearch.randomizedtesting.RandomizedRunner.runSingleTest(RandomizedRunner.java:880)
	at com.carrotsearch.randomizedtesting.RandomizedRunner$5.evaluate(RandomizedRunner.java:781)
	at com.carrotsearch.randomizedtesting.RandomizedRunner$6.evaluate(RandomizedRunner.java:816)
	at com.carrotsearch.randomizedtesting.RandomizedRunner$7.evaluate(RandomizedRunner.java:827)
	at org.apache.lucene.util.AbstractBeforeAfterRule$1.evaluate(AbstractBeforeAfterRule.java:45)
	at com.carrotsearch.randomizedtesting.rules.StatementAdapter.evaluate(StatementAdapter.java:36)
	at org.apache.lucene.util.TestRuleStoreClassName$1.evaluate(TestRuleStoreClassName.java:41)
	at com.carrotsearch.randomizedtesting.rules.NoShadowingOrOverridesOnMethodsRule$1.evaluate(NoShadowingOrOverridesOnMethodsRule.java:40)
	at com.carrotsearch.randomizedtesting.rules.NoShadowingOrOverridesOnMethodsRule$1.evaluate(NoShadowingOrOverridesOnMethodsRule.java:40)
	at com.carrotsearch.randomizedtesting.rules.StatementAdapter.evaluate(StatementAdapter.java:36)
	at com.carrotsearch.randomizedtesting.rules.StatementAdapter.evaluate(StatementAdapter.java:36)
	at com.carrotsearch.randomizedtesting.rules.StatementAdapter.evaluate(StatementAdapter.java:36)
	at org.apache.lucene.util.TestRuleAssertionsRequired$1.evaluate(TestRuleAssertionsRequired.java:53)
	at org.apache.lucene.util.TestRuleMarkFailure$1.evaluate(TestRuleMarkFailure.java:47)
	at org.apache.lucene.util.TestRuleIgnoreAfterMaxFailures$1.evaluate(TestRuleIgnoreAfterMaxFailures.java:64)
	at org.apache.lucene.util.TestRuleIgnoreTestSuites$1.evaluate(TestRuleIgnoreTestSuites.java:54)
	at com.carrotsearch.randomizedtesting.rules.StatementAdapter.evaluate(StatementAdapter.java:36)
	at com.carrotsearch.randomizedtesting.ThreadLeakControl$StatementRunner.run(ThreadLeakControl.java:367)
	at java.lang.Thread.run(Thread.java:804)
Caused by: java.lang.IncompatibleClassChangeError: Found class jdk.internal.ref.Cleaner, but interface was expected
	at org.apache.lucene.store.MMapDirectory.lambda$initUnmapHack$0(MMapDirectory.java:377)
	at java.security.AccessController.doPrivileged(Native Method)
	at org.apache.lucene.store.MMapDirectory.lambda$initUnmapHack$1(MMapDirectory.java:375)
	... 47 more


FAILED:  org.apache.lucene.codecs.blocktreeords.TestOrdsBlockTree.testMultiClose

Error Message:
Unable to unmap the mapped buffer: MMapIndexInput(path="/home/jenkins/workspace/Lucene-Solr-trunk-Linux/lucene/build/codecs/test/J1/temp/lucene.codecs.blocktreeords.TestOrdsBlockTree_4AD4CB7CC8B872A6-001/justSoYouGetSomeChannelErrors-001/_0_BlockTreeOrds_0.tipo")

Stack Trace:
java.io.IOException: Unable to unmap the mapped buffer: MMapIndexInput(path="/home/jenkins/workspace/Lucene-Solr-trunk-Linux/lucene/build/codecs/test/J1/temp/lucene.codecs.blocktreeords.TestOrdsBlockTree_4AD4CB7CC8B872A6-001/justSoYouGetSomeChannelErrors-001/_0_BlockTreeOrds_0.tipo")
	at __randomizedtesting.SeedInfo.seed([4AD4CB7CC8B872A6:CEE92747D7DA1BBE]:0)
	at org.apache.lucene.store.MMapDirectory.lambda$initUnmapHack$1(MMapDirectory.java:384)
	at org.apache.lucene.store.ByteBufferIndexInput.freeBuffer(ByteBufferIndexInput.java:376)
	at org.apache.lucene.store.ByteBufferIndexInput.close(ByteBufferIndexInput.java:355)
	at org.apache.lucene.codecs.blocktreeords.OrdsBlockTreeTermsReader.<init>(OrdsBlockTreeTermsReader.java:154)
	at org.apache.lucene.codecs.blocktreeords.BlockTreeOrdsPostingsFormat.fieldsProducer(BlockTreeOrdsPostingsFormat.java:93)
	at org.apache.lucene.codecs.perfield.PerFieldPostingsFormat$FieldsReader.<init>(PerFieldPostingsFormat.java:261)
	at org.apache.lucene.codecs.perfield.PerFieldPostingsFormat.fieldsProducer(PerFieldPostingsFormat.java:341)
	at org.apache.lucene.index.BaseIndexFileFormatTestCase.testMultiClose(BaseIndexFileFormatTestCase.java:326)
	at org.apache.lucene.index.BasePostingsFormatTestCase.testMultiClose(BasePostingsFormatTestCase.java:85)
	at sun.reflect.NativeMethodAccessorImpl.invoke0(Native Method)
	at sun.reflect.NativeMethodAccessorImpl.invoke(NativeMethodAccessorImpl.java:62)
	at sun.reflect.DelegatingMethodAccessorImpl.invoke(DelegatingMethodAccessorImpl.java:43)
	at java.lang.reflect.Method.invoke(Method.java:520)
	at com.carrotsearch.randomizedtesting.RandomizedRunner.invoke(RandomizedRunner.java:1764)
	at com.carrotsearch.randomizedtesting.RandomizedRunner$8.evaluate(RandomizedRunner.java:871)
	at com.carrotsearch.randomizedtesting.RandomizedRunner$9.evaluate(RandomizedRunner.java:907)
	at com.carrotsearch.randomizedtesting.RandomizedRunner$10.evaluate(RandomizedRunner.java:921)
	at org.apache.lucene.util.TestRuleSetupTeardownChained$1.evaluate(TestRuleSetupTeardownChained.java:49)
	at org.apache.lucene.util.AbstractBeforeAfterRule$1.evaluate(AbstractBeforeAfterRule.java:45)
	at org.apache.lucene.util.TestRuleThreadAndTestName$1.evaluate(TestRuleThreadAndTestName.java:48)
	at org.apache.lucene.util.TestRuleIgnoreAfterMaxFailures$1.evaluate(TestRuleIgnoreAfterMaxFailures.java:64)
	at org.apache.lucene.util.TestRuleMarkFailure$1.evaluate(TestRuleMarkFailure.java:47)
	at com.carrotsearch.randomizedtesting.rules.StatementAdapter.evaluate(StatementAdapter.java:36)
	at com.carrotsearch.randomizedtesting.ThreadLeakControl$StatementRunner.run(ThreadLeakControl.java:367)
	at com.carrotsearch.randomizedtesting.ThreadLeakControl.forkTimeoutingTask(ThreadLeakControl.java:809)
	at com.carrotsearch.randomizedtesting.ThreadLeakControl$3.evaluate(ThreadLeakControl.java:460)
	at com.carrotsearch.randomizedtesting.RandomizedRunner.runSingleTest(RandomizedRunner.java:880)
	at com.carrotsearch.randomizedtesting.RandomizedRunner$5.evaluate(RandomizedRunner.java:781)
	at com.carrotsearch.randomizedtesting.RandomizedRunner$6.evaluate(RandomizedRunner.java:816)
	at com.carrotsearch.randomizedtesting.RandomizedRunner$7.evaluate(RandomizedRunner.java:827)
	at org.apache.lucene.util.AbstractBeforeAfterRule$1.evaluate(AbstractBeforeAfterRule.java:45)
	at com.carrotsearch.randomizedtesting.rules.StatementAdapter.evaluate(StatementAdapter.java:36)
	at org.apache.lucene.util.TestRuleStoreClassName$1.evaluate(TestRuleStoreClassName.java:41)
	at com.carrotsearch.randomizedtesting.rules.NoShadowingOrOverridesOnMethodsRule$1.evaluate(NoShadowingOrOverridesOnMethodsRule.java:40)
	at com.carrotsearch.randomizedtesting.rules.NoShadowingOrOverridesOnMethodsRule$1.evaluate(NoShadowingOrOverridesOnMethodsRule.java:40)
	at com.carrotsearch.randomizedtesting.rules.StatementAdapter.evaluate(StatementAdapter.java:36)
	at com.carrotsearch.randomizedtesting.rules.StatementAdapter.evaluate(StatementAdapter.java:36)
	at com.carrotsearch.randomizedtesting.rules.StatementAdapter.evaluate(StatementAdapter.java:36)
	at org.apache.lucene.util.TestRuleAssertionsRequired$1.evaluate(TestRuleAssertionsRequired.java:53)
	at org.apache.lucene.util.TestRuleMarkFailure$1.evaluate(TestRuleMarkFailure.java:47)
	at org.apache.lucene.util.TestRuleIgnoreAfterMaxFailures$1.evaluate(TestRuleIgnoreAfterMaxFailures.java:64)
	at org.apache.lucene.util.TestRuleIgnoreTestSuites$1.evaluate(TestRuleIgnoreTestSuites.java:54)
	at com.carrotsearch.randomizedtesting.rules.StatementAdapter.evaluate(StatementAdapter.java:36)
	at com.carrotsearch.randomizedtesting.ThreadLeakControl$StatementRunner.run(ThreadLeakControl.java:367)
	at java.lang.Thread.run(Thread.java:804)
Caused by: java.lang.IncompatibleClassChangeError: Found class jdk.internal.ref.Cleaner, but interface was expected
	at org.apache.lucene.store.MMapDirectory.lambda$initUnmapHack$0(MMapDirectory.java:377)
	at java.security.AccessController.doPrivileged(Native Method)
	at org.apache.lucene.store.MMapDirectory.lambda$initUnmapHack$1(MMapDirectory.java:375)
	... 44 more


FAILED:  org.apache.lucene.codecs.memory.TestFSTOrdPostingsFormat.testRandom

Error Message:
Unable to unmap the mapped buffer: MMapIndexInput(path="/home/jenkins/workspace/Lucene-Solr-trunk-Linux/lucene/build/codecs/test/J1/temp/lucene.codecs.memory.TestFSTOrdPostingsFormat_4AD4CB7CC8B872A6-001/testPostingsFormat-002/_0_FSTOrd50_0.doc")

Stack Trace:
java.io.IOException: Unable to unmap the mapped buffer: MMapIndexInput(path="/home/jenkins/workspace/Lucene-Solr-trunk-Linux/lucene/build/codecs/test/J1/temp/lucene.codecs.memory.TestFSTOrdPostingsFormat_4AD4CB7CC8B872A6-001/testPostingsFormat-002/_0_FSTOrd50_0.doc")
	at __randomizedtesting.SeedInfo.seed([4AD4CB7CC8B872A6:3898EE7379D8C4D5]:0)
	at org.apache.lucene.store.MMapDirectory.lambda$initUnmapHack$1(MMapDirectory.java:384)
	at org.apache.lucene.store.ByteBufferIndexInput.freeBuffer(ByteBufferIndexInput.java:376)
	at org.apache.lucene.store.ByteBufferIndexInput.close(ByteBufferIndexInput.java:355)
	at org.apache.lucene.util.LuceneTestCase.slowFileExists(LuceneTestCase.java:2680)
	at org.apache.lucene.store.MockDirectoryWrapper.openInput(MockDirectoryWrapper.java:732)
	at org.apache.lucene.codecs.lucene50.Lucene50PostingsReader.<init>(Lucene50PostingsReader.java:81)
	at org.apache.lucene.codecs.memory.FSTOrdPostingsFormat.fieldsProducer(FSTOrdPostingsFormat.java:66)
	at org.apache.lucene.codecs.perfield.PerFieldPostingsFormat$FieldsReader.<init>(PerFieldPostingsFormat.java:261)
	at org.apache.lucene.codecs.perfield.PerFieldPostingsFormat.fieldsProducer(PerFieldPostingsFormat.java:341)
	at org.apache.lucene.index.RandomPostingsTester.buildIndex(RandomPostingsTester.java:680)
	at org.apache.lucene.index.BasePostingsFormatTestCase.testRandom(BasePostingsFormatTestCase.java:135)
	at sun.reflect.NativeMethodAccessorImpl.invoke0(Native Method)
	at sun.reflect.NativeMethodAccessorImpl.invoke(NativeMethodAccessorImpl.java:62)
	at sun.reflect.DelegatingMethodAccessorImpl.invoke(DelegatingMethodAccessorImpl.java:43)
	at java.lang.reflect.Method.invoke(Method.java:520)
	at com.carrotsearch.randomizedtesting.RandomizedRunner.invoke(RandomizedRunner.java:1764)
	at com.carrotsearch.randomizedtesting.RandomizedRunner$8.evaluate(RandomizedRunner.java:871)
	at com.carrotsearch.randomizedtesting.RandomizedRunner$9.evaluate(RandomizedRunner.java:907)
	at com.carrotsearch.randomizedtesting.RandomizedRunner$10.evaluate(RandomizedRunner.java:921)
	at org.apache.lucene.util.TestRuleSetupTeardownChained$1.evaluate(TestRuleSetupTeardownChained.java:49)
	at org.apache.lucene.util.AbstractBeforeAfterRule$1.evaluate(AbstractBeforeAfterRule.java:45)
	at org.apache.lucene.util.TestRuleThreadAndTestName$1.evaluate(TestRuleThreadAndTestName.java:48)
	at org.apache.lucene.util.TestRuleIgnoreAfterMaxFailures$1.evaluate(TestRuleIgnoreAfterMaxFailures.java:64)
	at org.apache.lucene.util.TestRuleMarkFailure$1.evaluate(TestRuleMarkFailure.java:47)
	at com.carrotsearch.randomizedtesting.rules.StatementAdapter.evaluate(StatementAdapter.java:36)
	at com.carrotsearch.randomizedtesting.ThreadLeakControl$StatementRunner.run(ThreadLeakControl.java:367)
	at com.carrotsearch.randomizedtesting.ThreadLeakControl.forkTimeoutingTask(ThreadLeakControl.java:809)
	at com.carrotsearch.randomizedtesting.ThreadLeakControl$3.evaluate(ThreadLeakControl.java:460)
	at com.carrotsearch.randomizedtesting.RandomizedRunner.runSingleTest(RandomizedRunner.java:880)
	at com.carrotsearch.randomizedtesting.RandomizedRunner$5.evaluate(RandomizedRunner.java:781)
	at com.carrotsearch.randomizedtesting.RandomizedRunner$6.evaluate(RandomizedRunner.java:816)
	at com.carrotsearch.randomizedtesting.RandomizedRunner$7.evaluate(RandomizedRunner.java:827)
	at org.apache.lucene.util.AbstractBeforeAfterRule$1.evaluate(AbstractBeforeAfterRule.java:45)
	at com.carrotsearch.randomizedtesting.rules.StatementAdapter.evaluate(StatementAdapter.java:36)
	at org.apache.lucene.util.TestRuleStoreClassName$1.evaluate(TestRuleStoreClassName.java:41)
	at com.carrotsearch.randomizedtesting.rules.NoShadowingOrOverridesOnMethodsRule$1.evaluate(NoShadowingOrOverridesOnMethodsRule.java:40)
	at com.carrotsearch.randomizedtesting.rules.NoShadowingOrOverridesOnMethodsRule$1.evaluate(NoShadowingOrOverridesOnMethodsRule.java:40)
	at com.carrotsearch.randomizedtesting.rules.StatementAdapter.evaluate(StatementAdapter.java:36)
	at com.carrotsearch.randomizedtesting.rules.StatementAdapter.evaluate(StatementAdapter.java:36)
	at com.carrotsearch.randomizedtesting.rules.StatementAdapter.evaluate(StatementAdapter.java:36)
	at org.apache.lucene.util.TestRuleAssertionsRequired$1.evaluate(TestRuleAssertionsRequired.java:53)
	at org.apache.lucene.util.TestRuleMarkFailure$1.evaluate(TestRuleMarkFailure.java:47)
	at org.apache.lucene.util.TestRuleIgnoreAfterMaxFailures$1.evaluate(TestRuleIgnoreAfterMaxFailures.java:64)
	at org.apache.lucene.util.TestRuleIgnoreTestSuites$1.evaluate(TestRuleIgnoreTestSuites.java:54)
	at com.carrotsearch.randomizedtesting.rules.StatementAdapter.evaluate(StatementAdapter.java:36)
	at com.carrotsearch.randomizedtesting.ThreadLeakControl$StatementRunner.run(ThreadLeakControl.java:367)
	at java.lang.Thread.run(Thread.java:804)
Caused by: java.lang.IncompatibleClassChangeError: Found class jdk.internal.ref.Cleaner, but interface was expected
	at org.apache.lucene.store.MMapDirectory.lambda$initUnmapHack$0(MMapDirectory.java:377)
	at java.security.AccessController.doPrivileged(Native Method)
	at org.apache.lucene.store.MMapDirectory.lambda$initUnmapHack$1(MMapDirectory.java:375)
	... 46 more


FAILED:  org.apache.lucene.codecs.memory.TestFSTOrdPostingsFormat.testDocsAndFreqsAndPositionsAndOffsets

Error Message:
Unable to unmap the mapped buffer: MMapIndexInput(path="/home/jenkins/workspace/Lucene-Solr-trunk-Linux/lucene/build/codecs/test/J1/temp/lucene.codecs.memory.TestFSTOrdPostingsFormat_4AD4CB7CC8B872A6-001/testPostingsFormat.testExact-001/_0_FSTOrd50_0.doc")

Stack Trace:
java.io.IOException: Unable to unmap the mapped buffer: MMapIndexInput(path="/home/jenkins/workspace/Lucene-Solr-trunk-Linux/lucene/build/codecs/test/J1/temp/lucene.codecs.memory.TestFSTOrdPostingsFormat_4AD4CB7CC8B872A6-001/testPostingsFormat.testExact-001/_0_FSTOrd50_0.doc")
	at __randomizedtesting.SeedInfo.seed([4AD4CB7CC8B872A6:73E7265422CB7F42]:0)
	at org.apache.lucene.store.MMapDirectory.lambda$initUnmapHack$1(MMapDirectory.java:384)
	at org.apache.lucene.store.ByteBufferIndexInput.freeBuffer(ByteBufferIndexInput.java:376)
	at org.apache.lucene.store.ByteBufferIndexInput.close(ByteBufferIndexInput.java:355)
	at org.apache.lucene.util.LuceneTestCase.slowFileExists(LuceneTestCase.java:2680)
	at org.apache.lucene.store.MockDirectoryWrapper.openInput(MockDirectoryWrapper.java:732)
	at org.apache.lucene.codecs.lucene50.Lucene50PostingsReader.<init>(Lucene50PostingsReader.java:81)
	at org.apache.lucene.codecs.memory.FSTOrdPostingsFormat.fieldsProducer(FSTOrdPostingsFormat.java:66)
	at org.apache.lucene.codecs.perfield.PerFieldPostingsFormat$FieldsReader.<init>(PerFieldPostingsFormat.java:261)
	at org.apache.lucene.codecs.perfield.PerFieldPostingsFormat.fieldsProducer(PerFieldPostingsFormat.java:341)
	at org.apache.lucene.index.RandomPostingsTester.buildIndex(RandomPostingsTester.java:680)
	at org.apache.lucene.index.RandomPostingsTester.testFull(RandomPostingsTester.java:1253)
	at org.apache.lucene.index.BasePostingsFormatTestCase.testDocsAndFreqsAndPositionsAndOffsets(BasePostingsFormatTestCase.java:118)
	at sun.reflect.NativeMethodAccessorImpl.invoke0(Native Method)
	at sun.reflect.NativeMethodAccessorImpl.invoke(NativeMethodAccessorImpl.java:62)
	at sun.reflect.DelegatingMethodAccessorImpl.invoke(DelegatingMethodAccessorImpl.java:43)
	at java.lang.reflect.Method.invoke(Method.java:520)
	at com.carrotsearch.randomizedtesting.RandomizedRunner.invoke(RandomizedRunner.java:1764)
	at com.carrotsearch.randomizedtesting.RandomizedRunner$8.evaluate(RandomizedRunner.java:871)
	at com.carrotsearch.randomizedtesting.RandomizedRunner$9.evaluate(RandomizedRunner.java:907)
	at com.carrotsearch.randomizedtesting.RandomizedRunner$10.evaluate(RandomizedRunner.java:921)
	at org.apache.lucene.util.TestRuleSetupTeardownChained$1.evaluate(TestRuleSetupTeardownChained.java:49)
	at org.apache.lucene.util.AbstractBeforeAfterRule$1.evaluate(AbstractBeforeAfterRule.java:45)
	at org.apache.lucene.util.TestRuleThreadAndTestName$1.evaluate(TestRuleThreadAndTestName.java:48)
	at org.apache.lucene.util.TestRuleIgnoreAfterMaxFailures$1.evaluate(TestRuleIgnoreAfterMaxFailures.java:64)
	at org.apache.lucene.util.TestRuleMarkFailure$1.evaluate(TestRuleMarkFailure.java:47)
	at com.carrotsearch.randomizedtesting.rules.StatementAdapter.evaluate(StatementAdapter.java:36)
	at com.carrotsearch.randomizedtesting.ThreadLeakControl$StatementRunner.run(ThreadLeakControl.java:367)
	at com.carrotsearch.randomizedtesting.ThreadLeakControl.forkTimeoutingTask(ThreadLeakControl.java:809)
	at com.carrotsearch.randomizedtesting.ThreadLeakControl$3.evaluate(ThreadLeakControl.java:460)
	at com.carrotsearch.randomizedtesting.RandomizedRunner.runSingleTest(RandomizedRunner.java:880)
	at com.carrotsearch.randomizedtesting.RandomizedRunner$5.evaluate(RandomizedRunner.java:781)
	at com.carrotsearch.randomizedtesting.RandomizedRunner$6.evaluate(RandomizedRunner.java:816)
	at com.carrotsearch.randomizedtesting.RandomizedRunner$7.evaluate(RandomizedRunner.java:827)
	at org.apache.lucene.util.AbstractBeforeAfterRule$1.evaluate(AbstractBeforeAfterRule.java:45)
	at com.carrotsearch.randomizedtesting.rules.StatementAdapter.evaluate(StatementAdapter.java:36)
	at org.apache.lucene.util.TestRuleStoreClassName$1.evaluate(TestRuleStoreClassName.java:41)
	at com.carrotsearch.randomizedtesting.rules.NoShadowingOrOverridesOnMethodsRule$1.evaluate(NoShadowingOrOverridesOnMethodsRule.java:40)
	at com.carrotsearch.randomizedtesting.rules.NoShadowingOrOverridesOnMethodsRule$1.evaluate(NoShadowingOrOverridesOnMethodsRule.java:40)
	at com.carrotsearch.randomizedtesting.rules.StatementAdapter.evaluate(StatementAdapter.java:36)
	at com.carrotsearch.randomizedtesting.rules.StatementAdapter.evaluate(StatementAdapter.java:36)
	at com.carrotsearch.randomizedtesting.rules.StatementAdapter.evaluate(StatementAdapter.java:36)
	at org.apache.lucene.util.TestRuleAssertionsRequired$1.evaluate(TestRuleAssertionsRequired.java:53)
	at org.apache.lucene.util.TestRuleMarkFailure$1.evaluate(TestRuleMarkFailure.java:47)
	at org.apache.lucene.util.TestRuleIgnoreAfterMaxFailures$1.evaluate(TestRuleIgnoreAfterMaxFailures.java:64)
	at org.apache.lucene.util.TestRuleIgnoreTestSuites$1.evaluate(TestRuleIgnoreTestSuites.java:54)
	at com.carrotsearch.randomizedtesting.rules.StatementAdapter.evaluate(StatementAdapter.java:36)
	at com.carrotsearch.randomizedtesting.ThreadLeakControl$StatementRunner.run(ThreadLeakControl.java:367)
	at java.lang.Thread.run(Thread.java:804)
Caused by: java.lang.IncompatibleClassChangeError: Found class jdk.internal.ref.Cleaner, but interface was expected
	at org.apache.lucene.store.MMapDirectory.lambda$initUnmapHack$0(MMapDirectory.java:377)
	at java.security.AccessController.doPrivileged(Native Method)
	at org.apache.lucene.store.MMapDirectory.lambda$initUnmapHack$1(MMapDirectory.java:375)
	... 47 more


FAILED:  org.apache.lucene.codecs.memory.TestFSTOrdPostingsFormat.testMultiClose

Error Message:
Unable to unmap the mapped buffer: MMapIndexInput(path="/home/jenkins/workspace/Lucene-Solr-trunk-Linux/lucene/build/codecs/test/J1/temp/lucene.codecs.memory.TestFSTOrdPostingsFormat_4AD4CB7CC8B872A6-001/justSoYouGetSomeChannelErrors-001/_0_FSTOrd50_0.tix")

Stack Trace:
java.io.IOException: Unable to unmap the mapped buffer: MMapIndexInput(path="/home/jenkins/workspace/Lucene-Solr-trunk-Linux/lucene/build/codecs/test/J1/temp/lucene.codecs.memory.TestFSTOrdPostingsFormat_4AD4CB7CC8B872A6-001/justSoYouGetSomeChannelErrors-001/_0_FSTOrd50_0.tix")
	at __randomizedtesting.SeedInfo.seed([4AD4CB7CC8B872A6:CEE92747D7DA1BBE]:0)
	at org.apache.lucene.store.MMapDirectory.lambda$initUnmapHack$1(MMapDirectory.java:384)
	at org.apache.lucene.store.ByteBufferIndexInput.freeBuffer(ByteBufferIndexInput.java:376)
	at org.apache.lucene.store.ByteBufferIndexInput.close(ByteBufferIndexInput.java:355)
	at org.apache.lucene.store.BufferedChecksumIndexInput.close(BufferedChecksumIndexInput.java:60)
	at org.apache.lucene.util.IOUtils.close(IOUtils.java:89)
	at org.apache.lucene.util.IOUtils.close(IOUtils.java:76)
	at org.apache.lucene.codecs.memory.FSTOrdTermsReader.<init>(FSTOrdTermsReader.java:129)
	at org.apache.lucene.codecs.memory.FSTOrdPostingsFormat.fieldsProducer(FSTOrdPostingsFormat.java:69)
	at org.apache.lucene.codecs.perfield.PerFieldPostingsFormat$FieldsReader.<init>(PerFieldPostingsFormat.java:261)
	at org.apache.lucene.codecs.perfield.PerFieldPostingsFormat.fieldsProducer(PerFieldPostingsFormat.java:341)
	at org.apache.lucene.index.BaseIndexFileFormatTestCase.testMultiClose(BaseIndexFileFormatTestCase.java:326)
	at org.apache.lucene.index.BasePostingsFormatTestCase.testMultiClose(BasePostingsFormatTestCase.java:85)
	at sun.reflect.NativeMethodAccessorImpl.invoke0(Native Method)
	at sun.reflect.NativeMethodAccessorImpl.invoke(NativeMethodAccessorImpl.java:62)
	at sun.reflect.DelegatingMethodAccessorImpl.invoke(DelegatingMethodAccessorImpl.java:43)
	at java.lang.reflect.Method.invoke(Method.java:520)
	at com.carrotsearch.randomizedtesting.RandomizedRunner.invoke(RandomizedRunner.java:1764)
	at com.carrotsearch.randomizedtesting.RandomizedRunner$8.evaluate(RandomizedRunner.java:871)
	at com.carrotsearch.randomizedtesting.RandomizedRunner$9.evaluate(RandomizedRunner.java:907)
	at com.carrotsearch.randomizedtesting.RandomizedRunner$10.evaluate(RandomizedRunner.java:921)
	at org.apache.lucene.util.TestRuleSetupTeardownChained$1.evaluate(TestRuleSetupTeardownChained.java:49)
	at org.apache.lucene.util.AbstractBeforeAfterRule$1.evaluate(AbstractBeforeAfterRule.java:45)
	at org.apache.lucene.util.TestRuleThreadAndTestName$1.evaluate(TestRuleThreadAndTestName.java:48)
	at org.apache.lucene.util.TestRuleIgnoreAfterMaxFailures$1.evaluate(TestRuleIgnoreAfterMaxFailures.java:64)
	at org.apache.lucene.util.TestRuleMarkFailure$1.evaluate(TestRuleMarkFailure.java:47)
	at com.carrotsearch.randomizedtesting.rules.StatementAdapter.evaluate(StatementAdapter.java:36)
	at com.carrotsearch.randomizedtesting.ThreadLeakControl$StatementRunner.run(ThreadLeakControl.java:367)
	at com.carrotsearch.randomizedtesting.ThreadLeakControl.forkTimeoutingTask(ThreadLeakControl.java:809)
	at com.carrotsearch.randomizedtesting.ThreadLeakControl$3.evaluate(ThreadLeakControl.java:460)
	at com.carrotsearch.randomizedtesting.RandomizedRunner.runSingleTest(RandomizedRunner.java:880)
	at com.carrotsearch.randomizedtesting.RandomizedRunner$5.evaluate(RandomizedRunner.java:781)
	at com.carrotsearch.randomizedtesting.RandomizedRunner$6.evaluate(RandomizedRunner.java:816)
	at com.carrotsearch.randomizedtesting.RandomizedRunner$7.evaluate(RandomizedRunner.java:827)
	at org.apache.lucene.util.AbstractBeforeAfterRule$1.evaluate(AbstractBeforeAfterRule.java:45)
	at com.carrotsearch.randomizedtesting.rules.StatementAdapter.evaluate(StatementAdapter.java:36)
	at org.apache.lucene.util.TestRuleStoreClassName$1.evaluate(TestRuleStoreClassName.java:41)
	at com.carrotsearch.randomizedtesting.rules.NoShadowingOrO

[...truncated too long message...]

domIndexWriter.commit(RandomIndexWriter.java:288)
   [junit4]    > 	at org.apache.lucene.index.BaseDocValuesFormatTestCase.doTestSortedSetVsStoredFields(BaseDocValuesFormatTestCase.java:1983)
   [junit4]    > 	at org.apache.lucene.index.BaseDocValuesFormatTestCase.testSortedSetFixedLengthFewUniqueSetsVsStoredFields(BaseDocValuesFormatTestCase.java:2168)
   [junit4]    > 	at java.lang.Thread.run(Thread.java:804)
   [junit4]    > Caused by: java.lang.IncompatibleClassChangeError: Found class jdk.internal.ref.Cleaner, but interface was expected
   [junit4]    > 	at org.apache.lucene.store.MMapDirectory.lambda$initUnmapHack$0(MMapDirectory.java:377)
   [junit4]    > 	at java.security.AccessController.doPrivileged(Native Method)
   [junit4]    > 	at org.apache.lucene.store.MMapDirectory.lambda$initUnmapHack$1(MMapDirectory.java:375)
   [junit4]    > 	... 55 more
   [junit4]   2> NOTE: reproduce with: ant test  -Dtestcase=TestMemoryDocValuesFormat -Dtests.method=testSortedSetFixedLengthVsStoredFields -Dtests.seed=4AD4CB7CC8B872A6 -Dtests.multiplier=3 -Dtests.slow=true -Dtests.locale=sbp -Dtests.timezone=Etc/GMT+6 -Dtests.asserts=true -Dtests.file.encoding=ISO-8859-1
   [junit4] ERROR   0.67s J1 | TestMemoryDocValuesFormat.testSortedSetFixedLengthVsStoredFields <<<
   [junit4]    > Throwable #1: java.io.IOException: Unable to unmap the mapped buffer: MMapIndexInput(path="/home/jenkins/workspace/Lucene-Solr-trunk-Linux/lucene/build/codecs/test/J1/temp/lucene.codecs.memory.TestMemoryDocValuesFormat_4AD4CB7CC8B872A6-001/dvduel-021/_0_Memory_0.mdvd")
   [junit4]    > 	at __randomizedtesting.SeedInfo.seed([4AD4CB7CC8B872A6:3FA77AB0DF452AF0]:0)
   [junit4]    > 	at org.apache.lucene.store.MMapDirectory.lambda$initUnmapHack$1(MMapDirectory.java:384)
   [junit4]    > 	at org.apache.lucene.store.ByteBufferIndexInput.freeBuffer(ByteBufferIndexInput.java:376)
   [junit4]    > 	at org.apache.lucene.store.ByteBufferIndexInput.close(ByteBufferIndexInput.java:355)
   [junit4]    > 	at org.apache.lucene.util.LuceneTestCase.slowFileExists(LuceneTestCase.java:2680)
   [junit4]    > 	at org.apache.lucene.store.MockDirectoryWrapper.openInput(MockDirectoryWrapper.java:732)
   [junit4]    > 	at org.apache.lucene.store.FilterDirectory.openInput(FilterDirectory.java:94)
   [junit4]    > 	at org.apache.lucene.store.FilterDirectory.openInput(FilterDirectory.java:94)
   [junit4]    > 	at org.apache.lucene.store.FilterDirectory.openInput(FilterDirectory.java:94)
   [junit4]    > 	at org.apache.lucene.codecs.lucene50.Lucene50CompoundFormat.write(Lucene50CompoundFormat.java:90)
   [junit4]    > 	at org.apache.lucene.index.IndexWriter.createCompoundFile(IndexWriter.java:4680)
   [junit4]    > 	at org.apache.lucene.index.DocumentsWriterPerThread.sealFlushedSegment(DocumentsWriterPerThread.java:496)
   [junit4]    > 	at org.apache.lucene.index.DocumentsWriterPerThread.flush(DocumentsWriterPerThread.java:460)
   [junit4]    > 	at org.apache.lucene.index.DocumentsWriter.doFlush(DocumentsWriter.java:502)
   [junit4]    > 	at org.apache.lucene.index.DocumentsWriter.flushAllThreads(DocumentsWriter.java:614)
   [junit4]    > 	at org.apache.lucene.index.IndexWriter.prepareCommitInternal(IndexWriter.java:2815)
   [junit4]    > 	at org.apache.lucene.index.IndexWriter.commitInternal(IndexWriter.java:2989)
   [junit4]    > 	at org.apache.lucene.index.IndexWriter.commit(IndexWriter.java:2956)
   [junit4]    > 	at org.apache.lucene.index.RandomIndexWriter.commit(RandomIndexWriter.java:288)
   [junit4]    > 	at org.apache.lucene.index.BaseDocValuesFormatTestCase.doTestSortedSetVsStoredFields(BaseDocValuesFormatTestCase.java:1983)
   [junit4]    > 	at org.apache.lucene.index.BaseDocValuesFormatTestCase.testSortedSetFixedLengthVsStoredFields(BaseDocValuesFormatTestCase.java:2047)
   [junit4]    > 	at java.lang.Thread.run(Thread.java:804)
   [junit4]    > Caused by: java.lang.IncompatibleClassChangeError: Found class jdk.internal.ref.Cleaner, but interface was expected
   [junit4]    > 	at org.apache.lucene.store.MMapDirectory.lambda$initUnmapHack$0(MMapDirectory.java:377)
   [junit4]    > 	at java.security.AccessController.doPrivileged(Native Method)
   [junit4]    > 	at org.apache.lucene.store.MMapDirectory.lambda$initUnmapHack$1(MMapDirectory.java:375)
   [junit4]    > 	... 55 more
   [junit4]   2> NOTE: reproduce with: ant test  -Dtestcase=TestMemoryDocValuesFormat -Dtests.method=testSortedVariableLengthVsStoredFields -Dtests.seed=4AD4CB7CC8B872A6 -Dtests.multiplier=3 -Dtests.slow=true -Dtests.locale=sbp -Dtests.timezone=Etc/GMT+6 -Dtests.asserts=true -Dtests.file.encoding=ISO-8859-1
   [junit4] ERROR   0.74s J1 | TestMemoryDocValuesFormat.testSortedVariableLengthVsStoredFields <<<
   [junit4]    > Throwable #1: java.io.IOException: Unable to unmap the mapped buffer: MMapIndexInput(path="/home/jenkins/workspace/Lucene-Solr-trunk-Linux/lucene/build/codecs/test/J1/temp/lucene.codecs.memory.TestMemoryDocValuesFormat_4AD4CB7CC8B872A6-001/dvduel-027/_0_Memory_0.mdvd")
   [junit4]    > 	at __randomizedtesting.SeedInfo.seed([4AD4CB7CC8B872A6:796E0616F68884ED]:0)
   [junit4]    > 	at org.apache.lucene.store.MMapDirectory.lambda$initUnmapHack$1(MMapDirectory.java:384)
   [junit4]    > 	at org.apache.lucene.store.ByteBufferIndexInput.freeBuffer(ByteBufferIndexInput.java:376)
   [junit4]    > 	at org.apache.lucene.store.ByteBufferIndexInput.close(ByteBufferIndexInput.java:355)
   [junit4]    > 	at org.apache.lucene.util.LuceneTestCase.slowFileExists(LuceneTestCase.java:2680)
   [junit4]    > 	at org.apache.lucene.store.MockDirectoryWrapper.openInput(MockDirectoryWrapper.java:732)
   [junit4]    > 	at org.apache.lucene.store.FilterDirectory.openInput(FilterDirectory.java:94)
   [junit4]    > 	at org.apache.lucene.store.FilterDirectory.openInput(FilterDirectory.java:94)
   [junit4]    > 	at org.apache.lucene.store.FilterDirectory.openInput(FilterDirectory.java:94)
   [junit4]    > 	at org.apache.lucene.codecs.lucene50.Lucene50CompoundFormat.write(Lucene50CompoundFormat.java:90)
   [junit4]    > 	at org.apache.lucene.index.IndexWriter.createCompoundFile(IndexWriter.java:4680)
   [junit4]    > 	at org.apache.lucene.index.DocumentsWriterPerThread.sealFlushedSegment(DocumentsWriterPerThread.java:496)
   [junit4]    > 	at org.apache.lucene.index.DocumentsWriterPerThread.flush(DocumentsWriterPerThread.java:460)
   [junit4]    > 	at org.apache.lucene.index.DocumentsWriter.doFlush(DocumentsWriter.java:502)
   [junit4]    > 	at org.apache.lucene.index.DocumentsWriter.flushAllThreads(DocumentsWriter.java:614)
   [junit4]    > 	at org.apache.lucene.index.IndexWriter.prepareCommitInternal(IndexWriter.java:2815)
   [junit4]    > 	at org.apache.lucene.index.IndexWriter.commitInternal(IndexWriter.java:2989)
   [junit4]    > 	at org.apache.lucene.index.IndexWriter.commit(IndexWriter.java:2956)
   [junit4]    > 	at org.apache.lucene.index.RandomIndexWriter.commit(RandomIndexWriter.java:288)
   [junit4]    > 	at org.apache.lucene.index.BaseDocValuesFormatTestCase.doTestSortedVsStoredFields(BaseDocValuesFormatTestCase.java:1451)
   [junit4]    > 	at org.apache.lucene.index.BaseDocValuesFormatTestCase.testSortedVariableLengthVsStoredFields(BaseDocValuesFormatTestCase.java:1503)
   [junit4]    > 	at java.lang.Thread.run(Thread.java:804)
   [junit4]    > Caused by: java.lang.IncompatibleClassChangeError: Found class jdk.internal.ref.Cleaner, but interface was expected
   [junit4]    > 	at org.apache.lucene.store.MMapDirectory.lambda$initUnmapHack$0(MMapDirectory.java:377)
   [junit4]    > 	at java.security.AccessController.doPrivileged(Native Method)
   [junit4]    > 	at org.apache.lucene.store.MMapDirectory.lambda$initUnmapHack$1(MMapDirectory.java:375)
   [junit4]    > 	... 55 more
   [junit4]   2> NOTE: leaving temporary files on disk at: /home/jenkins/workspace/Lucene-Solr-trunk-Linux/lucene/build/codecs/test/J1/temp/lucene.codecs.memory.TestMemoryDocValuesFormat_4AD4CB7CC8B872A6-001
   [junit4]   2> NOTE: test params are: codec=Asserting(Lucene60): {}, docValues:{}, sim=ClassicSimilarity, locale=sbp, timezone=Etc/GMT+6
   [junit4]   2> NOTE: Linux 3.19.0-47-generic i386/Oracle Corporation 9-ea (32-bit)/cpus=12,threads=1,free=47076968,total=205520896
   [junit4]   2> NOTE: All tests run in this JVM: [TestSimpleTextFieldInfoFormat, TestSimpleTextDocValuesFormat, TestSimpleTextSegmentInfoFormat, TestAutoPrefixPostingsFormat, TestVarGapFixedIntervalPostingsFormat, TestOrdsBlockTree, TestFSTOrdPostingsFormat, TestFSTPostingsFormat, TestMemoryDocValuesFormat]
   [junit4] Completed [20/22 (8!)] on J1 in 26.11s, 98 tests, 7 errors <<< FAILURES!

[...truncated 31 lines...]
BUILD FAILED
/home/jenkins/workspace/Lucene-Solr-trunk-Linux/build.xml:740: The following error occurred while executing this line:
/home/jenkins/workspace/Lucene-Solr-trunk-Linux/build.xml:684: The following error occurred while executing this line:
/home/jenkins/workspace/Lucene-Solr-trunk-Linux/build.xml:59: The following error occurred while executing this line:
/home/jenkins/workspace/Lucene-Solr-trunk-Linux/lucene/build.xml:475: The following error occurred while executing this line:
/home/jenkins/workspace/Lucene-Solr-trunk-Linux/lucene/common-build.xml:2187: The following error occurred while executing this line:
/home/jenkins/workspace/Lucene-Solr-trunk-Linux/lucene/module-build.xml:58: The following error occurred while executing this line:
/home/jenkins/workspace/Lucene-Solr-trunk-Linux/lucene/common-build.xml:1457: The following error occurred while executing this line:
/home/jenkins/workspace/Lucene-Solr-trunk-Linux/lucene/common-build.xml:1014: There were test failures: 22 suites, 662 tests, 37 errors, 29 ignored (29 assumptions) [seed: 4AD4CB7CC8B872A6]

Total time: 18 minutes 45 seconds
Build step 'Invoke Ant' marked build as failure
Archiving artifacts
[WARNINGS] Skipping publisher since build result is FAILURE
Recording test results
Email was triggered for: Failure - Any
Sending email for trigger: Failure - Any



[JENKINS] Lucene-Solr-trunk-Linux (32bit/jdk1.8.0_72) - Build # 16027 - Still Failing!

Posted by Policeman Jenkins Server <je...@thetaphi.de>.
Build: http://jenkins.thetaphi.de/job/Lucene-Solr-trunk-Linux/16027/
Java: 32bit/jdk1.8.0_72 -server -XX:+UseSerialGC

1 tests failed.
FAILED:  org.apache.solr.cloud.UnloadDistributedZkTest.test

Error Message:
Captured an uncaught exception in thread: Thread[id=3840, name=testExecutor-2061-thread-4, state=RUNNABLE, group=TGRP-UnloadDistributedZkTest]

Stack Trace:
com.carrotsearch.randomizedtesting.UncaughtExceptionError: Captured an uncaught exception in thread: Thread[id=3840, name=testExecutor-2061-thread-4, state=RUNNABLE, group=TGRP-UnloadDistributedZkTest]
Caused by: java.lang.RuntimeException: org.apache.solr.client.solrj.SolrServerException: Timeout occured while waiting response from server at: http://127.0.0.1:51876
	at __randomizedtesting.SeedInfo.seed([AB86964C70C8349D]:0)
	at org.apache.solr.cloud.BasicDistributedZkTest$1.run(BasicDistributedZkTest.java:586)
	at org.apache.solr.common.util.ExecutorUtil$MDCAwareThreadPoolExecutor$1.run(ExecutorUtil.java:231)
	at java.util.concurrent.ThreadPoolExecutor.runWorker(ThreadPoolExecutor.java:1142)
	at java.util.concurrent.ThreadPoolExecutor$Worker.run(ThreadPoolExecutor.java:617)
	at java.lang.Thread.run(Thread.java:745)
Caused by: org.apache.solr.client.solrj.SolrServerException: Timeout occured while waiting response from server at: http://127.0.0.1:51876
	at org.apache.solr.client.solrj.impl.HttpSolrClient.executeMethod(HttpSolrClient.java:588)
	at org.apache.solr.client.solrj.impl.HttpSolrClient.request(HttpSolrClient.java:241)
	at org.apache.solr.client.solrj.impl.HttpSolrClient.request(HttpSolrClient.java:230)
	at org.apache.solr.client.solrj.SolrClient.request(SolrClient.java:1219)
	at org.apache.solr.cloud.BasicDistributedZkTest$1.run(BasicDistributedZkTest.java:584)
	... 4 more
Caused by: java.net.SocketTimeoutException: Read timed out
	at java.net.SocketInputStream.socketRead0(Native Method)
	at java.net.SocketInputStream.socketRead(SocketInputStream.java:116)
	at java.net.SocketInputStream.read(SocketInputStream.java:170)
	at java.net.SocketInputStream.read(SocketInputStream.java:141)
	at org.apache.http.impl.io.AbstractSessionInputBuffer.fillBuffer(AbstractSessionInputBuffer.java:160)
	at org.apache.http.impl.io.SocketInputBuffer.fillBuffer(SocketInputBuffer.java:84)
	at org.apache.http.impl.io.AbstractSessionInputBuffer.readLine(AbstractSessionInputBuffer.java:273)
	at org.apache.http.impl.conn.DefaultHttpResponseParser.parseHead(DefaultHttpResponseParser.java:140)
	at org.apache.http.impl.conn.DefaultHttpResponseParser.parseHead(DefaultHttpResponseParser.java:57)
	at org.apache.http.impl.io.AbstractMessageParser.parse(AbstractMessageParser.java:261)
	at org.apache.http.impl.AbstractHttpClientConnection.receiveResponseHeader(AbstractHttpClientConnection.java:283)
	at org.apache.http.impl.conn.DefaultClientConnection.receiveResponseHeader(DefaultClientConnection.java:251)
	at org.apache.http.impl.conn.ManagedClientConnectionImpl.receiveResponseHeader(ManagedClientConnectionImpl.java:197)
	at org.apache.http.protocol.HttpRequestExecutor.doReceiveResponse(HttpRequestExecutor.java:272)
	at org.apache.http.protocol.HttpRequestExecutor.execute(HttpRequestExecutor.java:124)
	at org.apache.http.impl.client.DefaultRequestDirector.tryExecute(DefaultRequestDirector.java:685)
	at org.apache.http.impl.client.DefaultRequestDirector.execute(DefaultRequestDirector.java:487)
	at org.apache.http.impl.client.AbstractHttpClient.doExecute(AbstractHttpClient.java:882)
	at org.apache.http.impl.client.CloseableHttpClient.execute(CloseableHttpClient.java:82)
	at org.apache.http.impl.client.CloseableHttpClient.execute(CloseableHttpClient.java:107)
	at org.apache.http.impl.client.CloseableHttpClient.execute(CloseableHttpClient.java:55)
	at org.apache.solr.client.solrj.impl.HttpSolrClient.executeMethod(HttpSolrClient.java:482)
	... 8 more




Build Log:
[...truncated 10923 lines...]
   [junit4] Suite: org.apache.solr.cloud.UnloadDistributedZkTest
   [junit4]   2> Creating dataDir: /home/jenkins/workspace/Lucene-Solr-trunk-Linux/solr/build/solr-core/test/J2/temp/solr.cloud.UnloadDistributedZkTest_AB86964C70C8349D-001/init-core-data-001
   [junit4]   2> 420282 INFO  (SUITE-UnloadDistributedZkTest-seed#[AB86964C70C8349D]-worker) [    ] o.a.s.BaseDistributedSearchTestCase Setting hostContext system property: /
   [junit4]   2> 420284 INFO  (TEST-UnloadDistributedZkTest.test-seed#[AB86964C70C8349D]) [    ] o.a.s.c.ZkTestServer STARTING ZK TEST SERVER
   [junit4]   2> 420287 INFO  (Thread-1436) [    ] o.a.s.c.ZkTestServer client port:0.0.0.0/0.0.0.0:0
   [junit4]   2> 420287 INFO  (Thread-1436) [    ] o.a.s.c.ZkTestServer Starting server
   [junit4]   2> 420387 INFO  (TEST-UnloadDistributedZkTest.test-seed#[AB86964C70C8349D]) [    ] o.a.s.c.ZkTestServer start zk server on port:37980
   [junit4]   2> 420387 INFO  (TEST-UnloadDistributedZkTest.test-seed#[AB86964C70C8349D]) [    ] o.a.s.c.c.SolrZkClient Using default ZkCredentialsProvider
   [junit4]   2> 420388 INFO  (TEST-UnloadDistributedZkTest.test-seed#[AB86964C70C8349D]) [    ] o.a.s.c.c.ConnectionManager Waiting for client to connect to ZooKeeper
   [junit4]   2> 420389 INFO  (zkCallback-548-thread-1) [    ] o.a.s.c.c.ConnectionManager Watcher org.apache.solr.common.cloud.ConnectionManager@1b50eb2 name:ZooKeeperConnection Watcher:127.0.0.1:37980 got event WatchedEvent state:SyncConnected type:None path:null path:null type:None
   [junit4]   2> 420390 INFO  (TEST-UnloadDistributedZkTest.test-seed#[AB86964C70C8349D]) [    ] o.a.s.c.c.ConnectionManager Client is connected to ZooKeeper
   [junit4]   2> 420390 INFO  (TEST-UnloadDistributedZkTest.test-seed#[AB86964C70C8349D]) [    ] o.a.s.c.c.SolrZkClient Using default ZkACLProvider
   [junit4]   2> 420390 INFO  (TEST-UnloadDistributedZkTest.test-seed#[AB86964C70C8349D]) [    ] o.a.s.c.c.SolrZkClient makePath: /solr
   [junit4]   2> 420391 INFO  (TEST-UnloadDistributedZkTest.test-seed#[AB86964C70C8349D]) [    ] o.a.s.c.c.SolrZkClient Using default ZkCredentialsProvider
   [junit4]   2> 420391 INFO  (TEST-UnloadDistributedZkTest.test-seed#[AB86964C70C8349D]) [    ] o.a.s.c.c.ConnectionManager Waiting for client to connect to ZooKeeper
   [junit4]   2> 420392 INFO  (zkCallback-549-thread-1) [    ] o.a.s.c.c.ConnectionManager Watcher org.apache.solr.common.cloud.ConnectionManager@80f4bf name:ZooKeeperConnection Watcher:127.0.0.1:37980/solr got event WatchedEvent state:SyncConnected type:None path:null path:null type:None
   [junit4]   2> 420392 INFO  (TEST-UnloadDistributedZkTest.test-seed#[AB86964C70C8349D]) [    ] o.a.s.c.c.ConnectionManager Client is connected to ZooKeeper
   [junit4]   2> 420392 INFO  (TEST-UnloadDistributedZkTest.test-seed#[AB86964C70C8349D]) [    ] o.a.s.c.c.SolrZkClient Using default ZkACLProvider
   [junit4]   2> 420392 INFO  (TEST-UnloadDistributedZkTest.test-seed#[AB86964C70C8349D]) [    ] o.a.s.c.c.SolrZkClient makePath: /collections/collection1
   [junit4]   2> 420393 INFO  (TEST-UnloadDistributedZkTest.test-seed#[AB86964C70C8349D]) [    ] o.a.s.c.c.SolrZkClient makePath: /collections/collection1/shards
   [junit4]   2> 420393 INFO  (TEST-UnloadDistributedZkTest.test-seed#[AB86964C70C8349D]) [    ] o.a.s.c.c.SolrZkClient makePath: /collections/control_collection
   [junit4]   2> 420394 INFO  (TEST-UnloadDistributedZkTest.test-seed#[AB86964C70C8349D]) [    ] o.a.s.c.c.SolrZkClient makePath: /collections/control_collection/shards
   [junit4]   2> 420395 INFO  (TEST-UnloadDistributedZkTest.test-seed#[AB86964C70C8349D]) [    ] o.a.s.c.AbstractZkTestCase put /home/jenkins/workspace/Lucene-Solr-trunk-Linux/solr/core/src/test-files/solr/collection1/conf/solrconfig-tlog.xml to /configs/conf1/solrconfig.xml
   [junit4]   2> 420395 INFO  (TEST-UnloadDistributedZkTest.test-seed#[AB86964C70C8349D]) [    ] o.a.s.c.c.SolrZkClient makePath: /configs/conf1/solrconfig.xml
   [junit4]   2> 420396 INFO  (TEST-UnloadDistributedZkTest.test-seed#[AB86964C70C8349D]) [    ] o.a.s.c.AbstractZkTestCase put /home/jenkins/workspace/Lucene-Solr-trunk-Linux/solr/core/src/test-files/solr/collection1/conf/schema.xml to /configs/conf1/schema.xml
   [junit4]   2> 420396 INFO  (TEST-UnloadDistributedZkTest.test-seed#[AB86964C70C8349D]) [    ] o.a.s.c.c.SolrZkClient makePath: /configs/conf1/schema.xml
   [junit4]   2> 420397 INFO  (TEST-UnloadDistributedZkTest.test-seed#[AB86964C70C8349D]) [    ] o.a.s.c.AbstractZkTestCase put /home/jenkins/workspace/Lucene-Solr-trunk-Linux/solr/core/src/test-files/solr/collection1/conf/solrconfig.snippet.randomindexconfig.xml to /configs/conf1/solrconfig.snippet.randomindexconfig.xml
   [junit4]   2> 420397 INFO  (TEST-UnloadDistributedZkTest.test-seed#[AB86964C70C8349D]) [    ] o.a.s.c.c.SolrZkClient makePath: /configs/conf1/solrconfig.snippet.randomindexconfig.xml
   [junit4]   2> 420397 INFO  (TEST-UnloadDistributedZkTest.test-seed#[AB86964C70C8349D]) [    ] o.a.s.c.AbstractZkTestCase put /home/jenkins/workspace/Lucene-Solr-trunk-Linux/solr/core/src/test-files/solr/collection1/conf/stopwords.txt to /configs/conf1/stopwords.txt
   [junit4]   2> 420398 INFO  (TEST-UnloadDistributedZkTest.test-seed#[AB86964C70C8349D]) [    ] o.a.s.c.c.SolrZkClient makePath: /configs/conf1/stopwords.txt
   [junit4]   2> 420398 INFO  (TEST-UnloadDistributedZkTest.test-seed#[AB86964C70C8349D]) [    ] o.a.s.c.AbstractZkTestCase put /home/jenkins/workspace/Lucene-Solr-trunk-Linux/solr/core/src/test-files/solr/collection1/conf/protwords.txt to /configs/conf1/protwords.txt
   [junit4]   2> 420398 INFO  (TEST-UnloadDistributedZkTest.test-seed#[AB86964C70C8349D]) [    ] o.a.s.c.c.SolrZkClient makePath: /configs/conf1/protwords.txt
   [junit4]   2> 420399 INFO  (TEST-UnloadDistributedZkTest.test-seed#[AB86964C70C8349D]) [    ] o.a.s.c.AbstractZkTestCase put /home/jenkins/workspace/Lucene-Solr-trunk-Linux/solr/core/src/test-files/solr/collection1/conf/currency.xml to /configs/conf1/currency.xml
   [junit4]   2> 420399 INFO  (TEST-UnloadDistributedZkTest.test-seed#[AB86964C70C8349D]) [    ] o.a.s.c.c.SolrZkClient makePath: /configs/conf1/currency.xml
   [junit4]   2> 420399 INFO  (TEST-UnloadDistributedZkTest.test-seed#[AB86964C70C8349D]) [    ] o.a.s.c.AbstractZkTestCase put /home/jenkins/workspace/Lucene-Solr-trunk-Linux/solr/core/src/test-files/solr/collection1/conf/enumsConfig.xml to /configs/conf1/enumsConfig.xml
   [junit4]   2> 420399 INFO  (TEST-UnloadDistributedZkTest.test-seed#[AB86964C70C8349D]) [    ] o.a.s.c.c.SolrZkClient makePath: /configs/conf1/enumsConfig.xml
   [junit4]   2> 420400 INFO  (TEST-UnloadDistributedZkTest.test-seed#[AB86964C70C8349D]) [    ] o.a.s.c.AbstractZkTestCase put /home/jenkins/workspace/Lucene-Solr-trunk-Linux/solr/core/src/test-files/solr/collection1/conf/open-exchange-rates.json to /configs/conf1/open-exchange-rates.json
   [junit4]   2> 420400 INFO  (TEST-UnloadDistributedZkTest.test-seed#[AB86964C70C8349D]) [    ] o.a.s.c.c.SolrZkClient makePath: /configs/conf1/open-exchange-rates.json
   [junit4]   2> 420400 INFO  (TEST-UnloadDistributedZkTest.test-seed#[AB86964C70C8349D]) [    ] o.a.s.c.AbstractZkTestCase put /home/jenkins/workspace/Lucene-Solr-trunk-Linux/solr/core/src/test-files/solr/collection1/conf/mapping-ISOLatin1Accent.txt to /configs/conf1/mapping-ISOLatin1Accent.txt
   [junit4]   2> 420400 INFO  (TEST-UnloadDistributedZkTest.test-seed#[AB86964C70C8349D]) [    ] o.a.s.c.c.SolrZkClient makePath: /configs/conf1/mapping-ISOLatin1Accent.txt
   [junit4]   2> 420401 INFO  (TEST-UnloadDistributedZkTest.test-seed#[AB86964C70C8349D]) [    ] o.a.s.c.AbstractZkTestCase put /home/jenkins/workspace/Lucene-Solr-trunk-Linux/solr/core/src/test-files/solr/collection1/conf/old_synonyms.txt to /configs/conf1/old_synonyms.txt
   [junit4]   2> 420401 INFO  (TEST-UnloadDistributedZkTest.test-seed#[AB86964C70C8349D]) [    ] o.a.s.c.c.SolrZkClient makePath: /configs/conf1/old_synonyms.txt
   [junit4]   2> 420402 INFO  (TEST-UnloadDistributedZkTest.test-seed#[AB86964C70C8349D]) [    ] o.a.s.c.AbstractZkTestCase put /home/jenkins/workspace/Lucene-Solr-trunk-Linux/solr/core/src/test-files/solr/collection1/conf/synonyms.txt to /configs/conf1/synonyms.txt
   [junit4]   2> 420402 INFO  (TEST-UnloadDistributedZkTest.test-seed#[AB86964C70C8349D]) [    ] o.a.s.c.c.SolrZkClient makePath: /configs/conf1/synonyms.txt
   [junit4]   2> 420463 INFO  (TEST-UnloadDistributedZkTest.test-seed#[AB86964C70C8349D]) [    ] o.a.s.SolrTestCaseJ4 Writing core.properties file to /home/jenkins/workspace/Lucene-Solr-trunk-Linux/solr/build/solr-core/test/J2/temp/solr.cloud.UnloadDistributedZkTest_AB86964C70C8349D-001/control-001/cores/collection1
   [junit4]   2> 420464 INFO  (TEST-UnloadDistributedZkTest.test-seed#[AB86964C70C8349D]) [    ] o.e.j.s.Server jetty-9.3.6.v20151106
   [junit4]   2> 420465 INFO  (TEST-UnloadDistributedZkTest.test-seed#[AB86964C70C8349D]) [    ] o.e.j.s.h.ContextHandler Started o.e.j.s.ServletContextHandler@b711f7{/,null,AVAILABLE}
   [junit4]   2> 420468 INFO  (TEST-UnloadDistributedZkTest.test-seed#[AB86964C70C8349D]) [    ] o.e.j.s.ServerConnector Started ServerConnector@109cb4d{HTTP/1.1,[http/1.1]}{127.0.0.1:38816}
   [junit4]   2> 420468 INFO  (TEST-UnloadDistributedZkTest.test-seed#[AB86964C70C8349D]) [    ] o.e.j.s.Server Started @422028ms
   [junit4]   2> 420468 INFO  (TEST-UnloadDistributedZkTest.test-seed#[AB86964C70C8349D]) [    ] o.a.s.c.s.e.JettySolrRunner Jetty properties: {solr.data.dir=/home/jenkins/workspace/Lucene-Solr-trunk-Linux/solr/build/solr-core/test/J2/temp/solr.cloud.UnloadDistributedZkTest_AB86964C70C8349D-001/tempDir-001/control/data, hostContext=/, hostPort=38816, coreRootDirectory=/home/jenkins/workspace/Lucene-Solr-trunk-Linux/solr/build/solr-core/test/J2/../../../../../../../../../home/jenkins/workspace/Lucene-Solr-trunk-Linux/solr/build/solr-core/test/J2/temp/solr.cloud.UnloadDistributedZkTest_AB86964C70C8349D-001/control-001/cores}
   [junit4]   2> 420469 INFO  (TEST-UnloadDistributedZkTest.test-seed#[AB86964C70C8349D]) [    ] o.a.s.s.SolrDispatchFilter SolrDispatchFilter.init(): sun.misc.Launcher$AppClassLoader@1d16e93
   [junit4]   2> 420469 INFO  (TEST-UnloadDistributedZkTest.test-seed#[AB86964C70C8349D]) [    ] o.a.s.c.SolrResourceLoader new SolrResourceLoader for directory: '/home/jenkins/workspace/Lucene-Solr-trunk-Linux/solr/build/solr-core/test/J2/temp/solr.cloud.UnloadDistributedZkTest_AB86964C70C8349D-001/control-001'
   [junit4]   2> 420469 INFO  (TEST-UnloadDistributedZkTest.test-seed#[AB86964C70C8349D]) [    ] o.a.s.c.SolrResourceLoader JNDI not configured for solr (NoInitialContextEx)
   [junit4]   2> 420469 INFO  (TEST-UnloadDistributedZkTest.test-seed#[AB86964C70C8349D]) [    ] o.a.s.c.SolrResourceLoader solr home defaulted to 'solr/' (could not find system property or JNDI)
   [junit4]   2> 420469 INFO  (TEST-UnloadDistributedZkTest.test-seed#[AB86964C70C8349D]) [    ] o.a.s.c.c.SolrZkClient Using default ZkCredentialsProvider
   [junit4]   2> 420470 INFO  (TEST-UnloadDistributedZkTest.test-seed#[AB86964C70C8349D]) [    ] o.a.s.c.c.ConnectionManager Waiting for client to connect to ZooKeeper
   [junit4]   2> 420470 INFO  (zkCallback-550-thread-1) [    ] o.a.s.c.c.ConnectionManager Watcher org.apache.solr.common.cloud.ConnectionManager@d50502 name:ZooKeeperConnection Watcher:127.0.0.1:37980/solr got event WatchedEvent state:SyncConnected type:None path:null path:null type:None
   [junit4]   2> 420470 INFO  (TEST-UnloadDistributedZkTest.test-seed#[AB86964C70C8349D]) [    ] o.a.s.c.c.ConnectionManager Client is connected to ZooKeeper
   [junit4]   2> 420471 INFO  (TEST-UnloadDistributedZkTest.test-seed#[AB86964C70C8349D]) [    ] o.a.s.c.c.SolrZkClient Using default ZkACLProvider
   [junit4]   2> 420471 INFO  (TEST-UnloadDistributedZkTest.test-seed#[AB86964C70C8349D]) [    ] o.a.s.s.SolrDispatchFilter Loading solr.xml from SolrHome (not found in ZooKeeper)
   [junit4]   2> 420471 INFO  (TEST-UnloadDistributedZkTest.test-seed#[AB86964C70C8349D]) [    ] o.a.s.c.SolrXmlConfig Loading container configuration from /home/jenkins/workspace/Lucene-Solr-trunk-Linux/solr/build/solr-core/test/J2/temp/solr.cloud.UnloadDistributedZkTest_AB86964C70C8349D-001/control-001/solr.xml
   [junit4]   2> 420474 INFO  (TEST-UnloadDistributedZkTest.test-seed#[AB86964C70C8349D]) [    ] o.a.s.c.CorePropertiesLocator Config-defined core root directory: /home/jenkins/workspace/Lucene-Solr-trunk-Linux/solr/build/solr-core/test/J2/../../../../../../../../../home/jenkins/workspace/Lucene-Solr-trunk-Linux/solr/build/solr-core/test/J2/temp/solr.cloud.UnloadDistributedZkTest_AB86964C70C8349D-001/control-001/cores
   [junit4]   2> 420474 INFO  (TEST-UnloadDistributedZkTest.test-seed#[AB86964C70C8349D]) [    ] o.a.s.c.CoreContainer New CoreContainer 10756909
   [junit4]   2> 420474 INFO  (TEST-UnloadDistributedZkTest.test-seed#[AB86964C70C8349D]) [    ] o.a.s.c.CoreContainer Loading cores into CoreContainer [instanceDir=/home/jenkins/workspace/Lucene-Solr-trunk-Linux/solr/build/solr-core/test/J2/temp/solr.cloud.UnloadDistributedZkTest_AB86964C70C8349D-001/control-001]
   [junit4]   2> 420475 WARN  (TEST-UnloadDistributedZkTest.test-seed#[AB86964C70C8349D]) [    ] o.a.s.c.CoreContainer Couldn't add files from /home/jenkins/workspace/Lucene-Solr-trunk-Linux/solr/build/solr-core/test/J2/temp/solr.cloud.UnloadDistributedZkTest_AB86964C70C8349D-001/control-001/lib to classpath: /home/jenkins/workspace/Lucene-Solr-trunk-Linux/solr/build/solr-core/test/J2/temp/solr.cloud.UnloadDistributedZkTest_AB86964C70C8349D-001/control-001/lib
   [junit4]   2> 420475 INFO  (TEST-UnloadDistributedZkTest.test-seed#[AB86964C70C8349D]) [    ] o.a.s.h.c.HttpShardHandlerFactory created with socketTimeout : 90000,urlScheme : ,connTimeout : 15000,maxConnectionsPerHost : 20,maxConnections : 10000,corePoolSize : 0,maximumPoolSize : 2147483647,maxThreadIdleTime : 5,sizeOfQueue : -1,fairnessPolicy : false,useRetries : false,
   [junit4]   2> 420476 INFO  (TEST-UnloadDistributedZkTest.test-seed#[AB86964C70C8349D]) [    ] o.a.s.u.UpdateShardHandler Creating UpdateShardHandler HTTP client with params: socketTimeout=340000&connTimeout=45000&retry=true
   [junit4]   2> 420476 INFO  (TEST-UnloadDistributedZkTest.test-seed#[AB86964C70C8349D]) [    ] o.a.s.l.LogWatcher SLF4J impl is org.slf4j.impl.Log4jLoggerFactory
   [junit4]   2> 420476 INFO  (TEST-UnloadDistributedZkTest.test-seed#[AB86964C70C8349D]) [    ] o.a.s.l.LogWatcher Registering Log Listener [Log4j (org.slf4j.impl.Log4jLoggerFactory)]
   [junit4]   2> 420476 INFO  (TEST-UnloadDistributedZkTest.test-seed#[AB86964C70C8349D]) [    ] o.a.s.c.ZkContainer Zookeeper client=127.0.0.1:37980/solr
   [junit4]   2> 420476 INFO  (TEST-UnloadDistributedZkTest.test-seed#[AB86964C70C8349D]) [    ] o.a.s.c.ZkController zkHost includes chroot
   [junit4]   2> 420476 INFO  (TEST-UnloadDistributedZkTest.test-seed#[AB86964C70C8349D]) [    ] o.a.s.c.c.SolrZkClient Using default ZkCredentialsProvider
   [junit4]   2> 420476 INFO  (TEST-UnloadDistributedZkTest.test-seed#[AB86964C70C8349D]) [    ] o.a.s.c.c.ConnectionManager Waiting for client to connect to ZooKeeper
   [junit4]   2> 420477 INFO  (zkCallback-553-thread-1) [    ] o.a.s.c.c.ConnectionManager Watcher org.apache.solr.common.cloud.ConnectionManager@1a3a76c name:ZooKeeperConnection Watcher:127.0.0.1:37980 got event WatchedEvent state:SyncConnected type:None path:null path:null type:None
   [junit4]   2> 420477 INFO  (TEST-UnloadDistributedZkTest.test-seed#[AB86964C70C8349D]) [    ] o.a.s.c.c.ConnectionManager Client is connected to ZooKeeper
   [junit4]   2> 420478 INFO  (TEST-UnloadDistributedZkTest.test-seed#[AB86964C70C8349D]) [    ] o.a.s.c.c.SolrZkClient Using default ZkACLProvider
   [junit4]   2> 420479 INFO  (TEST-UnloadDistributedZkTest.test-seed#[AB86964C70C8349D]) [n:127.0.0.1:38816_    ] o.a.s.c.c.ConnectionManager Waiting for client to connect to ZooKeeper
   [junit4]   2> 420479 INFO  (zkCallback-554-thread-1-processing-n:127.0.0.1:38816_) [n:127.0.0.1:38816_    ] o.a.s.c.c.ConnectionManager Watcher org.apache.solr.common.cloud.ConnectionManager@f007be name:ZooKeeperConnection Watcher:127.0.0.1:37980/solr got event WatchedEvent state:SyncConnected type:None path:null path:null type:None
   [junit4]   2> 420479 INFO  (TEST-UnloadDistributedZkTest.test-seed#[AB86964C70C8349D]) [n:127.0.0.1:38816_    ] o.a.s.c.c.ConnectionManager Client is connected to ZooKeeper
   [junit4]   2> 420480 INFO  (TEST-UnloadDistributedZkTest.test-seed#[AB86964C70C8349D]) [n:127.0.0.1:38816_    ] o.a.s.c.c.SolrZkClient makePath: /overseer/queue
   [junit4]   2> 420481 INFO  (TEST-UnloadDistributedZkTest.test-seed#[AB86964C70C8349D]) [n:127.0.0.1:38816_    ] o.a.s.c.c.SolrZkClient makePath: /overseer/collection-queue-work
   [junit4]   2> 420482 INFO  (TEST-UnloadDistributedZkTest.test-seed#[AB86964C70C8349D]) [n:127.0.0.1:38816_    ] o.a.s.c.c.SolrZkClient makePath: /overseer/collection-map-running
   [junit4]   2> 420482 INFO  (TEST-UnloadDistributedZkTest.test-seed#[AB86964C70C8349D]) [n:127.0.0.1:38816_    ] o.a.s.c.c.SolrZkClient makePath: /overseer/collection-map-completed
   [junit4]   2> 420483 INFO  (TEST-UnloadDistributedZkTest.test-seed#[AB86964C70C8349D]) [n:127.0.0.1:38816_    ] o.a.s.c.c.SolrZkClient makePath: /overseer/collection-map-failure
   [junit4]   2> 420483 INFO  (TEST-UnloadDistributedZkTest.test-seed#[AB86964C70C8349D]) [n:127.0.0.1:38816_    ] o.a.s.c.c.SolrZkClient makePath: /live_nodes
   [junit4]   2> 420484 INFO  (TEST-UnloadDistributedZkTest.test-seed#[AB86964C70C8349D]) [n:127.0.0.1:38816_    ] o.a.s.c.c.SolrZkClient makePath: /aliases.json
   [junit4]   2> 420484 INFO  (TEST-UnloadDistributedZkTest.test-seed#[AB86964C70C8349D]) [n:127.0.0.1:38816_    ] o.a.s.c.c.SolrZkClient makePath: /clusterstate.json
   [junit4]   2> 420485 INFO  (TEST-UnloadDistributedZkTest.test-seed#[AB86964C70C8349D]) [n:127.0.0.1:38816_    ] o.a.s.c.c.SolrZkClient makePath: /security.json
   [junit4]   2> 420485 INFO  (TEST-UnloadDistributedZkTest.test-seed#[AB86964C70C8349D]) [n:127.0.0.1:38816_    ] o.a.s.c.c.SolrZkClient makePath: /overseer_elect
   [junit4]   2> 420486 INFO  (TEST-UnloadDistributedZkTest.test-seed#[AB86964C70C8349D]) [n:127.0.0.1:38816_    ] o.a.s.c.c.SolrZkClient makePath: /overseer_elect/election
   [junit4]   2> 420486 INFO  (TEST-UnloadDistributedZkTest.test-seed#[AB86964C70C8349D]) [n:127.0.0.1:38816_    ] o.a.s.c.Overseer Overseer (id=null) closing
   [junit4]   2> 420486 INFO  (TEST-UnloadDistributedZkTest.test-seed#[AB86964C70C8349D]) [n:127.0.0.1:38816_    ] o.a.s.c.LeaderElector Joined leadership election with path: /overseer_elect/election/95460067792519172-127.0.0.1:38816_-n_0000000000
   [junit4]   2> 420486 INFO  (TEST-UnloadDistributedZkTest.test-seed#[AB86964C70C8349D]) [n:127.0.0.1:38816_    ] o.a.s.c.OverseerElectionContext I am going to be the leader 127.0.0.1:38816_
   [junit4]   2> 420486 INFO  (TEST-UnloadDistributedZkTest.test-seed#[AB86964C70C8349D]) [n:127.0.0.1:38816_    ] o.a.s.c.c.SolrZkClient makePath: /overseer_elect/leader
   [junit4]   2> 420487 INFO  (TEST-UnloadDistributedZkTest.test-seed#[AB86964C70C8349D]) [n:127.0.0.1:38816_    ] o.a.s.c.Overseer Overseer (id=95460067792519172-127.0.0.1:38816_-n_0000000000) starting
   [junit4]   2> 420487 INFO  (TEST-UnloadDistributedZkTest.test-seed#[AB86964C70C8349D]) [n:127.0.0.1:38816_    ] o.a.s.c.c.SolrZkClient makePath: /overseer/queue-work
   [junit4]   2> 420489 INFO  (TEST-UnloadDistributedZkTest.test-seed#[AB86964C70C8349D]) [n:127.0.0.1:38816_    ] o.a.s.c.OverseerAutoReplicaFailoverThread Starting OverseerAutoReplicaFailoverThread autoReplicaFailoverWorkLoopDelay=10000 autoReplicaFailoverWaitAfterExpiration=10000 autoReplicaFailoverBadNodeExpiration=60000
   [junit4]   2> 420489 INFO  (OverseerCollectionConfigSetProcessor-95460067792519172-127.0.0.1:38816_-n_0000000000) [n:127.0.0.1:38816_    ] o.a.s.c.OverseerTaskProcessor Process current queue of overseer operations
   [junit4]   2> 420489 INFO  (TEST-UnloadDistributedZkTest.test-seed#[AB86964C70C8349D]) [n:127.0.0.1:38816_    ] o.a.s.c.c.ZkStateReader Updating cluster state from ZooKeeper... 
   [junit4]   2> 420489 INFO  (OverseerStateUpdate-95460067792519172-127.0.0.1:38816_-n_0000000000) [n:127.0.0.1:38816_    ] o.a.s.c.Overseer Starting to work on the main queue
   [junit4]   2> 420490 INFO  (TEST-UnloadDistributedZkTest.test-seed#[AB86964C70C8349D]) [n:127.0.0.1:38816_    ] o.a.s.c.c.ZkStateReader Updated live nodes from ZooKeeper... (0) -> (0)
   [junit4]   2> 420491 INFO  (TEST-UnloadDistributedZkTest.test-seed#[AB86964C70C8349D]) [n:127.0.0.1:38816_    ] o.a.s.c.ZkController Register node as live in ZooKeeper:/live_nodes/127.0.0.1:38816_
   [junit4]   2> 420491 INFO  (TEST-UnloadDistributedZkTest.test-seed#[AB86964C70C8349D]) [n:127.0.0.1:38816_    ] o.a.s.c.c.SolrZkClient makePath: /live_nodes/127.0.0.1:38816_
   [junit4]   2> 420491 INFO  (OverseerStateUpdate-95460067792519172-127.0.0.1:38816_-n_0000000000) [n:127.0.0.1:38816_    ] o.a.s.c.c.ZkStateReader Updated live nodes from ZooKeeper... (0) -> (0)
   [junit4]   2> 420491 INFO  (zkCallback-554-thread-1-processing-n:127.0.0.1:38816_) [n:127.0.0.1:38816_    ] o.a.s.c.c.ZkStateReader A live node change: [WatchedEvent state:SyncConnected type:NodeChildrenChanged path:/live_nodes], has occurred - updating... (live nodes size: [0])
   [junit4]   2> 420492 INFO  (zkCallback-554-thread-1-processing-n:127.0.0.1:38816_) [n:127.0.0.1:38816_    ] o.a.s.c.c.ZkStateReader Updated live nodes from ZooKeeper... (0) -> (1)
   [junit4]   2> 420508 INFO  (TEST-UnloadDistributedZkTest.test-seed#[AB86964C70C8349D]) [n:127.0.0.1:38816_    ] o.a.s.c.CoreContainer Security conf doesn't exist. Skipping setup for authorization module.
   [junit4]   2> 420508 INFO  (TEST-UnloadDistributedZkTest.test-seed#[AB86964C70C8349D]) [n:127.0.0.1:38816_    ] o.a.s.c.CoreContainer No authentication plugin used.
   [junit4]   2> 420508 INFO  (TEST-UnloadDistributedZkTest.test-seed#[AB86964C70C8349D]) [n:127.0.0.1:38816_    ] o.a.s.c.CorePropertiesLocator Looking for core definitions underneath /home/jenkins/workspace/Lucene-Solr-trunk-Linux/solr/build/solr-core/test/J2/../../../../../../../../../home/jenkins/workspace/Lucene-Solr-trunk-Linux/solr/build/solr-core/test/J2/temp/solr.cloud.UnloadDistributedZkTest_AB86964C70C8349D-001/control-001/cores
   [junit4]   2> 420509 INFO  (TEST-UnloadDistributedZkTest.test-seed#[AB86964C70C8349D]) [n:127.0.0.1:38816_    ] o.a.s.c.CoreDescriptor Created CoreDescriptor: {name=collection1, config=solrconfig.xml, transient=false, schema=schema.xml, loadOnStartup=true, configSetProperties=configsetprops.json, collection=control_collection, coreNodeName=, dataDir=data/, shard=}
   [junit4]   2> 420509 INFO  (TEST-UnloadDistributedZkTest.test-seed#[AB86964C70C8349D]) [n:127.0.0.1:38816_    ] o.a.s.c.CorePropertiesLocator Found core collection1 in /home/jenkins/workspace/Lucene-Solr-trunk-Linux/solr/build/solr-core/test/J2/../../../../../../../../../home/jenkins/workspace/Lucene-Solr-trunk-Linux/solr/build/solr-core/test/J2/temp/solr.cloud.UnloadDistributedZkTest_AB86964C70C8349D-001/control-001/cores/collection1
   [junit4]   2> 420509 INFO  (TEST-UnloadDistributedZkTest.test-seed#[AB86964C70C8349D]) [n:127.0.0.1:38816_    ] o.a.s.c.CorePropertiesLocator Found 1 core definitions
   [junit4]   2> 420510 INFO  (TEST-UnloadDistributedZkTest.test-seed#[AB86964C70C8349D]) [n:127.0.0.1:38816_    ] o.a.s.s.SolrDispatchFilter user.dir=/home/jenkins/workspace/Lucene-Solr-trunk-Linux/solr/build/solr-core/test/J2
   [junit4]   2> 420510 INFO  (TEST-UnloadDistributedZkTest.test-seed#[AB86964C70C8349D]) [n:127.0.0.1:38816_    ] o.a.s.s.SolrDispatchFilter SolrDispatchFilter.init() done
   [junit4]   2> 420510 INFO  (coreLoadExecutor-1982-thread-1-processing-n:127.0.0.1:38816_) [n:127.0.0.1:38816_ c:control_collection   x:collection1] o.a.s.c.ZkController publishing state=down
   [junit4]   2> 420510 INFO  (coreLoadExecutor-1982-thread-1-processing-n:127.0.0.1:38816_) [n:127.0.0.1:38816_ c:control_collection   x:collection1] o.a.s.c.ZkController numShards not found on descriptor - reading it from system property
   [junit4]   2> 420511 INFO  (OverseerStateUpdate-95460067792519172-127.0.0.1:38816_-n_0000000000) [n:127.0.0.1:38816_    ] o.a.s.c.Overseer processMessage: queueSize: 1, message = {
   [junit4]   2>   "core":"collection1",
   [junit4]   2>   "roles":null,
   [junit4]   2>   "base_url":"http://127.0.0.1:38816",
   [junit4]   2>   "node_name":"127.0.0.1:38816_",
   [junit4]   2>   "numShards":"1",
   [junit4]   2>   "state":"down",
   [junit4]   2>   "shard":null,
   [junit4]   2>   "collection":"control_collection",
   [junit4]   2>   "operation":"state"} current state version: 0
   [junit4]   2> 420511 INFO  (coreLoadExecutor-1982-thread-1-processing-n:127.0.0.1:38816_) [n:127.0.0.1:38816_ c:control_collection   x:collection1] o.a.s.c.ZkController look for our core node name
   [junit4]   2> 420511 INFO  (OverseerStateUpdate-95460067792519172-127.0.0.1:38816_-n_0000000000) [n:127.0.0.1:38816_    ] o.a.s.c.o.ReplicaMutator Update state numShards=1 message={
   [junit4]   2>   "core":"collection1",
   [junit4]   2>   "roles":null,
   [junit4]   2>   "base_url":"http://127.0.0.1:38816",
   [junit4]   2>   "node_name":"127.0.0.1:38816_",
   [junit4]   2>   "numShards":"1",
   [junit4]   2>   "state":"down",
   [junit4]   2>   "shard":null,
   [junit4]   2>   "collection":"control_collection",
   [junit4]   2>   "operation":"state"}
   [junit4]   2> 420511 INFO  (OverseerStateUpdate-95460067792519172-127.0.0.1:38816_-n_0000000000) [n:127.0.0.1:38816_    ] o.a.s.c.o.ClusterStateMutator building a new cName: control_collection
   [junit4]   2> 420511 INFO  (OverseerStateUpdate-95460067792519172-127.0.0.1:38816_-n_0000000000) [n:127.0.0.1:38816_    ] o.a.s.c.o.ReplicaMutator Assigning new node to shard shard=shard1
   [junit4]   2> 420512 INFO  (zkCallback-554-thread-1-processing-n:127.0.0.1:38816_) [n:127.0.0.1:38816_    ] o.a.s.c.c.ZkStateReader A cluster state change: [WatchedEvent state:SyncConnected type:NodeDataChanged path:/clusterstate.json], has occurred - updating... (live nodes size: [1])
   [junit4]   2> 421511 INFO  (coreLoadExecutor-1982-thread-1-processing-n:127.0.0.1:38816_) [n:127.0.0.1:38816_ c:control_collection   x:collection1] o.a.s.c.ZkController waiting to find shard id in clusterstate for collection1
   [junit4]   2> 421511 INFO  (coreLoadExecutor-1982-thread-1-processing-n:127.0.0.1:38816_) [n:127.0.0.1:38816_ c:control_collection   x:collection1] o.a.s.c.ZkController Check for collection zkNode:control_collection
   [junit4]   2> 421511 INFO  (coreLoadExecutor-1982-thread-1-processing-n:127.0.0.1:38816_) [n:127.0.0.1:38816_ c:control_collection   x:collection1] o.a.s.c.ZkController Collection zkNode exists
   [junit4]   2> 421511 INFO  (coreLoadExecutor-1982-thread-1-processing-n:127.0.0.1:38816_) [n:127.0.0.1:38816_ c:control_collection   x:collection1] o.a.s.c.c.ZkStateReader Load collection config from: [/collections/control_collection]
   [junit4]   2> 421512 INFO  (coreLoadExecutor-1982-thread-1-processing-n:127.0.0.1:38816_) [n:127.0.0.1:38816_ c:control_collection   x:collection1] o.a.s.c.c.ZkStateReader path=[/collections/control_collection] [configName]=[conf1] specified config exists in ZooKeeper
   [junit4]   2> 421512 INFO  (coreLoadExecutor-1982-thread-1-processing-n:127.0.0.1:38816_) [n:127.0.0.1:38816_ c:control_collection   x:collection1] o.a.s.c.SolrResourceLoader new SolrResourceLoader for directory: '/home/jenkins/workspace/Lucene-Solr-trunk-Linux/solr/build/solr-core/test/J2/temp/solr.cloud.UnloadDistributedZkTest_AB86964C70C8349D-001/control-001/cores/collection1'
   [junit4]   2> 421512 INFO  (coreLoadExecutor-1982-thread-1-processing-n:127.0.0.1:38816_) [n:127.0.0.1:38816_ c:control_collection   x:collection1] o.a.s.c.SolrResourceLoader JNDI not configured for solr (NoInitialContextEx)
   [junit4]   2> 421512 INFO  (coreLoadExecutor-1982-thread-1-processing-n:127.0.0.1:38816_) [n:127.0.0.1:38816_ c:control_collection   x:collection1] o.a.s.c.SolrResourceLoader solr home defaulted to 'solr/' (could not find system property or JNDI)
   [junit4]   2> 421513 INFO  (coreLoadExecutor-1982-thread-1-processing-n:127.0.0.1:38816_) [n:127.0.0.1:38816_ c:control_collection   x:collection1] o.a.s.c.Config loaded config solrconfig.xml with version 0 
   [junit4]   2> 421516 INFO  (coreLoadExecutor-1982-thread-1-processing-n:127.0.0.1:38816_) [n:127.0.0.1:38816_ c:control_collection   x:collection1] o.a.s.c.SolrConfig current version of requestparams : -1
   [junit4]   2> 421518 INFO  (coreLoadExecutor-1982-thread-1-processing-n:127.0.0.1:38816_) [n:127.0.0.1:38816_ c:control_collection   x:collection1] o.a.s.c.SolrConfig Using Lucene MatchVersion: 6.0.0
   [junit4]   2> 421524 INFO  (coreLoadExecutor-1982-thread-1-processing-n:127.0.0.1:38816_) [n:127.0.0.1:38816_ c:control_collection   x:collection1] o.a.s.c.SolrConfig Loaded SolrConfig: solrconfig.xml
   [junit4]   2> 421528 INFO  (coreLoadExecutor-1982-thread-1-processing-n:127.0.0.1:38816_) [n:127.0.0.1:38816_ c:control_collection   x:collection1] o.a.s.s.IndexSchema [collection1] Schema name=test
   [junit4]   2> 421592 INFO  (coreLoadExecutor-1982-thread-1-processing-n:127.0.0.1:38816_) [n:127.0.0.1:38816_ c:control_collection   x:collection1] o.a.s.s.OpenExchangeRatesOrgProvider Initialized with rates=open-exchange-rates.json, refreshInterval=1440.
   [junit4]   2> 421596 INFO  (coreLoadExecutor-1982-thread-1-processing-n:127.0.0.1:38816_) [n:127.0.0.1:38816_ c:control_collection   x:collection1] o.a.s.s.IndexSchema default search field in schema is text
   [junit4]   2> 421597 INFO  (coreLoadExecutor-1982-thread-1-processing-n:127.0.0.1:38816_) [n:127.0.0.1:38816_ c:control_collection   x:collection1] o.a.s.s.IndexSchema unique key field: id
   [junit4]   2> 421601 INFO  (coreLoadExecutor-1982-thread-1-processing-n:127.0.0.1:38816_) [n:127.0.0.1:38816_ c:control_collection   x:collection1] o.a.s.s.FileExchangeRateProvider Reloading exchange rates from file currency.xml
   [junit4]   2> 421602 INFO  (coreLoadExecutor-1982-thread-1-processing-n:127.0.0.1:38816_) [n:127.0.0.1:38816_ c:control_collection   x:collection1] o.a.s.s.FileExchangeRateProvider Reloading exchange rates from file currency.xml
   [junit4]   2> 421603 INFO  (coreLoadExecutor-1982-thread-1-processing-n:127.0.0.1:38816_) [n:127.0.0.1:38816_ c:control_collection   x:collection1] o.a.s.s.OpenExchangeRatesOrgProvider Reloading exchange rates from open-exchange-rates.json
   [junit4]   2> 421604 INFO  (coreLoadExecutor-1982-thread-1-processing-n:127.0.0.1:38816_) [n:127.0.0.1:38816_ c:control_collection   x:collection1] o.a.s.s.OpenExchangeRatesOrgProvider Reloading exchange rates from open-exchange-rates.json
   [junit4]   2> 421605 INFO  (coreLoadExecutor-1982-thread-1-processing-n:127.0.0.1:38816_) [n:127.0.0.1:38816_ c:control_collection   x:collection1] o.a.s.c.ConfigSetProperties Did not find ConfigSet properties, assuming default properties: Can't find resource 'configsetprops.json' in classpath or '/configs/conf1', cwd=/home/jenkins/workspace/Lucene-Solr-trunk-Linux/solr/build/solr-core/test/J2
   [junit4]   2> 421605 INFO  (coreLoadExecutor-1982-thread-1-processing-n:127.0.0.1:38816_) [n:127.0.0.1:38816_ c:control_collection   x:collection1] o.a.s.c.CoreContainer Creating SolrCore 'collection1' using configuration from collection control_collection
   [junit4]   2> 421605 INFO  (coreLoadExecutor-1982-thread-1-processing-n:127.0.0.1:38816_) [n:127.0.0.1:38816_ c:control_collection s:shard1 r:core_node1 x:collection1] o.a.s.c.SolrCore org.apache.solr.core.MockDirectoryFactory
   [junit4]   2> 421605 INFO  (coreLoadExecutor-1982-thread-1-processing-n:127.0.0.1:38816_) [n:127.0.0.1:38816_ c:control_collection s:shard1 r:core_node1 x:collection1] o.a.s.c.SolrCore [[collection1] ] Opening new SolrCore at [/home/jenkins/workspace/Lucene-Solr-trunk-Linux/solr/build/solr-core/test/J2/temp/solr.cloud.UnloadDistributedZkTest_AB86964C70C8349D-001/control-001/cores/collection1], dataDir=[/home/jenkins/workspace/Lucene-Solr-trunk-Linux/solr/build/solr-core/test/J2/../../../../../../../../../home/jenkins/workspace/Lucene-Solr-trunk-Linux/solr/build/solr-core/test/J2/temp/solr.cloud.UnloadDistributedZkTest_AB86964C70C8349D-001/control-001/cores/collection1/data/]
   [junit4]   2> 421605 INFO  (coreLoadExecutor-1982-thread-1-processing-n:127.0.0.1:38816_) [n:127.0.0.1:38816_ c:control_collection s:shard1 r:core_node1 x:collection1] o.a.s.c.JmxMonitoredMap JMX monitoring is enabled. Adding Solr mbeans to JMX Server: com.sun.jmx.mbeanserver.JmxMBeanServer@833222
   [junit4]   2> 421606 INFO  (coreLoadExecutor-1982-thread-1-processing-n:127.0.0.1:38816_) [n:127.0.0.1:38816_ c:control_collection s:shard1 r:core_node1 x:collection1] o.a.s.c.CachingDirectoryFactory return new directory for /home/jenkins/workspace/Lucene-Solr-trunk-Linux/solr/build/solr-core/test/J2/../../../../../../../../../home/jenkins/workspace/Lucene-Solr-trunk-Linux/solr/build/solr-core/test/J2/temp/solr.cloud.UnloadDistributedZkTest_AB86964C70C8349D-001/control-001/cores/collection1/data
   [junit4]   2> 421606 INFO  (coreLoadExecutor-1982-thread-1-processing-n:127.0.0.1:38816_) [n:127.0.0.1:38816_ c:control_collection s:shard1 r:core_node1 x:collection1] o.a.s.c.SolrCore New index directory detected: old=null new=/home/jenkins/workspace/Lucene-Solr-trunk-Linux/solr/build/solr-core/test/J2/../../../../../../../../../home/jenkins/workspace/Lucene-Solr-trunk-Linux/solr/build/solr-core/test/J2/temp/solr.cloud.UnloadDistributedZkTest_AB86964C70C8349D-001/control-001/cores/collection1/data/index/
   [junit4]   2> 421606 WARN  (coreLoadExecutor-1982-thread-1-processing-n:127.0.0.1:38816_) [n:127.0.0.1:38816_ c:control_collection s:shard1 r:core_node1 x:collection1] o.a.s.c.SolrCore [collection1] Solr index directory '/home/jenkins/workspace/Lucene-Solr-trunk-Linux/solr/build/solr-core/test/J2/../../../../../../../../../home/jenkins/workspace/Lucene-Solr-trunk-Linux/solr/build/solr-core/test/J2/temp/solr.cloud.UnloadDistributedZkTest_AB86964C70C8349D-001/control-001/cores/collection1/data/index' doesn't exist. Creating new index...
   [junit4]   2> 421606 INFO  (coreLoadExecutor-1982-thread-1-processing-n:127.0.0.1:38816_) [n:127.0.0.1:38816_ c:control_collection s:shard1 r:core_node1 x:collection1] o.a.s.c.CachingDirectoryFactory return new directory for /home/jenkins/workspace/Lucene-Solr-trunk-Linux/solr/build/solr-core/test/J2/../../../../../../../../../home/jenkins/workspace/Lucene-Solr-trunk-Linux/solr/build/solr-core/test/J2/temp/solr.cloud.UnloadDistributedZkTest_AB86964C70C8349D-001/control-001/cores/collection1/data/index
   [junit4]   2> 421606 INFO  (coreLoadExecutor-1982-thread-1-processing-n:127.0.0.1:38816_) [n:127.0.0.1:38816_ c:control_collection s:shard1 r:core_node1 x:collection1] o.a.s.u.RandomMergePolicy RandomMergePolicy wrapping class org.apache.lucene.index.LogByteSizeMergePolicy: [LogByteSizeMergePolicy: minMergeSize=1677721, mergeFactor=22, maxMergeSize=2147483648, maxMergeSizeForForcedMerge=9223372036854775807, calibrateSizeByDeletes=false, maxMergeDocs=2147483647, maxCFSSegmentSizeMB=8.796093022207999E12, noCFSRatio=0.0]
   [junit4]   2> 421606 INFO  (coreLoadExecutor-1982-thread-1-processing-n:127.0.0.1:38816_) [n:127.0.0.1:38816_ c:control_collection s:shard1 r:core_node1 x:collection1] o.a.s.c.SolrDeletionPolicy SolrDeletionPolicy.onCommit: commits: num=1
   [junit4]   2> 	commit{dir=MockDirectoryWrapper(RAMDirectory@135aedf lockFactory=org.apache.lucene.store.SingleInstanceLockFactory@e65e19),segFN=segments_1,generation=1}
   [junit4]   2> 421606 INFO  (coreLoadExecutor-1982-thread-1-processing-n:127.0.0.1:38816_) [n:127.0.0.1:38816_ c:control_collection s:shard1 r:core_node1 x:collection1] o.a.s.c.SolrDeletionPolicy newest commit generation = 1
   [junit4]   2> 421607 INFO  (OldIndexDirectoryCleanupThreadForCore-collection1) [n:127.0.0.1:38816_ c:control_collection s:shard1 r:core_node1 x:collection1] o.a.s.c.SolrCore Looking for old index directories to cleanup for core collection1 in /home/jenkins/workspace/Lucene-Solr-trunk-Linux/solr/build/solr-core/test/J2/../../../../../../../../../home/jenkins/workspace/Lucene-Solr-trunk-Linux/solr/build/solr-core/test/J2/temp/solr.cloud.UnloadDistributedZkTest_AB86964C70C8349D-001/control-001/cores/collection1/data/
   [junit4]   2> 421607 WARN  (OldIndexDirectoryCleanupThreadForCore-collection1) [n:127.0.0.1:38816_ c:control_collection s:shard1 r:core_node1 x:collection1] o.a.s.c.DirectoryFactory /home/jenkins/workspace/Lucene-Solr-trunk-Linux/solr/build/solr-core/test/J2/../../../../../../../../../home/jenkins/workspace/Lucene-Solr-trunk-Linux/solr/build/solr-core/test/J2/temp/solr.cloud.UnloadDistributedZkTest_AB86964C70C8349D-001/control-001/cores/collection1/data/ does not point to a valid data directory; skipping clean-up of old index directories.
   [junit4]   2> 421608 INFO  (coreLoadExecutor-1982-thread-1-processing-n:127.0.0.1:38816_) [n:127.0.0.1:38816_ c:control_collection s:shard1 r:core_node1 x:collection1] o.a.s.u.p.UpdateRequestProcessorChain creating updateRequestProcessorChain "nodistrib"
   [junit4]   2> 421609 INFO  (coreLoadExecutor-1982-thread-1-processing-n:127.0.0.1:38816_) [n:127.0.0.1:38816_ c:control_collection s:shard1 r:core_node1 x:collection1] o.a.s.u.p.UpdateRequestProcessorChain creating updateRequestProcessorChain "dedupe"
   [junit4]   2> 421609 INFO  (coreLoadExecutor-1982-thread-1-processing-n:127.0.0.1:38816_) [n:127.0.0.1:38816_ c:control_collection s:shard1 r:core_node1 x:collection1] o.a.s.u.p.UpdateRequestProcessorChain inserting DistributedUpdateProcessorFactory into updateRequestProcessorChain "dedupe"
   [junit4]   2> 421609 INFO  (coreLoadExecutor-1982-thread-1-processing-n:127.0.0.1:38816_) [n:127.0.0.1:38816_ c:control_collection s:shard1 r:core_node1 x:collection1] o.a.s.u.p.UpdateRequestProcessorChain creating updateRequestProcessorChain "stored_sig"
   [junit4]   2> 421609 INFO  (coreLoadExecutor-1982-thread-1-processing-n:127.0.0.1:38816_) [n:127.0.0.1:38816_ c:control_collection s:shard1 r:core_node1 x:collection1] o.a.s.u.p.UpdateRequestProcessorChain inserting DistributedUpdateProcessorFactory into updateRequestProcessorChain "stored_sig"
   [junit4]   2> 421609 INFO  (coreLoadExecutor-1982-thread-1-processing-n:127.0.0.1:38816_) [n:127.0.0.1:38816_ c:control_collection s:shard1 r:core_node1 x:collection1] o.a.s.u.p.UpdateRequestProcessorChain creating updateRequestProcessorChain "distrib-dup-test-chain-explicit"
   [junit4]   2> 421609 INFO  (coreLoadExecutor-1982-thread-1-processing-n:127.0.0.1:38816_) [n:127.0.0.1:38816_ c:control_collection s:shard1 r:core_node1 x:collection1] o.a.s.u.p.UpdateRequestProcessorChain creating updateRequestProcessorChain "distrib-dup-test-chain-implicit"
   [junit4]   2> 421609 INFO  (coreLoadExecutor-1982-thread-1-processing-n:127.0.0.1:38816_) [n:127.0.0.1:38816_ c:control_collection s:shard1 r:core_node1 x:collection1] o.a.s.u.p.UpdateRequestProcessorChain inserting DistributedUpdateProcessorFactory into updateRequestProcessorChain "distrib-dup-test-chain-implicit"
   [junit4]   2> 421610 INFO  (coreLoadExecutor-1982-thread-1-processing-n:127.0.0.1:38816_) [n:127.0.0.1:38816_ c:control_collection s:shard1 r:core_node1 x:collection1] o.a.s.c.SolrCore no updateRequestProcessorChain defined as default, creating implicit default
   [junit4]   2> 421610 WARN  (coreLoadExecutor-1982-thread-1-processing-n:127.0.0.1:38816_) [n:127.0.0.1:38816_ c:control_collection s:shard1 r:core_node1 x:collection1] o.a.s.c.RequestHandlers INVALID paramSet a in requestHandler {type = requestHandler,name = /dump,class = DumpRequestHandler,args = {defaults={a=A,b=B}}}
   [junit4]   2> 421611 INFO  (coreLoadExecutor-1982-thread-1-processing-n:127.0.0.1:38816_) [n:127.0.0.1:38816_ c:control_collection s:shard1 r:core_node1 x:collection1] o.a.s.h.l.XMLLoader xsltCacheLifetimeSeconds=60
   [junit4]   2> 421611 INFO  (coreLoadExecutor-1982-thread-1-processing-n:127.0.0.1:38816_) [n:127.0.0.1:38816_ c:control_collection s:shard1 r:core_node1 x:collection1] o.a.s.h.l.XMLLoader xsltCacheLifetimeSeconds=60
   [junit4]   2> 421612 INFO  (coreLoadExecutor-1982-thread-1-processing-n:127.0.0.1:38816_) [n:127.0.0.1:38816_ c:control_collection s:shard1 r:core_node1 x:collection1] o.a.s.h.l.XMLLoader xsltCacheLifetimeSeconds=60
   [junit4]   2> 421612 INFO  (coreLoadExecutor-1982-thread-1-processing-n:127.0.0.1:38816_) [n:127.0.0.1:38816_ c:control_collection s:shard1 r:core_node1 x:collection1] o.a.s.h.l.XMLLoader xsltCacheLifetimeSeconds=60
   [junit4]   2> 421614 INFO  (coreLoadExecutor-1982-thread-1-processing-n:127.0.0.1:38816_) [n:127.0.0.1:38816_ c:control_collection s:shard1 r:core_node1 x:collection1] o.a.s.c.RequestHandlers Registered paths: /admin/mbeans,standard,/dump,/update/csv,/sql,/update/json/docs,/admin/luke,/export,/admin/segments,/get,/admin/system,/replication,/admin/properties,/config,/stream,/schema,/admin/plugins,/admin/logging,/update/json,/admin/ping,/admin/threads,/update,/admin/file
   [junit4]   2> 421615 INFO  (coreLoadExecutor-1982-thread-1-processing-n:127.0.0.1:38816_) [n:127.0.0.1:38816_ c:control_collection s:shard1 r:core_node1 x:collection1] o.a.s.c.SolrCore Using default statsCache cache: org.apache.solr.search.stats.LocalStatsCache
   [junit4]   2> 421615 INFO  (coreLoadExecutor-1982-thread-1-processing-n:127.0.0.1:38816_) [n:127.0.0.1:38816_ c:control_collection s:shard1 r:core_node1 x:collection1] o.a.s.u.UpdateHandler Using UpdateLog implementation: org.apache.solr.update.UpdateLog
   [junit4]   2> 421615 INFO  (coreLoadExecutor-1982-thread-1-processing-n:127.0.0.1:38816_) [n:127.0.0.1:38816_ c:control_collection s:shard1 r:core_node1 x:collection1] o.a.s.u.UpdateLog Initializing UpdateLog: dataDir= defaultSyncLevel=FLUSH numRecordsToKeep=100 maxNumLogsToKeep=10 numVersionBuckets=65536
   [junit4]   2> 421615 INFO  (coreLoadExecutor-1982-thread-1-processing-n:127.0.0.1:38816_) [n:127.0.0.1:38816_ c:control_collection s:shard1 r:core_node1 x:collection1] o.a.s.u.CommitTracker Hard AutoCommit: disabled
   [junit4]   2> 421616 INFO  (coreLoadExecutor-1982-thread-1-processing-n:127.0.0.1:38816_) [n:127.0.0.1:38816_ c:control_collection s:shard1 r:core_node1 x:collection1] o.a.s.u.CommitTracker Soft AutoCommit: disabled
   [junit4]   2> 421616 INFO  (coreLoadExecutor-1982-thread-1-processing-n:127.0.0.1:38816_) [n:127.0.0.1:38816_ c:control_collection s:shard1 r:core_node1 x:collection1] o.a.s.u.RandomMergePolicy RandomMergePolicy wrapping class org.apache.lucene.index.TieredMergePolicy: [TieredMergePolicy: maxMergeAtOnce=15, maxMergeAtOnceExplicit=35, maxMergedSegmentMB=17.46875, floorSegmentMB=1.26953125, forceMergeDeletesPctAllowed=2.3242096459467234, segmentsPerTier=22.0, maxCFSSegmentSizeMB=8.796093022207999E12, noCFSRatio=1.0
   [junit4]   2> 421616 INFO  (coreLoadExecutor-1982-thread-1-processing-n:127.0.0.1:38816_) [n:127.0.0.1:38816_ c:control_collection s:shard1 r:core_node1 x:collection1] o.a.s.c.SolrDeletionPolicy SolrDeletionPolicy.onInit: commits: num=1
   [junit4]   2> 	commit{dir=MockDirectoryWrapper(RAMDirectory@135aedf lockFactory=org.apache.lucene.store.SingleInstanceLockFactory@e65e19),segFN=segments_1,generation=1}
   [junit4]   2> 421616 INFO  (coreLoadExecutor-1982-thread-1-processing-n:127.0.0.1:38816_) [n:127.0.0.1:38816_ c:control_collection s:shard1 r:core_node1 x:collection1] o.a.s.c.SolrDeletionPolicy newest commit generation = 1
   [junit4]   2> 421616 INFO  (coreLoadExecutor-1982-thread-1-processing-n:127.0.0.1:38816_) [n:127.0.0.1:38816_ c:control_collection s:shard1 r:core_node1 x:collection1] o.a.s.s.SolrIndexSearcher Opening [Searcher@a54998[collection1] main]
   [junit4]   2> 421616 INFO  (coreLoadExecutor-1982-thread-1-processing-n:127.0.0.1:38816_) [n:127.0.0.1:38816_ c:control_collection s:shard1 r:core_node1 x:collection1] o.a.s.c.c.ZkStateReader Load collection config from: [/collections/control_collection]
   [junit4]   2> 421617 INFO  (coreLoadExecutor-1982-thread-1-processing-n:127.0.0.1:38816_) [n:127.0.0.1:38816_ c:control_collection s:shard1 r:core_node1 x:collection1] o.a.s.c.c.ZkStateReader path=[/collections/control_collection] [configName]=[conf1] specified config exists in ZooKeeper
   [junit4]   2> 421617 INFO  (coreLoadExecutor-1982-thread-1-processing-n:127.0.0.1:38816_) [n:127.0.0.1:38816_ c:control_collection s:shard1 r:core_node1 x:collection1] o.a.s.r.ManagedResourceStorage Setting up ZooKeeper-based storage for the RestManager with znodeBase: /configs/conf1
   [junit4]   2> 421617 INFO  (coreLoadExecutor-1982-thread-1-processing-n:127.0.0.1:38816_) [n:127.0.0.1:38816_ c:control_collection s:shard1 r:core_node1 x:collection1] o.a.s.r.ManagedResourceStorage Configured ZooKeeperStorageIO with znodeBase: /configs/conf1
   [junit4]   2> 421617 INFO  (coreLoadExecutor-1982-thread-1-processing-n:127.0.0.1:38816_) [n:127.0.0.1:38816_ c:control_collection s:shard1 r:core_node1 x:collection1] o.a.s.r.RestManager Initializing RestManager with initArgs: {}
   [junit4]   2> 421618 INFO  (coreLoadExecutor-1982-thread-1-processing-n:127.0.0.1:38816_) [n:127.0.0.1:38816_ c:control_collection s:shard1 r:core_node1 x:collection1] o.a.s.r.ManagedResourceStorage Reading _rest_managed.json using ZooKeeperStorageIO:path=/configs/conf1
   [junit4]   2> 421618 INFO  (coreLoadExecutor-1982-thread-1-processing-n:127.0.0.1:38816_) [n:127.0.0.1:38816_ c:control_collection s:shard1 r:core_node1 x:collection1] o.a.s.r.ManagedResourceStorage No data found for znode /configs/conf1/_rest_managed.json
   [junit4]   2> 421618 INFO  (coreLoadExecutor-1982-thread-1-processing-n:127.0.0.1:38816_) [n:127.0.0.1:38816_ c:control_collection s:shard1 r:core_node1 x:collection1] o.a.s.r.ManagedResourceStorage Loaded null at path _rest_managed.json using ZooKeeperStorageIO:path=/configs/conf1
   [junit4]   2> 421618 INFO  (coreLoadExecutor-1982-thread-1-processing-n:127.0.0.1:38816_) [n:127.0.0.1:38816_ c:control_collection s:shard1 r:core_node1 x:collection1] o.a.s.r.RestManager Initializing 0 registered ManagedResources
   [junit4]   2> 421618 INFO  (coreLoadExecutor-1982-thread-1-processing-n:127.0.0.1:38816_) [n:127.0.0.1:38816_ c:control_collection s:shard1 r:core_node1 x:collection1] o.a.s.h.ReplicationHandler Commits will be reserved for  10000
   [junit4]   2> 421619 INFO  (searcherExecutor-1983-thread-1-processing-n:127.0.0.1:38816_ x:collection1 s:shard1 c:control_collection r:core_node1) [n:127.0.0.1:38816_ c:control_collection s:shard1 r:core_node1 x:collection1] o.a.s.c.SolrCore [collection1] Registered new searcher Searcher@a54998[collection1] main{ExitableDirectoryReader(UninvertingDirectoryReader())}
   [junit4]   2> 421619 INFO  (coreLoadExecutor-1982-thread-1-processing-n:127.0.0.1:38816_) [n:127.0.0.1:38816_ c:control_collection s:shard1 r:core_node1 x:collection1] o.a.s.u.UpdateLog Looking up max value of version field to seed version buckets
   [junit4]   2> 421619 INFO  (coreLoadExecutor-1982-thread-1-processing-n:127.0.0.1:38816_) [n:127.0.0.1:38816_ c:control_collection s:shard1 r:core_node1 x:collection1] o.a.s.u.VersionInfo Refreshing highest value of _version_ for 65536 version buckets from index
   [junit4]   2> 421619 INFO  (coreLoadExecutor-1982-thread-1-processing-n:127.0.0.1:38816_) [n:127.0.0.1:38816_ c:control_collection s:shard1 r:core_node1 x:collection1] o.a.s.u.VersionInfo No terms found for _version_, cannot seed version bucket highest value from index
   [junit4]   2> 421619 INFO  (coreLoadExecutor-1982-thread-1-processing-n:127.0.0.1:38816_) [n:127.0.0.1:38816_ c:control_collection s:shard1 r:core_node1 x:collection1] o.a.s.u.UpdateLog Could not find max version in index or recent updates, using new clock 1527361086075961344
   [junit4]   2> 421621 INFO  (coreLoadExecutor-1982-thread-1-processing-n:127.0.0.1:38816_) [n:127.0.0.1:38816_ c:control_collection s:shard1 r:core_node1 x:collection1] o.a.s.u.UpdateLog Took 2.0ms to seed version buckets with highest version 1527361086075961344
   [junit4]   2> 421621 INFO  (coreLoadExecutor-1982-thread-1-processing-n:127.0.0.1:38816_) [n:127.0.0.1:38816_ c:control_collection s:shard1 r:core_node1 x:collection1] o.a.s.c.ZkController watch zkdir /configs/conf1
   [junit4]   2> 421622 INFO  (coreLoadExecutor-1982-thread-1-processing-n:127.0.0.1:38816_) [n:127.0.0.1:38816_ c:control_collection s:shard1 r:core_node1 x:collection1] o.a.s.c.CoreContainer registering core: collection1
   [junit4]   2> 421622 INFO  (coreZkRegister-1976-thread-1-processing-n:127.0.0.1:38816_ x:collection1 s:shard1 c:control_collection r:core_node1) [n:127.0.0.1:38816_ c:control_collection s:shard1 r:core_node1 x:collection1] o.a.s.c.ZkController Register replica - core:collection1 address:http://127.0.0.1:38816 collection:control_collection shard:shard1
   [junit4]   2> 421622 INFO  (coreZkRegister-1976-thread-1-processing-n:127.0.0.1:38816_ x:collection1 s:shard1 c:control_collection r:core_node1) [n:127.0.0.1:38816_ c:control_collection s:shard1 r:core_node1 x:collection1] o.a.s.c.c.SolrZkClient makePath: /collections/control_collection/leader_elect/shard1/election
   [junit4]   2> 421624 INFO  (coreZkRegister-1976-thread-1-processing-n:127.0.0.1:38816_ x:collection1 s:shard1 c:control_collection r:core_node1) [n:127.0.0.1:38816_ c:control_collection s:shard1 r:core_node1 x:collection1] o.a.s.c.LeaderElector Joined leadership election with path: /collections/control_collection/leader_elect/shard1/election/95460067792519172-core_node1-n_0000000000
   [junit4]   2> 421624 INFO  (coreZkRegister-1976-thread-1-processing-n:127.0.0.1:38816_ x:collection1 s:shard1 c:control_collection r:core_node1) [n:127.0.0.1:38816_ c:control_collection s:shard1 r:core_node1 x:collection1] o.a.s.c.ShardLeaderElectionContext Running the leader process for shard=shard1 and weAreReplacement=false and leaderVoteWait=180000
   [junit4]   2> 421625 INFO  (coreZkRegister-1976-thread-1-processing-n:127.0.0.1:38816_ x:collection1 s:shard1 c:control_collection r:core_node1) [n:127.0.0.1:38816_ c:control_collection s:shard1 r:core_node1 x:collection1] o.a.s.c.ShardLeaderElectionContext Enough replicas found to continue.
   [junit4]   2> 421625 INFO  (coreZkRegister-1976-thread-1-processing-n:127.0.0.1:38816_ x:collection1 s:shard1 c:control_collection r:core_node1) [n:127.0.0.1:38816_ c:control_collection s:shard1 r:core_node1 x:collection1] o.a.s.c.ShardLeaderElectionContext I may be the new leader - try and sync
   [junit4]   2> 421625 INFO  (coreZkRegister-1976-thread-1-processing-n:127.0.0.1:38816_ x:collection1 s:shard1 c:control_collection r:core_node1) [n:127.0.0.1:38816_ c:control_collection s:shard1 r:core_node1 x:collection1] o.a.s.c.SyncStrategy Sync replicas to http://127.0.0.1:38816/collection1/
   [junit4]   2> 421625 INFO  (coreZkRegister-1976-thread-1-processing-n:127.0.0.1:38816_ x:collection1 s:shard1 c:control_collection r:core_node1) [n:127.0.0.1:38816_ c:control_collection s:shard1 r:core_node1 x:collection1] o.a.s.c.SyncStrategy Sync Success - now sync replicas to me
   [junit4]   2> 421625 INFO  (coreZkRegister-1976-thread-1-processing-n:127.0.0.1:38816_ x:collection1 s:shard1 c:control_collection r:core_node1) [n:127.0.0.1:38816_ c:control_collection s:shard1 r:core_node1 x:collection1] o.a.s.c.SyncStrategy http://127.0.0.1:38816/collection1/ has no replicas
   [junit4]   2> 421625 INFO  (OverseerStateUpdate-95460067792519172-127.0.0.1:38816_-n_0000000000) [n:127.0.0.1:38816_    ] o.a.s.c.Overseer processMessage: queueSize: 1, message = {
   [junit4]   2>   "operation":"leader",
   [junit4]   2>   "shard":"shard1",
   [junit4]   2>   "collection":"control_collection"} current state version: 1
   [junit4]   2> 421625 INFO  (coreZkRegister-1976-thread-1-processing-n:127.0.0.1:38816_ x:collection1 s:shard1 c:control_collection r:core_node1) [n:127.0.0.1:38816_ c:control_collection s:shard1 r:core_node1 x:collection1] o.a.s.c.c.SolrZkClient makePath: /collections/control_collection/leaders/shard1
   [junit4]   2> 421626 INFO  (coreZkRegister-1976-thread-1-processing-n:127.0.0.1:38816_ x:collection1 s:shard1 c:control_collection r:core_node1) [n:127.0.0.1:38816_ c:control_collection s:shard1 r:core_node1 x:collection1] o.a.s.c.ShardLeaderElectionContextBase Creating leader registration node /collections/control_collection/leaders/shard1/leader after winning as /collections/control_collection/leader_elect/shard1/election/95460067792519172-core_node1-n_0000000000
   [junit4]   2> 421627 INFO  (coreZkRegister-1976-thread-1-processing-n:127.0.0.1:38816_ x:collection1 s:shard1 c:control_collection r:core_node1) [n:127.0.0.1:38816_ c:control_collection s:shard1 r:core_node1 x:collection1] o.a.s.c.ShardLeaderElectionContext I am the new leader: http://127.0.0.1:38816/collection1/ shard1
   [junit4]   2> 421628 INFO  (OverseerStateUpdate-95460067792519172-127.0.0.1:38816_-n_0000000000) [n:127.0.0.1:38816_    ] o.a.s.c.Overseer processMessage: queueSize: 1, message = {
   [junit4]   2>   "operation":"leader",
   [junit4]   2>   "shard":"shard1",
   [junit4]   2>   "collection":"control_collection",
   [junit4]   2>   "base_url":"http://127.0.0.1:38816",
   [junit4]   2>   "core":"collection1",
   [junit4]   2>   "state":"active"} current state version: 1
   [junit4]   2> 421729 INFO  (zkCallback-554-thread-1-processing-n:127.0.0.1:38816_) [n:127.0.0.1:38816_    ] o.a.s.c.c.ZkStateReader A cluster state change: [WatchedEvent state:SyncConnected type:NodeDataChanged path:/clusterstate.json], has occurred - updating... (live nodes size: [1])
   [junit4]   2> 421778 INFO  (coreZkRegister-1976-thread-1-processing-n:127.0.0.1:38816_ x:collection1 s:shard1 c:control_collection r:core_node1) [n:127.0.0.1:38816_ c:control_collection s:shard1 r:core_node1 x:collection1] o.a.s.c.ZkController We are http://127.0.0.1:38816/collection1/ and leader is http://127.0.0.1:38816/collection1/
   [junit4]   2> 421778 INFO  (coreZkRegister-1976-thread-1-processing-n:127.0.0.1:38816_ x:collection1 s:shard1 c:control_collection r:core_node1) [n:127.0.0.1:38816_ c:control_collection s:shard1 r:core_node1 x:collection1] o.a.s.c.ZkController No LogReplay needed for core=collection1 baseURL=http://127.0.0.1:38816
   [junit4]   2> 421778 INFO  (coreZkRegister-1976-thread-1-processing-n:127.0.0.1:38816_ x:collection1 s:shard1 c:control_collection r:core_node1) [n:127.0.0.1:38816_ c:control_collection s:shard1 r:core_node1 x:collection1] o.a.s.c.ZkController I am the leader, no recovery necessary
   [junit4]   2> 421778 INFO  (coreZkRegister-1976-thread-1-processing-n:127.0.0.1:38816_ x:collection1 s:shard1 c:control_collection r:core_node1) [n:127.0.0.1:38816_ c:control_collection s:shard1 r:core_node1 x:collection1] o.a.s.c.ZkController publishing state=active
   [junit4]   2> 421778 INFO  (coreZkRegister-1976-thread-1-processing-n:127.0.0.1:38816_ x:collection1 s:shard1 c:control_collection r:core_node1) [n:127.0.0.1:38816_ c:control_collection s:shard1 r:core_node1 x:collection1] o.a.s.c.ZkController numShards not found on descriptor - reading it from system property
   [junit4]   2> 421779 INFO  (OverseerStateUpdate-95460067792519172-127.0.0.1:38816_-n_0000000000) [n:127.0.0.1:38816_    ] o.a.s.c.Overseer processMessage: queueSize: 1, message = {
   [junit4]   2>   "core":"collection1",
   [junit4]   2>   "core_node_name":"core_node1",
   [junit4]   2>   "roles":null,
   [junit4]   2>   "base_url":"http://127.0.0.1:38816",
   [junit4]   2>   "node_name":"127.0.0.1:38816_",
   [junit4]   2>   "numShards":"1",
   [junit4]   2>   "state":"active",
   [junit4]   2>   "shard":"shard1",
   [junit4]   2>   "collection":"control_collection",
   [junit4]   2>   "operation":"state"} current state version: 2
   [junit4]   2> 421780 INFO  (coreZkRegister-1976-thread-1-processing-n:127.0.0.1:38816_ x:collection1 s:shard1 c:control_collection r:core_node1) [n:127.0.0.1:38816_ c:control_collection s:shard1 r:core_node1 x:collection1] o.a.s.c.c.ZkStateReader Updated live nodes from ZooKeeper... (1) -> (1)
   [junit4]   2> 421780 INFO  (OverseerStateUpdate-95460067792519172-127.0.0.1:38816_-n_0000000000) [n:127.0.0.1:38816_    ] o.a.s.c.o.ReplicaMutator Update state numShards=1 message={
   [junit4]   2>   "core":"collection1",
   [junit4]   2>   "core_node_name":"core_node1",
   [junit4]   2>   "roles":null,
   [junit4]   2>   "base_url":"http://127.0.0.1:38816",
   [junit4]   2>   "node_name":"127.0.0.1:38816_",
   [junit4]   2>   "numShards":"1",
   [junit4]   2>   "state":"active",
   [junit4]   2>   "shard":"shard1",
   [junit4]   2>   "collection":"control_collection",
   [junit4]   2>   "operation":"state"}
   [junit4]   2> 421881 INFO  (zkCallback-554-thread-1-processing-n:127.0.0.1:38816_) [n:127.0.0.1:38816_    ] o.a.s.c.c.ZkStateReader A cluster state change: [WatchedEvent state:SyncConnected type:NodeDataChanged path:/clusterstate.json], has occurred - updating... (live nodes size: [1])
   [junit4]   2> 422011 INFO  (TEST-UnloadDistributedZkTest.test-seed#[AB86964C70C8349D]) [    ] o.a.s.c.c.SolrZkClient Using default ZkCredentialsProvider
   [junit4]   2> 422012 INFO  (TEST-UnloadDistributedZkTest.test-seed#[AB86964C70C8349D]) [    ] o.a.s.c.c.ConnectionManager Waiting for client to connect to ZooKeeper
   [junit4]   2> 422012 INFO  (zkCallback-556-thread-1) [    ] o.a.s.c.c.ConnectionManager Watcher org.apache.solr.common.cloud.ConnectionManager@742e4d name:ZooKeeperConnection Watcher:127.0.0.1:37980/solr got event WatchedEvent state:SyncConnected type:None path:null path:null type:None
   [junit4]   2> 422012 INFO  (TEST-UnloadDistributedZkTest.test-seed#[AB86964C70C8349D]) [    ] o.a.s.c.c.ConnectionManager Client is connected to ZooKeeper
   [junit4]   2> 422013 INFO  (TEST-UnloadDistributedZkTest.test-seed#[AB86964C70C8349D]) [    ] o.a.s.c.c.SolrZkClient Using default ZkACLProvider
   [junit4]   2> 422013 INFO  (TEST-UnloadDistributedZkTest.test-seed#[AB86964C70C8349D]) [    ] o.a.s.c.c.ZkStateReader Updating cluster state from ZooKeeper... 
   [junit4]   2> 422014 INFO  (TEST-UnloadDistributedZkTest.test-seed#[AB86964C70C8349D]) [    ] o.a.s.c.c.ZkStateReader Updated live nodes from ZooKeeper... (0) -> (1)
   [junit4]   2> 422014 INFO  (TEST-UnloadDistributedZkTest.test-seed#[AB86964C70C8349D]) [    ] o.a.s.c.ChaosMonkey monkey: init - expire sessions:false cause connection loss:false
   [junit4]   2> 422014 INFO  (TEST-UnloadDistributedZkTest.test-seed#[AB86964C70C8349D]) [    ] o.a.s.c.AbstractFullDistribZkTestBase Creating collection1 with stateFormat=2
   [junit4]   2> 422014 INFO  (TEST-UnloadDistributedZkTest.test-seed#[AB86964C70C8349D]) [    ] o.a.s.c.c.SolrZkClient Using default ZkCredentialsProvider
   [junit4]   2> 422014 INFO  (TEST-UnloadDistributedZkTest.test-seed#[AB86964C70C8349D]) [    ] o.a.s.c.c.ConnectionManager Waiting for client to connect to ZooKeeper
   [junit4]   2> 422015 INFO  (zkCallback-557-thread-1) [    ] o.a.s.c.c.ConnectionManager Watcher org.apache.solr.common.cloud.ConnectionManager@186148b name:ZooKeeperConnection Watcher:127.0.0.1:37980/solr got event WatchedEvent state:SyncConnected type:None path:null path:null type:None
   [junit4]   2> 422015 INFO  (TEST-UnloadDistributedZkTest.test-seed#[AB86964C70C8349D]) [    ] o.a.s.c.c.ConnectionManager Client is connected to ZooKeeper
   [junit4]   2> 422015 INFO  (TEST-UnloadDistributedZkTest.test-seed#[AB86964C70C8349D]) [    ] o.a.s.c.c.SolrZkClient Using default ZkACLProvider
   [junit4]   2> 422017 INFO  (OverseerStateUpdate-95460067792519172-127.0.0.1:38816_-n_0000000000) [n:127.0.0.1:38816_    ] o.a.s.c.Overseer processMessage: queueSize: 1, message = {
   [junit4]   2>   "operation":"create",
   [junit4]   2>   "name":"collection1",
   [junit4]   2>   "numShards":"2",
   [junit4]   2>   "stateFormat":"2"} current state version: 3
   [junit4]   2> 422017 INFO  (OverseerStateUpdate-95460067792519172-127.0.0.1:38816_-n_0000000000) [n:127.0.0.1:38816_    ] o.a.s.c.o.ClusterStateMutator building a new cName: collection1
   [junit4]   2> 422076 INFO  (TEST-UnloadDistributedZkTest.test-seed#[AB86964C70C8349D]) [    ] o.a.s.SolrTestCaseJ4 Writing core.properties file to /home/jenkins/workspace/Lucene-Solr-trunk-Linux/solr/build/solr-core/test/J2/temp/solr.cloud.UnloadDistributedZkTest_AB86964C70C8349D-001/shard-1-001/cores/collection1
   [junit4]   2> 422077 INFO  (TEST-UnloadDistributedZkTest.test-seed#[AB86964C70C8349D]) [    ] o.a.s.c.AbstractFullDistribZkTestBase create jetty 1 in directory /home/jenkins/workspace/Lucene-Solr-trunk-Linux/solr/build/solr-core/test/J2/temp/solr.cloud.UnloadDistributedZkTest_AB86964C70C8349D-001/shard-1-001
   [junit4]   2> 422078 INFO  (TEST-UnloadDistributedZkTest.test-seed#[AB86964C70C8349D]) [    ] o.e.j.s.Server jetty-9.3.6.v20151106
   [junit4]   2> 422078 INFO  (TEST-UnloadDistributedZkTest.test-seed#[AB86964C70C8349D]) [    ] o.e.j.s.h.ContextHandler Started o.e.j.s.ServletContextHandler@1a50c96{/,null,AVAILABLE}
   [junit4]   2> 422079 INFO  (TEST-UnloadDistributedZkTest.test-seed#[AB86964C70C8349D]) [    ] o.e.j.s.ServerConnector Started ServerConnector@3bc8f0{HTTP/1.1,[http/1.1]}{127.0.0.1:43901}
   [junit4]   2> 422079 INFO  (TEST-UnloadDistributedZkTest.test-seed#[AB86964C70C8349D]) [    ] o.e.j.s.Server Started @423639ms
   [junit4]   2> 422079 INFO  (TEST-UnloadDistributedZkTest.test-seed#[AB86964C70C8349D]) [    ] o.a.s.c.s.e.JettySolrRunner Jetty properties: {solr.data.dir=/home/jenkins/workspace/Lucene-Solr-trunk-Linux/solr/build/solr-core/test/J2/temp/solr.cloud.UnloadDistributedZkTest_AB86964C70C8349D-001/tempDir-001/jetty1, solrconfig=solrconfig.xml, hostContext=/, hostPort=43901, coreRootDirectory=/home/jenkins/workspace/Lucene-Solr-trunk-Linux/solr/build/solr-core/test/J2/temp/solr.cloud.UnloadDistributedZkTest_AB86964C70C8349D-001/shard-1-001/cores}
   [junit4]   2> 422079 INFO  (TEST-UnloadDistributedZkTest.test-seed#[AB86964C70C8349D]) [    ] o.a.s.s.SolrDispatchFilter SolrDispatchFilter.init(): sun.misc.Launcher$AppClassLoader@1d16e93
   [junit4]   2> 422079 INFO  (TEST-UnloadDistributedZkTest.test-seed#[AB86964C70C8349D]) [    ] o.a.s.c.SolrResourceLoader new SolrResourceLoader for directory: '/home/jenkins/workspace/Lucene-Solr-trunk-Linux/solr/build/solr-core/test/J2/temp/solr.cloud.UnloadDistributedZkTest_AB86964C70C8349D-001/shard-1-001'
   [junit4]   2> 422079 INFO  (TEST-UnloadDistributedZkTest.test-seed#[AB86964C70C8349D]) [    ] o.a.s.c.SolrResourceLoader JNDI not configured for solr (NoInitialContextEx)
   [junit4]   2> 422080 INFO  (TEST-UnloadDistributedZkTest.test-seed#[AB86964C70C8349D]) [    ] o.a.s.c.SolrResourceLoader solr home defaulted to 'solr/' (could not find system property or JNDI)
   [junit4]   2> 422080 INFO  (TEST-UnloadDistributedZkTest.test-seed#[AB86964C70C8349D]) [    ] o.a.s.c.c.SolrZkClient Using default ZkCredentialsProvider
   [junit4]   2> 422080 INFO  (TEST-UnloadDistributedZkTest.test-seed#[AB86964C70C8349D]) [    ] o.a.s.c.c.ConnectionManager Waiting for client to connect to ZooKeeper
   [junit4]   2> 422081 INFO  (zkCallback-558-thread-1) [    ] o.a.s.c.c.ConnectionManager Watcher org.apache.solr.common.cloud.ConnectionManager@15a06f7 name:ZooKeeperConnection Watcher:127.0.0.1:37980/solr got event WatchedEvent state:SyncConnected type:None path:null path:null type:None
   [junit4]   2> 422081 INFO  (TEST-UnloadDistributedZkTest.test-seed#[AB86964C70C8349D]) [    ] o.a.s.c.c.ConnectionManager Client is connected to ZooKeeper
   [junit4]   2> 422081 INFO  (TEST-UnloadDistributedZkTest.test-seed#[AB86964C70C8349D]) [    ] o.a.s.c.c.SolrZkClient Using default ZkACLProvider
   [junit4]   2> 422082 INFO  (TEST-UnloadDistributedZkTest.test-seed#[AB86964C70C8349D]) [    ] o.a.s.s.SolrDispatchFilter Loading solr.xml from SolrHome (not found in ZooKeeper)
   [junit4]   2> 422082 INFO  (TEST-UnloadDistributedZkTest.test-seed#[AB86964C70C8349D]) [    ] o.a.s.c.SolrXmlConfig Loading container configuration from /home/jenkins/workspace/Lucene-Solr-trunk-Linux/solr/build/solr-core/test/J2/temp/solr.cloud.UnloadDistributedZkTest_AB86964C70C8349D-001/shard-1-001/solr.xml
   [junit4]   2> 422085 INFO  (TEST-UnloadDistributedZkTest.test-seed#[AB86964C70C8349D]) [    ] o.a.s.c.CorePropertiesLocator Config-defined core root directory: /home/jenkins/workspace/Lucene-Solr-trunk-Linux/solr/build/solr-core/test/J2/temp/solr.cloud.UnloadDistributedZkTest_AB86964C70C8349D-001/shard-1-001/cores
   [junit4]   2> 422085 INFO  (TEST-UnloadDistributedZkTest.test-seed#[AB86964C70C8349D]) [    ] o.a.s.c.CoreContainer New CoreContainer 11161501
   [junit4]   2> 422085 INFO  (TEST-UnloadDistributedZkTest.test-seed#[AB86964C70C8349D]) [    ] o.a.s.c.CoreContainer Loading cores into CoreContainer [instanceDir=/home/jenkins/workspace/Lucene-Solr-trunk-Linux/solr/build/solr-core/test/J2/temp/solr.cloud.UnloadDistributedZkTest_AB86964C70C8349D-001/shard-1-001]
   [junit4]   2> 422085 WARN  (TEST-UnloadDistributedZkTest.test-seed#[AB86964C70C8349D]) [    ] o.a.s.c.CoreContainer Couldn't add files from /home/jenkins/workspace/Lucene-Solr-trunk-Linux/solr/build/solr-core/test/J2/temp/solr.cloud.UnloadDistributedZkTest_AB86964C70C8349D-001/shard-1-001/lib to classpath: /home/jenkins/workspace/Lucene-Solr-trunk-Linux/solr/build/solr-core/test/J2/temp/solr.cloud.UnloadDistributedZkTest_AB86964C70C8349D-001/shard-1-001/lib
   [junit4]   2> 422085 INFO  (TEST-UnloadDistributedZkTest.test-seed#[AB86964C70C8349D]) [    ] o.a.s.h.c.HttpShardHandlerFactory created with socketTimeout : 90000,urlScheme : ,connTimeout : 15000,maxConnectionsPerHost : 20,maxConnections : 10000,corePoolSize : 0,maximumPoolSize : 2147483647,maxThreadIdleTime : 5,sizeOfQueue : -1,fairnessPolicy : false,useRetries : false,
   [junit4]   2> 422086 INFO  (TEST-UnloadDistributedZkTest.test-seed#[AB86964C70C8349D]) [    ] o.a.s.u.UpdateShardHandler Creating UpdateShardHandler HTTP client with params: socketTimeout=340000&connTimeout=45000&retry=true
   [junit4]   2> 422087 INFO  (TEST-UnloadDistributedZkTest.test-seed#[AB86964C70C8349D]) [    ] o.a.s.l.LogWatcher SLF4J impl is org.slf4j.impl.Log4jLoggerFactory
   [junit4]   2> 422087 INFO  (TEST-UnloadDistributedZkTest.test-seed#[AB86964C70C8349D]) [    ] o.a.s.l.LogWatcher Registering Log Listener [Log4j (org.slf4j.impl.Log4jLoggerFactory)]
   [junit4]   2> 422087 INFO  (TEST-UnloadDistributedZkTest.test-seed#[AB86964C70C8349D]) [    ] o.a.s.c.ZkContainer Zookeeper client=127.0.0.1:37980/solr
   [junit4]   2> 422087 INFO  (TEST-UnloadDistributedZkTest.test-seed#[AB86964C70C8349D]) [    ] o.a.s.c.ZkController zkHost includes chroot
   [junit4]   2> 422087 INFO  (TEST-UnloadDistributedZkTest.test-seed#[AB86964C70C8349D]) [    ] o.a.s.c.c.SolrZkClient Using default ZkCredentialsProvider
   [junit4]   2> 422087 INFO  (TEST-UnloadDistributedZkTest.test-seed#[AB86964C70C8349D]) [    ] o.a.s.c.c.ConnectionManager Waiting for client to connect to ZooKeeper
   [junit4]   2> 422088 INFO  (zkCallback-561-thread-1) [    ] o.a.s.c.c.ConnectionManager Watcher org.apache.solr.common.cloud.ConnectionManager@b0edc3 name:ZooKeeperConnection Watcher:127.0.0.1:37980 got event WatchedEvent state:SyncConnected type:None path:null path:null type:None
   [junit4]   2> 422088 INFO  (TEST-UnloadDistributedZkTest.test-seed#[AB86964C70C8349D]) [    ] o.a.s.c.c.ConnectionManager Client is connected to ZooKeeper
   [junit4]   2> 422088 INFO  (TEST-UnloadDistributedZkTest.test-seed#[AB86964C70C8349D]) [    ] o.a.s.c.c.SolrZkClient Using default ZkACLProvider
   [junit4]   2> 422089 INFO  (TEST-UnloadDistributedZkTest.test-seed#[AB86964C70C8349D]) [n:127.0.0.1:43901_    ] o.a.s.c.c.ConnectionManager Waiting for client to connect to ZooKeeper
   [junit4]   2> 422090 INFO  (zkCallback-562-thread-1-processing-n:127.0.0.1:43901_) [n:127.0.0.1:43901_    ] o.a.s.c.c.ConnectionManager Watcher org.apache.solr.common.cloud.ConnectionManager@1dc70f9 name:ZooKeeperConnection Watcher:127.0.0.1:37980/solr got event WatchedEvent state:SyncConnected type:None path:null path:null type:None
   [junit4]   2> 422090 INFO  (TEST-UnloadDistributedZkTest.test-seed#[AB86964C70C8349D]) [n:127.0.0.1:43901_    ] o.a.s.c.c.ConnectionManager Client is connected to ZooKeeper
   [junit4]   2> 422092 INFO  (TEST-UnloadDistributedZkTest.test-seed#[AB86964C70C8349D]) [n:127.0.0.1:43901_    ] o.a.s.c.Overseer Overseer (id=null) closing
   [junit4]   2> 422093 INFO  (TEST-UnloadDistributedZkTest.test-seed#[AB86964C70C8349D]) [n:127.0.0.1:43901_    ] o.a.s.c.LeaderElector Joined leadership election with path: /overseer_elect/election/95460067792519177-127.0.0.1:43901_-n_0000000001
   [junit4]   2> 422093 INFO  (TEST-UnloadDistributedZkTest.test-seed#[AB86964C70C8349D]) [n:127.0.0.1:43901_    ] o.a.s.c.LeaderElector Watching path /overseer_elect/election/95460067792519172-127.0.0.1:38816_-n_0000000000 to know if I could be the leader
   [junit4]   2> 422093 INFO  (TEST-UnloadDistributedZkTest.test-seed#[AB86964C70C8349D]) [n:127.0.0.1:43901_    ] o.a.s.c.c.ZkStateReader Updating cluster state from ZooKeeper... 
   [junit4]   2> 422094 INFO  (TEST-UnloadDistributedZkTest.test-seed#[AB86964C70C8349D]) [n:127.0.0.1:43901_    ] o.a.s.c.c.ZkStateReader Updated live nodes from ZooKeeper... (0) -> (1)
   [junit4]   2> 422094 INFO  (TEST-UnloadDistributedZkTest.test-seed#[AB86964C70C8349D]) [n:127.0.0.1:43901_    ] o.a.s.c.c.ZkStateReader Updating cluster state from ZooKeeper... 
   [junit4]   2> 422095 INFO  (TEST-UnloadDistributedZkTest.test-seed#[AB86964C70C8349D]) [n:127.0.0.1:43901_    ] o.a.s.c.c.ZkStateReader Updated live nodes from ZooKeeper... (1) -> (1)
   [junit4]   2> 422095 INFO  (TEST-UnloadDistributedZkTest.test-seed#[AB86964C70C8349D]) [n:127.0.0.1:43901_    ] o.a.s.c.ZkController Publish node=127.0.0.1:43901_ as DOWN
   [junit4]   2> 422096 INFO  (OverseerStateUpdate-95460067792519172-127.0.0.1:38816_-n_0000000000) [n:127.0.0.1:38816_    ] o.a.s.c.Overseer processMessage: queueSize: 1, message = {
   [junit4]   2>   "operation":"downnode",
   [junit4]   2>   "node_name":"127.0.0.1:43901_"} current state version: 3
   [junit4]   2> 422096 INFO  (OverseerStateUpdate-95460067792519172-127.0.0.1:38816_-n_0000000000) [n:127.0.0.1:38816_    ] o.a.s.c.o.NodeMutator DownNode state invoked for node: 127.0.0.1:43901_
   [junit4]   2> 422096 INFO  (OverseerStateUpdate-95460067792519172-127.0.0.1:38816_-n_0000000000) [n:127.0.0.1:38816_    ] o.a.s.c.o.ZkStateWriter going to create_collection /collections/collection1/state.json
   [junit4]   2> 422199 INFO  (zkCallback-556-thread-1) [    ] o.a.s.c.c.ZkStateReader A cluster state change: [WatchedEvent state:SyncConnected type:NodeDataChanged path:/clusterstate.json], has occurred - updating... (live nodes size: [1])
   [junit4]   2> 422199 INFO  (zkCallback-554-thread-1-processing-n:127.0.0.1:38816_) [n:127.0.0.1:38816_    ] o.a.s.c.c.ZkStateReader A cluster state change: [WatchedEvent state:SyncConnected type:NodeDataChanged path:/clusterstate.json], has occurred - updating... (live nodes size: [1])
   [junit4]   2> 422199 INFO  (zkCallback-562-thread-1-processing-n:127.0.0.1:43901_) [n:127.0.0.1:43901_    ] o.a.s.c.c.ZkStateReader A cluster state change: [WatchedEvent state:SyncConnected type:NodeDataChanged path:/clusterstate.json], has occurred - updating... (live nodes size: [1])
   [junit4]   2> 422199 INFO  (zkCallback-562-thread-2-processing-n:127.0.0.1:43901_) [n:127.0.0.1:43901_    ] o.a.s.c.c.ZkStateReader A cluster state change: [WatchedEvent state:SyncConnected type:NodeDataChanged path:/clusterstate.json], has occurred - updating... (live nodes size: [1])
   [junit4]   2> 423096 INFO  (TEST-UnloadDistributedZkTest.test-seed#[AB86964C70C8349D]) [n:127.0.0.1:43901_    ] o.a.s.c.ZkController Register node as live in ZooKeeper:/live_nodes/127.0.0.1:43901_
   [junit4]   2> 423096 INFO  (TEST-UnloadDistributedZkTest.test-seed#[AB86964C70C8349D]) [n:127.0.0.1:43901_    ] o.a.s.c.c.SolrZkClient makePath: /live_nodes/127.0.0.1:43901_
   [junit4]   2> 423097 INFO  (zkCallback-554-thread-1-processing-n:127.0.0.1:38816_) [n:127.0.0.1:38816_    ] o.a.s.c.c.ZkStateReader A live node change: [WatchedEvent state:SyncConnected type:NodeChildrenChanged path:/live_nodes], has occurred - updating... (live nodes size: [1])
   [junit4]   2> 423097 INFO  (zkCallback-562-thread-1-processing-n:127.0.0.1:43901_) [n:127.0.0.1:43901_    ] o.a.s.c.c.ZkStateReader A live node change: [WatchedEvent state:SyncConnected type:NodeChildrenChanged path:/live_nodes], has occurred - updating... (live nodes size: [1])
   [junit4]   2> 423097 INFO  (zkCallback-562-thread-2-processing-n:127.0.0.1:43901_) [n:127.0.0.1:43901_    ] o.a.s.c.c.ZkStateReader A live node change: [WatchedEvent state:SyncConnected type:NodeChildrenChanged path:/live_nodes], has occurred - updating... (live nodes size: [1])
   [junit4]   2> 423097 INFO  (zkCallback-556-thread-1) [    ] o.a.s.c.c.ZkStateReader A live node change: [WatchedEvent state:SyncConnected type:NodeChildrenChanged path:/live_nodes], has occurred - updating... (live nodes size: [1])
   [junit4]   2> 423097 INFO  (zkCallback-562-thread-1-processing-n:127.0.0.1:43901_) [n:127.0.0.1:43901_    ] o.a.s.c.c.ZkStateReader Updated live nodes from ZooKeeper... (1) -> (2)
   [junit4]   2> 423097 INFO  (zkCallback-554-thread-1-processing-n:127.0.0.1:38816_) [n:127.0.0.1:38816_    ] o.a.s.c.c.ZkStateReader Updated live nodes from ZooKeeper... (1) -> (2)
   [junit4]   2> 423097 INFO  (zkCallback-562-thread-2-processing-n:127.0.0.1:43901_) [n:127.0.0.1:43901_    ] o.a.s.c.c.ZkStateReader Updated live nodes from ZooKeeper... (2) -> (2)
   [junit4]   2> 423098 INFO  (zkCallback-556-thread-1) [    ] o.a.s.c.c.ZkStateReader Updated live nodes from ZooKeeper... (1) -> (2)
   [junit4]   2> 423110 INFO  (TEST-UnloadDistributedZkTest.test-seed#[AB86964C70C8349D]) [n:127.0.0.1:43901_    ] o.a.s.c.CoreContainer Security conf doesn't exist. Skipping setup for authorization module.
   [junit4]   2> 423110 INFO  (TEST-UnloadDistributedZkTest.test-seed#[AB86964C70C8349D]) [n:127.0.0.1:43901_    ] o.a.s.c.CoreContainer No authentication plugin used.
   [junit4]   2> 423110 INFO  (TEST-UnloadDistributedZkTest.test-seed#[AB86964C70C8349D]) [n:127.0.0.1:43901_    ] o.a.s.c.CorePropertiesLocator Looking for core definitions underneath /home/jenkins/workspace/Lucene-Solr-trunk-Linux/solr/build/solr-core/test/J2/temp/solr.cloud.UnloadDistributedZkTest_AB86964C70C8349D-001/shard-1-001/cores
   [junit4]   2> 423111 INFO  (TEST-UnloadDistributedZkTest.test-seed#[AB86964C70C8349D]) [n:127.0.0.1:43901_    ] o.a.s.c.CoreDescriptor Created CoreDescriptor: {name=collection1, config=solrconfig.xml, transient=false, schema=schema.xml, loadOnStartup=true, configSetProperties=configsetprops.json, collection=collection1, coreNodeName=, dataDir=data/, shard=}
   [junit4]   2> 423111 INFO  (TEST-UnloadDistributedZkTest.test-seed#[AB86964C70C8349D]) [n:127.0.0.1:43901_    ] o.a.s.c.CorePropertiesLocator Found core collection1 in /home/jenkins/workspace/Lucene-Solr-trunk-Linux/solr/build/solr-core/test/J2/temp/solr.cloud.UnloadDistributedZkTest_AB86964C70C8349D-001/shard-1-001/cores/collection1
   [junit4]   2> 423111 INFO  (TEST-UnloadDistributedZkTest.test-seed#[AB86964C70C8349D]) [n:127.0.0.1:43901_    ] o.a.s.c.CorePropertiesLocator Found 1 core definitions
   [junit4]   2> 423112 INFO  (TEST-UnloadDistributedZkTest.test-seed#[AB86964C70C8349D]) [n:127.0.0.1:43901_    ] o.a.s.s.SolrDispatchFilter user.dir=/home/jenkins/workspace/Lucene-Solr-trunk-Linux/solr/build/solr-core/test/J2
   [junit4]   2> 423112 INFO  (TEST-UnloadDistributedZkTest.test-seed#[AB86964C70C8349D]) [n:127.0.0.1:43901_    ] o.a.s.s.SolrDispatchFilter SolrDispatchFilter.init() done
   [junit4]   2> 423112 INFO  (coreLoadExecutor-1993-thread-1-processing-n:127.0.0.1:43901_) [n:127.0.0.1:43901_ c:collection1   x:collection1] o.a.s.c.ZkController publishing state=down
   [junit4]   2> 423112 INFO  (coreLoadExecutor-1993-thread-1-processing-n:127.0.0.1:43901_) [n:127.0.0.1:43901_ c:collection1   x:collection1] o.a.s.c.ZkController numShards not found on descriptor - reading it from system property
   [junit4]   2> 423112 INFO  (coreLoadExecutor-1993-thread-1-processing-n:127.0.0.1:43901_) [n:127.0.0.1:43901_ c:collection1   x:collection1] o.a.s.c.ZkController Registering watch for collection collection1
   [junit4]   2> 423112 INFO  (coreLoadExecutor-1993-thread-1-processing-n:127.0.0.1:43901_) [n:127.0.0.1:43901_ c:collection1   x:collection1] o.a.s.c.c.ZkStateReader addZkWatch [collection1]
   [junit4]   2> 423113 INFO  (OverseerStateUpdate-95460067792519172-127.0.0.1:38816_-n_0000000000) [n:127.0.0.1:38816_    ] o.a.s.c.Overseer processMessage: queueSize: 1, message = {
   [junit4]   2>   "core":"collection1",
   [junit4]   2>   "roles":null,
   [junit4]   2>   "base_url":"http://127.0.0.1:43901",
   [junit4]   2>   "node_name":"127.0.0.1:43901_",
   [junit4]   2>   "numShards":"2",
   [junit4]   2>   "state":"down",
   [junit4]   2>   "shard":null,
   [junit4]   2>   "collection":"collection1",
   [junit4]   2>   "operation":"state"} current state version: 4
   [junit4]   2> 423113 INFO  (coreLoadExecutor-1993-thread-1-processing-n:127.0.0.1:43901_) [n:127.0.0.1:43901_ c:collection1   x:collection1] o.a.s.c.c.ZkStateReader Add data for [collection1] ver [0]
   [junit4]   2> 423113 INFO  (coreLoadExecutor-1993-thread-1-processing-n:127.0.0.1:43901_) [n:127.0.0.1:43901_ c:collection1   x:collection1] o.a.s.c.ZkController look for our core node name
   [junit4]   2> 423113 INFO  (OverseerStateUpdate-95460067792519172-127.0.0.1:38816_-n_0000000000) [n:127.0.0.1:38816_    ] o.a.s.c.o.ReplicaMutator Update state numShards=2 message={
   [junit4]   2>   "core":"collection1",
   [junit4]   2>   "roles":null,
   [junit4]   2>   "base_url":"http://127.0.0.1:43901",
   [junit4]   2>   "node_name":"127.0.0.1:43901_",
   [junit4]   2>   "numShards":"2",
   [junit4]   2>   "state":"down",
   [junit4]   2>   "shard":null,
   [junit4]   2>   "collection":"collection1",
   [junit4]   2>   "operation":"state"}
   [junit4]   2> 423113 INFO  (OverseerStateUpdate-95460067792519172-127.0.0.1:38816_-n_0000000000) [n:127.0.0.1:38816_    ] o.a.s.c.o.ReplicaMutator Collection already exists with numShards=2
   [junit4]   2> 423113 INFO  (OverseerStateUpdate-95460067792519172-127.0.0.1:38816_-n_0000000000) [n:127.0.0.1:38816_    ] o.a.s.c.o.ReplicaMutator Assigning new node to shard shard=shard2
   [junit4]   2> 423214 INFO  (OverseerStateUpdate-95460067792519172-127.0.0.1:38816_-n_0000000000) [n:127.0.0.1:38816_    ] o.a.s.c.o.ZkStateWriter going to update_collection /collections/collection1/state.json version: 0
   [junit4]   2> 423214 INFO  (zkCallback-562-thread-2-processing-n:127.0.0.1:43901_) [n:127.0.0.1:43901_    ] o.a.s.c.c.ZkStateReader A cluster state change: [WatchedEvent state:SyncConnected type:NodeDataChanged path:/collections/collection1/state.json] for collection [collection1] has occurred - updating... (live nodes size: [2])
   [junit4]   2> 423215 INFO  (zkCallback-562-thread-2-processing-n:127.0.0.1:43901_) [n:127.0.0.1:43901_    ] o.a.s.c.c.ZkStateReader Updating data for [collection1] from [0] to [1]
   [junit4]   2> 424113 INFO  (coreLoadExecutor-1993-thread-1-processing-n:127.0.0.1:43901_) [n:127.0.0.1:43901_ c:collection1   x:collection1] o.a.s.c.ZkController waiting to find shard id in clusterstate for collection1
   [junit4]   2> 424113 INFO  (coreLoadExecutor-1993-thread-1-processing-n:127.0.0.1:43901_) [n:127.0.0.1:43901_ c:collection1   x:collection1] o.a.s.c.ZkController Check for collection zkNode:collection1
   [junit4]   2> 424113 INFO  (coreLoadExecutor-1993-thread-1-processing-n:127.0.0.1:43901_) [n:127.0.0.1:43901_ c:collection1   x:collection1] o.a.s.c.ZkController Collection zkNode exists
   [junit4]   2> 424113 INFO  (coreLoadExecutor-1993-thread-1-processing-n:127.0.0.1:43901_) [n:127.0.0.1:43901_ c:collection1   x:collection1] o.a.s.c.c.ZkStateReader Load collection config from: [/collections/collection1]
   [junit4]   2> 424113 INFO  (coreLoadExecutor-1993-thread-1-processing-n:127.0.0.1:43901_) [n:127.0.0.1:43901_ c:collection1   x:collection1] o.a.s.c.c.ZkStateReader path=[/collections/collection1] [configName]=[conf1] specified config exists in ZooKeeper
   [junit4]   2> 424114 INFO  (coreLoadExecutor-1993-thread-1-processing-n:127.0.0.1:43901_) [n:127.0.0.1:43901_ c:collection1   x:collection1] o.a.s.c.SolrResourceLoader new SolrResourceLoader for directory: '/home/jenkins/workspace/Lucene-Solr-trunk-Linux/solr/build/solr-core/test/J2/temp/solr.cloud.UnloadDistributedZkTest_AB86964C70C8349D-001/shard-1-001/cores/collection1'
   [junit4]   2> 424114 INFO  (coreLoadExecutor-1993-thread-1-processing-n:127.0.0.1:43901_) [n:127.0.0.1:43901_ c:collection1   x:collection1] o.a.s.c.SolrResourceLoader JNDI not configured for solr (NoInitialContextEx)
   [junit4]   2> 424114 INFO  (coreLoadExecutor-1993-thread-1-processing-n:127.0.0.1:43901_) [n:127.0.0.1:43901_ c:collection1   x:collection1] o.a.s.c.SolrResourceLoader solr home defaulted to 'solr/' (could not find system property or JNDI)
   [junit4]   2> 424114 INFO  (coreLoadExecutor-1993-thread-1-processing-n:127.0.0.1:43901_) [n:127.0.0.1:43901_ c:collection1   x:collection1] o.a.s.c.Config loaded config solrconfig.xml with version 0 
   [junit4]   2> 424117 INFO  (coreLoadExecutor-1993-thread-1-processing-n:127.0.0.1:43901_) [n:127.0.0.1:43901_ c:collection1   x:collection1] o.a.s.c.SolrConfig current version of requestparams : -1
   [junit4]   2> 424120 INFO  (coreLoadExecutor-1993-thread-1-processing-n:127.0.0.1:43901_) [n:127.0.0.1:43901_ c:collection1   x:collection1] o.a.s.c.SolrConfig Using Lucene MatchVersion: 6.0.0
   [junit4]   2> 424141 INFO  (coreLoadExecutor-1993-thread-1-processing-n:127.0.0.1:43901_) [n:127.0.0.1:43901_ c:collection1   x:collection1] o.a.s.c.SolrConfig Loaded SolrConfig: solrconfig.xml
   [junit4]   2> 424145 INFO  (coreLoadExecutor-1993-thread-1-processing-n:127.0.0.1:43901_) [n:127.0.0.1:43901_ c:collection1   x:collection1] o.a.s.s.IndexSchema [collection1] Schema name=test
   [junit4]   2> 424212 INFO  (coreLoadExecutor-1993-thread-1-processing-n:127.0.0.1:43901_) [n:127.0.0.1:43901_ c:collection1   x:collection1] o.a.s.s.OpenExchangeRatesOrgProvider Initialized with rates=open-exchange-rates.json, refreshInterval=1440.
   [junit4]   2> 424216 INFO  (coreLoadExecutor-1993-thread-1-processing-n:127.0.0.1:43901_) [n:127.0.0.1:43901_ c:collection1   x:collection1] o.a.s.s.IndexSchema default search field in schema is text
   [junit4]   2> 424217 INFO  (coreLoadExecutor-1993-thread-1-processing-n:127.0.0.1:43901_) [n:127.0.0.1:43901_ c:collection1   x:collection1] o.a.s.s.IndexSchema unique key field: id
   [junit4]   2> 424221 INFO  (coreLoadExecutor-1993-thread-1-processing-n:127.0.0.1:43901_) [n:127.0.0.1:43901_ c:collection1   x:collection1] o.a.s.s.FileExchangeRateProvider Reloading exchange rates from file currency.xml
   [junit4]   2> 424223 INFO  (coreLoadExecutor-1993-thread-1-processing-n:127.0.0.1:43901_) [n:127.0.0.1:43901_ c:collection1   x:collection1] o.a.s.s.FileExchangeRateProvider Reloading exchange rates from file currency.xml
   [junit4]   2> 424224 INFO  (coreLoadExecutor-1993-thread-1-processing-n:127.0.0.1:43901_) [n:127.0.0.1:43901_ c:collection1   x:collection1] o.a.s.s.OpenExchangeRatesOrgProvider Reloading exchange rates from open-exchange-rates.json
   [junit4]   2> 424225 INFO  (coreLoadExecutor-1993-thread-1-processing-n:127.0.0.1:43901_) [n:127.0.0.1:43901_ c:collection1   x:collection1] o.a.s.s.OpenExchangeRatesOrgProvider Reloading exchange rates from open-exchange-rates.json
   [junit4]   2> 424226 INFO  (coreLoadExecutor-1993-thread-1-processing-n:127.0.0.1:43901_) [n:127.0.0.1:43901_ c:collection1   x:collection1] o.a.s.c.ConfigSetProperties Did not find ConfigSet properties, assuming default properties: Can't find resource 'configsetprops.json' in classpath or '/configs/conf1', cwd=/home/jenkins/workspace/Lucene-Solr-trunk-Linux/solr/build/solr-core/test/J2
   [junit4]   2> 424226 INFO  (coreLoadExecutor-1993-thread-1-processing-n:127.0.0.1:43901_) [n:127.0.0.1:43901_ c:collection1   x:collection1] o.a.s.c.CoreContainer Creating SolrCore 'collection1' using configuration from collection collection1
   [junit4]   2> 424226 INFO  (coreLoadExecutor-1993-thread-1-processing-n:127.0.0.1:43901_) [n:127.0.0.1:43901_ c:collection1 s:shard2 r:core_node1 x:collection1] o.a.s.c.SolrCore org.apache.solr.core.MockDirectoryFactory
   [junit4]   2> 424226 INFO  (coreLoadExecutor-1993-thread-1-processing-n:127.0.0.1:43901_) [n:127.0.0.1:43901_ c:collection1 s:shard2 r:core_node1 x:collection1] o.a.s.c.SolrCore [[collection1] ] Opening new SolrCore at [/home/jenkins/workspace/Lucene-Solr-trunk-Linux/solr/build/solr-core/test/J2/temp/solr.cloud.UnloadDistributedZkTest_AB86964C70C8349D-001/shard-1-001/cores/collection1], dataDir=[/home/jenkins/workspace/Lucene-Solr-trunk-Linux/solr/build/solr-core/test/J2/temp/solr.cloud.UnloadDistributedZkTest_AB86964C70C8349D-001/shard-1-001/cores/collection1/data/]
   [junit4]   2> 424226 INFO  (coreLoadExecutor-1993-thread-1-processing-n:127.0.0.1:43901_) [n:127.0.0.1:43901_ c:collection1 s:shard2 r:core_node1 x:collection1] o.a.s.c.JmxMonitoredMap JMX monitoring is enabled. Adding Solr mbeans to JMX Server: com.sun.jmx.mbeanserver.JmxMBeanServer@833222
   [junit4]   2> 424227 INFO  (coreLoadExecutor-1993-thread-1-processing-n:127.0.0.1:43901_) [n:127.0.0.1:43901_ c:collection1 s:shard2 r:core_node1 x:collection1] o.a.s.c.CachingDirectoryFactory return new directory for /home/jenkins/workspace/Lucene-Sol

[...truncated too long message...]

pResponseParser.parseHead(DefaultHttpResponseParser.java:57)
   [junit4]    > 	at org.apache.http.impl.io.AbstractMessageParser.parse(AbstractMessageParser.java:261)
   [junit4]    > 	at org.apache.http.impl.AbstractHttpClientConnection.receiveResponseHeader(AbstractHttpClientConnection.java:283)
   [junit4]    > 	at org.apache.http.impl.conn.DefaultClientConnection.receiveResponseHeader(DefaultClientConnection.java:251)
   [junit4]    > 	at org.apache.http.impl.conn.ManagedClientConnectionImpl.receiveResponseHeader(ManagedClientConnectionImpl.java:197)
   [junit4]    > 	at org.apache.http.protocol.HttpRequestExecutor.doReceiveResponse(HttpRequestExecutor.java:272)
   [junit4]    > 	at org.apache.http.protocol.HttpRequestExecutor.execute(HttpRequestExecutor.java:124)
   [junit4]    > 	at org.apache.http.impl.client.DefaultRequestDirector.tryExecute(DefaultRequestDirector.java:685)
   [junit4]    > 	at org.apache.http.impl.client.DefaultRequestDirector.execute(DefaultRequestDirector.java:487)
   [junit4]    > 	at org.apache.http.impl.client.AbstractHttpClient.doExecute(AbstractHttpClient.java:882)
   [junit4]    > 	at org.apache.http.impl.client.CloseableHttpClient.execute(CloseableHttpClient.java:82)
   [junit4]    > 	at org.apache.http.impl.client.CloseableHttpClient.execute(CloseableHttpClient.java:107)
   [junit4]    > 	at org.apache.http.impl.client.CloseableHttpClient.execute(CloseableHttpClient.java:55)
   [junit4]    > 	at org.apache.solr.client.solrj.impl.HttpSolrClient.executeMethod(HttpSolrClient.java:482)
   [junit4]    > 	... 8 moreThrowable #6: com.carrotsearch.randomizedtesting.UncaughtExceptionError: Captured an uncaught exception in thread: Thread[id=3848, name=testExecutor-2061-thread-9, state=RUNNABLE, group=TGRP-UnloadDistributedZkTest]
   [junit4]    > Caused by: java.lang.RuntimeException: org.apache.solr.client.solrj.SolrServerException: Timeout occured while waiting response from server at: http://127.0.0.1:51876
   [junit4]    > 	at __randomizedtesting.SeedInfo.seed([AB86964C70C8349D]:0)
   [junit4]    > 	at org.apache.solr.cloud.BasicDistributedZkTest$1.run(BasicDistributedZkTest.java:586)
   [junit4]    > 	at org.apache.solr.common.util.ExecutorUtil$MDCAwareThreadPoolExecutor$1.run(ExecutorUtil.java:231)
   [junit4]    > 	at java.util.concurrent.ThreadPoolExecutor.runWorker(ThreadPoolExecutor.java:1142)
   [junit4]    > 	at java.util.concurrent.ThreadPoolExecutor$Worker.run(ThreadPoolExecutor.java:617)
   [junit4]    > 	at java.lang.Thread.run(Thread.java:745)
   [junit4]    > Caused by: org.apache.solr.client.solrj.SolrServerException: Timeout occured while waiting response from server at: http://127.0.0.1:51876
   [junit4]    > 	at org.apache.solr.client.solrj.impl.HttpSolrClient.executeMethod(HttpSolrClient.java:588)
   [junit4]    > 	at org.apache.solr.client.solrj.impl.HttpSolrClient.request(HttpSolrClient.java:241)
   [junit4]    > 	at org.apache.solr.client.solrj.impl.HttpSolrClient.request(HttpSolrClient.java:230)
   [junit4]    > 	at org.apache.solr.client.solrj.SolrClient.request(SolrClient.java:1219)
   [junit4]    > 	at org.apache.solr.cloud.BasicDistributedZkTest$1.run(BasicDistributedZkTest.java:584)
   [junit4]    > 	... 4 more
   [junit4]    > Caused by: java.net.SocketTimeoutException: Read timed out
   [junit4]    > 	at java.net.SocketInputStream.socketRead0(Native Method)
   [junit4]    > 	at java.net.SocketInputStream.socketRead(SocketInputStream.java:116)
   [junit4]    > 	at java.net.SocketInputStream.read(SocketInputStream.java:170)
   [junit4]    > 	at java.net.SocketInputStream.read(SocketInputStream.java:141)
   [junit4]    > 	at org.apache.http.impl.io.AbstractSessionInputBuffer.fillBuffer(AbstractSessionInputBuffer.java:160)
   [junit4]    > 	at org.apache.http.impl.io.SocketInputBuffer.fillBuffer(SocketInputBuffer.java:84)
   [junit4]    > 	at org.apache.http.impl.io.AbstractSessionInputBuffer.readLine(AbstractSessionInputBuffer.java:273)
   [junit4]    > 	at org.apache.http.impl.conn.DefaultHttpResponseParser.parseHead(DefaultHttpResponseParser.java:140)
   [junit4]    > 	at org.apache.http.impl.conn.DefaultHttpResponseParser.parseHead(DefaultHttpResponseParser.java:57)
   [junit4]    > 	at org.apache.http.impl.io.AbstractMessageParser.parse(AbstractMessageParser.java:261)
   [junit4]    > 	at org.apache.http.impl.AbstractHttpClientConnection.receiveResponseHeader(AbstractHttpClientConnection.java:283)
   [junit4]    > 	at org.apache.http.impl.conn.DefaultClientConnection.receiveResponseHeader(DefaultClientConnection.java:251)
   [junit4]    > 	at org.apache.http.impl.conn.ManagedClientConnectionImpl.receiveResponseHeader(ManagedClientConnectionImpl.java:197)
   [junit4]    > 	at org.apache.http.protocol.HttpRequestExecutor.doReceiveResponse(HttpRequestExecutor.java:272)
   [junit4]    > 	at org.apache.http.protocol.HttpRequestExecutor.execute(HttpRequestExecutor.java:124)
   [junit4]    > 	at org.apache.http.impl.client.DefaultRequestDirector.tryExecute(DefaultRequestDirector.java:685)
   [junit4]    > 	at org.apache.http.impl.client.DefaultRequestDirector.execute(DefaultRequestDirector.java:487)
   [junit4]    > 	at org.apache.http.impl.client.AbstractHttpClient.doExecute(AbstractHttpClient.java:882)
   [junit4]    > 	at org.apache.http.impl.client.CloseableHttpClient.execute(CloseableHttpClient.java:82)
   [junit4]    > 	at org.apache.http.impl.client.CloseableHttpClient.execute(CloseableHttpClient.java:107)
   [junit4]    > 	at org.apache.http.impl.client.CloseableHttpClient.execute(CloseableHttpClient.java:55)
   [junit4]    > 	at org.apache.solr.client.solrj.impl.HttpSolrClient.executeMethod(HttpSolrClient.java:482)
   [junit4]    > 	... 8 more
   [junit4]   2> 556443 INFO  (SUITE-UnloadDistributedZkTest-seed#[AB86964C70C8349D]-worker) [    ] o.a.s.SolrTestCaseJ4 ###deleteCore
   [junit4]   2> Feb 27, 2016 8:32:54 PM com.carrotsearch.randomizedtesting.ThreadLeakControl checkThreadLeaks
   [junit4]   2> WARNING: Will linger awaiting termination of 1 leaked thread(s).
   [junit4]   2> NOTE: test params are: codec=Asserting(Lucene60): {other_tl1=FSTOrd50, range_facet_l_dv=FST50, _version_=FSTOrd50, multiDefault=BlockTreeOrds(blocksize=128), a_t=BlockTreeOrds(blocksize=128), intDefault=FSTOrd50, a_i1=BlockTreeOrds(blocksize=128), id=FST50, range_facet_i_dv=BlockTreeOrds(blocksize=128), text=Lucene50(blocksize=128), range_facet_l=BlockTreeOrds(blocksize=128), timestamp=BlockTreeOrds(blocksize=128)}, docValues:{range_facet_l_dv=DocValuesFormat(name=Direct), range_facet_i_dv=DocValuesFormat(name=Memory), timestamp=DocValuesFormat(name=Memory)}, sim=ClassicSimilarity, locale=pl-PL, timezone=America/Bogota
   [junit4]   2> NOTE: Linux 3.19.0-47-generic i386/Oracle Corporation 1.8.0_72 (32-bit)/cpus=12,threads=1,free=236040136,total=513679360
   [junit4]   2> NOTE: All tests run in this JVM: [TestCoreDiscovery, TestRequestForwarding, TestSearcherReuse, DistributedFacetPivotLongTailTest, TestManagedResourceStorage, NoCacheHeaderTest, TestPostingsSolrHighlighter, TestFastWriter, TestXIncludeConfig, TestTestInjection, TestExpandComponent, CustomCollectionTest, CheckHdfsIndexTest, TestSearchPerf, AutoCommitTest, CircularListTest, RequestLoggingTest, BinaryUpdateRequestHandlerTest, TestIntervalFaceting, TestPHPSerializedResponseWriter, TestSizeLimitedDistributedMap, TestUseDocValuesAsStored, SharedFSAutoReplicaFailoverUtilsTest, TestConfigSetProperties, TestFieldResource, UpdateParamsTest, CurrencyFieldXmlFileTest, TestReplicationHandlerBackup, TestExactSharedStatsCache, TestPKIAuthenticationPlugin, IgnoreCommitOptimizeUpdateProcessorFactoryTest, TestSolrJ, TestUtils, TestReversedWildcardFilterFactory, DeleteReplicaTest, TermVectorComponentDistributedTest, DateMathParserTest, BufferStoreTest, TestImplicitCoreProperties, ChangedSchemaMergeTest, TestDynamicFieldCollectionResource, QueryParsingTest, BadIndexSchemaTest, DocValuesMultiTest, SimpleMLTQParserTest, TestBlendedInfixSuggestions, AssignTest, DirectoryFactoryTest, ConcurrentDeleteAndCreateCollectionTest, DistributedFacetPivotWhiteBoxTest, RestartWhileUpdatingTest, OutOfBoxZkACLAndCredentialsProvidersTest, ClusterStateTest, TestRecovery, InfoHandlerTest, DataDrivenBlockJoinTest, SearchHandlerTest, BasicDistributedZk2Test, XmlUpdateRequestHandlerTest, DistribCursorPagingTest, BitVectorTest, SimpleFacetsTest, AtomicUpdatesTest, RecoveryAfterSoftCommitTest, DirectUpdateHandlerOptimizeTest, SaslZkACLProviderTest, BadComponentTest, HardAutoCommitTest, SolrXmlInZkTest, StatelessScriptUpdateProcessorFactoryTest, TestSolrQueryResponse, HdfsThreadLeakTest, ResponseHeaderTest, UnloadDistributedZkTest]
   [junit4] Completed [176/581 (1!)] on J2 in 136.76s, 1 test, 1 error <<< FAILURES!

[...truncated 1318 lines...]
BUILD FAILED
/home/jenkins/workspace/Lucene-Solr-trunk-Linux/build.xml:740: The following error occurred while executing this line:
/home/jenkins/workspace/Lucene-Solr-trunk-Linux/build.xml:684: The following error occurred while executing this line:
/home/jenkins/workspace/Lucene-Solr-trunk-Linux/build.xml:59: The following error occurred while executing this line:
/home/jenkins/workspace/Lucene-Solr-trunk-Linux/solr/build.xml:233: The following error occurred while executing this line:
/home/jenkins/workspace/Lucene-Solr-trunk-Linux/solr/common-build.xml:524: The following error occurred while executing this line:
/home/jenkins/workspace/Lucene-Solr-trunk-Linux/lucene/common-build.xml:1457: The following error occurred while executing this line:
/home/jenkins/workspace/Lucene-Solr-trunk-Linux/lucene/common-build.xml:1014: There were test failures: 581 suites (8 ignored), 2349 tests, 1 error, 116 ignored (71 assumptions) [seed: AB86964C70C8349D]

Total time: 55 minutes 45 seconds
Build step 'Invoke Ant' marked build as failure
Archiving artifacts
[WARNINGS] Skipping publisher since build result is FAILURE
Recording test results
Email was triggered for: Failure - Any
Sending email for trigger: Failure - Any



[JENKINS-EA] Lucene-Solr-trunk-Linux (64bit/jdk-9-ea+106) - Build # 16026 - Still Failing!

Posted by Policeman Jenkins Server <je...@thetaphi.de>.
Build: http://jenkins.thetaphi.de/job/Lucene-Solr-trunk-Linux/16026/
Java: 64bit/jdk-9-ea+106 -XX:-UseCompressedOops -XX:+UseSerialGC

1 tests failed.
FAILED:  org.apache.lucene.util.TestQueryBuilder.testPhraseQueryPositionIncrements

Error Message:
6

Stack Trace:
java.lang.ArrayIndexOutOfBoundsException: 6
	at __randomizedtesting.SeedInfo.seed([B363459E785D0409:9128F1CAEBD8843C]:0)
	at org.apache.lucene.util.automaton.MinimizationOperations.minimize(MinimizationOperations.java:235)
	at org.apache.lucene.util.automaton.RegExp.toAutomatonInternal(RegExp.java:524)
	at org.apache.lucene.util.automaton.RegExp.toAutomaton(RegExp.java:495)
	at org.apache.lucene.util.automaton.RegExp.toAutomaton(RegExp.java:426)
	at org.apache.lucene.util.TestQueryBuilder.testPhraseQueryPositionIncrements(TestQueryBuilder.java:111)
	at sun.reflect.NativeMethodAccessorImpl.invoke0(Native Method)
	at sun.reflect.NativeMethodAccessorImpl.invoke(NativeMethodAccessorImpl.java:62)
	at sun.reflect.DelegatingMethodAccessorImpl.invoke(DelegatingMethodAccessorImpl.java:43)
	at java.lang.reflect.Method.invoke(Method.java:520)
	at com.carrotsearch.randomizedtesting.RandomizedRunner.invoke(RandomizedRunner.java:1764)
	at com.carrotsearch.randomizedtesting.RandomizedRunner$8.evaluate(RandomizedRunner.java:871)
	at com.carrotsearch.randomizedtesting.RandomizedRunner$9.evaluate(RandomizedRunner.java:907)
	at com.carrotsearch.randomizedtesting.RandomizedRunner$10.evaluate(RandomizedRunner.java:921)
	at org.apache.lucene.util.TestRuleSetupTeardownChained$1.evaluate(TestRuleSetupTeardownChained.java:49)
	at org.apache.lucene.util.AbstractBeforeAfterRule$1.evaluate(AbstractBeforeAfterRule.java:45)
	at org.apache.lucene.util.TestRuleThreadAndTestName$1.evaluate(TestRuleThreadAndTestName.java:48)
	at org.apache.lucene.util.TestRuleIgnoreAfterMaxFailures$1.evaluate(TestRuleIgnoreAfterMaxFailures.java:64)
	at org.apache.lucene.util.TestRuleMarkFailure$1.evaluate(TestRuleMarkFailure.java:47)
	at com.carrotsearch.randomizedtesting.rules.StatementAdapter.evaluate(StatementAdapter.java:36)
	at com.carrotsearch.randomizedtesting.ThreadLeakControl$StatementRunner.run(ThreadLeakControl.java:367)
	at com.carrotsearch.randomizedtesting.ThreadLeakControl.forkTimeoutingTask(ThreadLeakControl.java:809)
	at com.carrotsearch.randomizedtesting.ThreadLeakControl$3.evaluate(ThreadLeakControl.java:460)
	at com.carrotsearch.randomizedtesting.RandomizedRunner.runSingleTest(RandomizedRunner.java:880)
	at com.carrotsearch.randomizedtesting.RandomizedRunner$5.evaluate(RandomizedRunner.java:781)
	at com.carrotsearch.randomizedtesting.RandomizedRunner$6.evaluate(RandomizedRunner.java:816)
	at com.carrotsearch.randomizedtesting.RandomizedRunner$7.evaluate(RandomizedRunner.java:827)
	at org.apache.lucene.util.AbstractBeforeAfterRule$1.evaluate(AbstractBeforeAfterRule.java:45)
	at com.carrotsearch.randomizedtesting.rules.StatementAdapter.evaluate(StatementAdapter.java:36)
	at org.apache.lucene.util.TestRuleStoreClassName$1.evaluate(TestRuleStoreClassName.java:41)
	at com.carrotsearch.randomizedtesting.rules.NoShadowingOrOverridesOnMethodsRule$1.evaluate(NoShadowingOrOverridesOnMethodsRule.java:40)
	at com.carrotsearch.randomizedtesting.rules.NoShadowingOrOverridesOnMethodsRule$1.evaluate(NoShadowingOrOverridesOnMethodsRule.java:40)
	at com.carrotsearch.randomizedtesting.rules.StatementAdapter.evaluate(StatementAdapter.java:36)
	at com.carrotsearch.randomizedtesting.rules.StatementAdapter.evaluate(StatementAdapter.java:36)
	at com.carrotsearch.randomizedtesting.rules.StatementAdapter.evaluate(StatementAdapter.java:36)
	at org.apache.lucene.util.TestRuleAssertionsRequired$1.evaluate(TestRuleAssertionsRequired.java:53)
	at org.apache.lucene.util.TestRuleMarkFailure$1.evaluate(TestRuleMarkFailure.java:47)
	at org.apache.lucene.util.TestRuleIgnoreAfterMaxFailures$1.evaluate(TestRuleIgnoreAfterMaxFailures.java:64)
	at org.apache.lucene.util.TestRuleIgnoreTestSuites$1.evaluate(TestRuleIgnoreTestSuites.java:54)
	at com.carrotsearch.randomizedtesting.rules.StatementAdapter.evaluate(StatementAdapter.java:36)
	at com.carrotsearch.randomizedtesting.ThreadLeakControl$StatementRunner.run(ThreadLeakControl.java:367)
	at java.lang.Thread.run(Thread.java:804)




Build Log:
[...truncated 746 lines...]
   [junit4] Suite: org.apache.lucene.util.TestQueryBuilder
   [junit4]   2> NOTE: reproduce with: ant test  -Dtestcase=TestQueryBuilder -Dtests.method=testPhraseQueryPositionIncrements -Dtests.seed=B363459E785D0409 -Dtests.multiplier=3 -Dtests.slow=true -Dtests.locale=fr-LU -Dtests.timezone=Pacific/Tahiti -Dtests.asserts=true -Dtests.file.encoding=UTF-8
   [junit4] ERROR   0.00s J0 | TestQueryBuilder.testPhraseQueryPositionIncrements <<<
   [junit4]    > Throwable #1: java.lang.ArrayIndexOutOfBoundsException: 6
   [junit4]    > 	at __randomizedtesting.SeedInfo.seed([B363459E785D0409:9128F1CAEBD8843C]:0)
   [junit4]    > 	at org.apache.lucene.util.automaton.MinimizationOperations.minimize(MinimizationOperations.java:235)
   [junit4]    > 	at org.apache.lucene.util.automaton.RegExp.toAutomatonInternal(RegExp.java:524)
   [junit4]    > 	at org.apache.lucene.util.automaton.RegExp.toAutomaton(RegExp.java:495)
   [junit4]    > 	at org.apache.lucene.util.automaton.RegExp.toAutomaton(RegExp.java:426)
   [junit4]    > 	at org.apache.lucene.util.TestQueryBuilder.testPhraseQueryPositionIncrements(TestQueryBuilder.java:111)
   [junit4]    > 	at java.lang.Thread.run(Thread.java:804)
   [junit4]   2> NOTE: test params are: codec=Asserting(Lucene60): {}, docValues:{}, sim=RandomSimilarity(queryNorm=true,coord=yes): {}, locale=fr-LU, timezone=Pacific/Tahiti
   [junit4]   2> NOTE: Linux 3.19.0-47-generic amd64/Oracle Corporation 9-ea (64-bit)/cpus=12,threads=1,free=226003576,total=508952576
   [junit4]   2> NOTE: All tests run in this JVM: [TestBinaryDocument, TestStressDeletes, TestMinShouldMatch2, TestTermVectorsWriter, TestCloseableThreadLocal, TestTermRangeQuery, TestIndexWriterMergePolicy, TestCustomNorms, TestUTF32ToUTF8, TestSortRescorer, TestMutableValues, TestPriorityQueue, TestMultiFields, TestTrackingDirectoryWrapper, TestLSBRadixSorter, TestSloppyMath, TestShardSearching, TestBooleanMinShouldMatch, TestPagedBytes, TestMaxPosition, TestUniqueTermCount, TestSumDocFreq, TestSortedSetSortField, TestMultiValuedNumericRangeQuery, TestReadOnlyIndex, TestFieldType, TestQueryCachingPolicy, TestSearcherManager, Test2BTerms, TestDocValuesRewriteMethod, TestCodecs, FiniteStringsIteratorTest, TestNGramPhraseQuery, TestSpanBoostQuery, TestFilterLeafReader, TestIndexWriterExceptions2, TestBinaryTerms, TestUpgradeIndexMergePolicy, TestToken, TestSimilarity2, TestParallelCompositeReader, TestFixedBitSet, TestIndexWriterCommit, TestSpanTermQuery, TestFilterDirectory, TestSimilarityProvider, TestDeterminism, TestVirtualMethod, TestSimpleAttributeImpl, TestIndexWriterWithThreads, TestDoc, TestDocValuesIndexing, TestNumericDocValuesUpdates, TestHighCompressionMode, TestBinaryDocValuesUpdates, TestDateSort, TestMultiset, TestSentinelIntSet, TestQueryBuilder]
   [junit4] Completed [164/411 (1!)] on J0 in 0.03s, 20 tests, 1 error <<< FAILURES!

[...truncated 810 lines...]
BUILD FAILED
/home/jenkins/workspace/Lucene-Solr-trunk-Linux/build.xml:740: The following error occurred while executing this line:
/home/jenkins/workspace/Lucene-Solr-trunk-Linux/build.xml:684: The following error occurred while executing this line:
/home/jenkins/workspace/Lucene-Solr-trunk-Linux/build.xml:59: The following error occurred while executing this line:
/home/jenkins/workspace/Lucene-Solr-trunk-Linux/lucene/build.xml:50: The following error occurred while executing this line:
/home/jenkins/workspace/Lucene-Solr-trunk-Linux/lucene/common-build.xml:1457: The following error occurred while executing this line:
/home/jenkins/workspace/Lucene-Solr-trunk-Linux/lucene/common-build.xml:1014: There were test failures: 411 suites (1 ignored), 3423 tests, 1 error, 61 ignored (57 assumptions) [seed: B363459E785D0409]

Total time: 5 minutes 39 seconds
Build step 'Invoke Ant' marked build as failure
Archiving artifacts
[WARNINGS] Skipping publisher since build result is FAILURE
Recording test results
Email was triggered for: Failure - Any
Sending email for trigger: Failure - Any