You are viewing a plain text version of this content. The canonical link for it is here.
Posted to hdfs-dev@hadoop.apache.org by Apache Jenkins Server <je...@builds.apache.org> on 2016/02/19 01:08:17 UTC
Build failed in Jenkins: Hadoop-Hdfs-trunk #2847
See <https://builds.apache.org/job/Hadoop-Hdfs-trunk/2847/changes>
Changes:
[cnauroth] HDFS-9711. Integrate CSRF prevention filter in WebHDFS. Contributed by
[rkanter] HADOOP-12817. Enable TLS v1.1 and 1.2 (rkanter)
[kihwal] HDFS-4946. Allow preferLocalNode in BlockPlacementPolicyDefault to be
[szetszwo] HADOOP-10865. Add a Crc32 chunked verification benchmark for both
[aajisaka] HDFS-9830. Remove references to hftp in ViewFs documentation in trunk.
------------------------------------------
[...truncated 10987 lines...]
[INFO] --- maven-javadoc-plugin:2.8.1:jar (module-javadocs) @ hadoop-hdfs-bkjournal ---
[INFO] Skipping javadoc generation
[INFO]
[INFO] --- maven-dependency-plugin:2.8:copy (dist) @ hadoop-hdfs-bkjournal ---
[INFO] Configured Artifact: org.apache.bookkeeper:bookkeeper-server:?:jar
[INFO] Copying bookkeeper-server-4.2.3.jar to <https://builds.apache.org/job/Hadoop-Hdfs-trunk/ws/hadoop-hdfs-project/hadoop-hdfs/src/contrib/bkjournal/target/lib/bookkeeper-server-4.2.3.jar>
[INFO]
[INFO] --- maven-enforcer-plugin:1.3.1:enforce (depcheck) @ hadoop-hdfs-bkjournal ---
[INFO]
[INFO] --- maven-checkstyle-plugin:2.15:checkstyle (default-cli) @ hadoop-hdfs-bkjournal ---
[INFO] There are 611 errors reported by Checkstyle 6.6 with checkstyle/checkstyle.xml ruleset.
[WARNING] Unable to locate Source XRef to link to - DISABLED
[INFO]
[INFO] --- findbugs-maven-plugin:3.0.0:findbugs (default-cli) @ hadoop-hdfs-bkjournal ---
[INFO] Fork Value is true
[INFO] Done FindBugs Analysis....
[INFO]
[INFO] ------------------------------------------------------------------------
[INFO] Building Apache Hadoop HDFS-NFS 3.0.0-SNAPSHOT
[INFO] ------------------------------------------------------------------------
Downloading: https://repository.apache.org/content/repositories/snapshots/org/apache/hadoop/hadoop-nfs/3.0.0-SNAPSHOT/maven-metadata.xml
786/786 B
Downloaded: https://repository.apache.org/content/repositories/snapshots/org/apache/hadoop/hadoop-nfs/3.0.0-SNAPSHOT/maven-metadata.xml (786 B at 3.6 KB/sec)
Downloading: https://repository.apache.org/content/repositories/snapshots/org/apache/hadoop/hadoop-nfs/3.0.0-SNAPSHOT/hadoop-nfs-3.0.0-20160218.222429-4573.pom
4/5 KB
5/5 KB
Downloaded: https://repository.apache.org/content/repositories/snapshots/org/apache/hadoop/hadoop-nfs/3.0.0-SNAPSHOT/hadoop-nfs-3.0.0-20160218.222429-4573.pom (5 KB at 40.3 KB/sec)
Downloading: https://repository.apache.org/content/repositories/snapshots/org/apache/hadoop/hadoop-nfs/3.0.0-SNAPSHOT/hadoop-nfs-3.0.0-20160218.222429-4573.jar
4/156 KB
8/156 KB
8/156 KB
12/156 KB
14/156 KB
16/156 KB
20/156 KB
22/156 KB
24/156 KB
28/156 KB
30/156 KB
34/156 KB
38/156 KB
38/156 KB
42/156 KB
45/156 KB
46/156 KB
50/156 KB
53/156 KB
54/156 KB
58/156 KB
61/156 KB
62/156 KB
65/156 KB
69/156 KB
73/156 KB
73/156 KB
77/156 KB
81/156 KB
81/156 KB
85/156 KB
89/156 KB
89/156 KB
93/156 KB
97/156 KB
97/156 KB
101/156 KB
105/156 KB
105/156 KB
106/156 KB
110/156 KB
114/156 KB
114/156 KB
118/156 KB
122/156 KB
122/156 KB
126/156 KB
129/156 KB
133/156 KB
137/156 KB
137/156 KB
141/156 KB
144/156 KB
145/156 KB
149/156 KB
153/156 KB
153/156 KB
156/156 KB
Downloaded: https://repository.apache.org/content/repositories/snapshots/org/apache/hadoop/hadoop-nfs/3.0.0-SNAPSHOT/hadoop-nfs-3.0.0-20160218.222429-4573.jar (156 KB at 967.4 KB/sec)
[INFO]
[INFO] --- maven-clean-plugin:2.5:clean (default-clean) @ hadoop-hdfs-nfs ---
[INFO] Deleting <https://builds.apache.org/job/Hadoop-Hdfs-trunk/ws/hadoop-hdfs-project/hadoop-hdfs-nfs/target>
[INFO]
[INFO] --- maven-antrun-plugin:1.7:run (create-testdirs) @ hadoop-hdfs-nfs ---
[INFO] Executing tasks
main:
[mkdir] Created dir: <https://builds.apache.org/job/Hadoop-Hdfs-trunk/ws/hadoop-hdfs-project/hadoop-hdfs-nfs/target/test-dir>
[INFO] Executed tasks
[INFO]
[INFO] --- maven-resources-plugin:2.6:resources (default-resources) @ hadoop-hdfs-nfs ---
[INFO] Using 'UTF-8' encoding to copy filtered resources.
[INFO] skip non existing resourceDirectory <https://builds.apache.org/job/Hadoop-Hdfs-trunk/ws/hadoop-hdfs-project/hadoop-hdfs-nfs/src/main/resources>
[INFO]
[INFO] --- maven-compiler-plugin:3.1:compile (default-compile) @ hadoop-hdfs-nfs ---
[INFO] Compiling 17 source files to <https://builds.apache.org/job/Hadoop-Hdfs-trunk/ws/hadoop-hdfs-project/hadoop-hdfs-nfs/target/classes>
[INFO]
[INFO] --- maven-resources-plugin:2.6:testResources (default-testResources) @ hadoop-hdfs-nfs ---
[INFO] Using 'UTF-8' encoding to copy filtered resources.
[INFO] Copying 1 resource
[INFO]
[INFO] --- maven-compiler-plugin:3.1:testCompile (default-testCompile) @ hadoop-hdfs-nfs ---
[INFO] Compiling 13 source files to <https://builds.apache.org/job/Hadoop-Hdfs-trunk/ws/hadoop-hdfs-project/hadoop-hdfs-nfs/target/test-classes>
[INFO]
[INFO] --- maven-surefire-plugin:2.17:test (default-test) @ hadoop-hdfs-nfs ---
[INFO] Surefire report directory: <https://builds.apache.org/job/Hadoop-Hdfs-trunk/ws/hadoop-hdfs-project/hadoop-hdfs-nfs/target/surefire-reports>
-------------------------------------------------------
T E S T S
-------------------------------------------------------
-------------------------------------------------------
T E S T S
-------------------------------------------------------
Running org.apache.hadoop.hdfs.nfs.TestMountd
Tests run: 1, Failures: 0, Errors: 0, Skipped: 0, Time elapsed: 4.71 sec - in org.apache.hadoop.hdfs.nfs.TestMountd
Running org.apache.hadoop.hdfs.nfs.nfs3.TestNfs3Utils
Tests run: 1, Failures: 0, Errors: 0, Skipped: 0, Time elapsed: 0.304 sec - in org.apache.hadoop.hdfs.nfs.nfs3.TestNfs3Utils
Running org.apache.hadoop.hdfs.nfs.nfs3.TestReaddir
Tests run: 2, Failures: 0, Errors: 0, Skipped: 0, Time elapsed: 5.188 sec - in org.apache.hadoop.hdfs.nfs.nfs3.TestReaddir
Running org.apache.hadoop.hdfs.nfs.nfs3.TestClientAccessPrivilege
Tests run: 1, Failures: 0, Errors: 0, Skipped: 0, Time elapsed: 5.019 sec - in org.apache.hadoop.hdfs.nfs.nfs3.TestClientAccessPrivilege
Running org.apache.hadoop.hdfs.nfs.nfs3.TestNfs3HttpServer
Tests run: 1, Failures: 0, Errors: 0, Skipped: 0, Time elapsed: 5.368 sec - in org.apache.hadoop.hdfs.nfs.nfs3.TestNfs3HttpServer
Running org.apache.hadoop.hdfs.nfs.nfs3.TestRpcProgramNfs3
Tests run: 22, Failures: 0, Errors: 0, Skipped: 0, Time elapsed: 7.085 sec - in org.apache.hadoop.hdfs.nfs.nfs3.TestRpcProgramNfs3
Running org.apache.hadoop.hdfs.nfs.nfs3.TestDFSClientCache
Tests run: 3, Failures: 0, Errors: 0, Skipped: 0, Time elapsed: 1.636 sec - in org.apache.hadoop.hdfs.nfs.nfs3.TestDFSClientCache
Running org.apache.hadoop.hdfs.nfs.nfs3.TestWrites
Tests run: 10, Failures: 0, Errors: 0, Skipped: 0, Time elapsed: 19.862 sec - in org.apache.hadoop.hdfs.nfs.nfs3.TestWrites
Running org.apache.hadoop.hdfs.nfs.nfs3.TestOpenFileCtxCache
Tests run: 2, Failures: 0, Errors: 0, Skipped: 0, Time elapsed: 32.427 sec - in org.apache.hadoop.hdfs.nfs.nfs3.TestOpenFileCtxCache
Running org.apache.hadoop.hdfs.nfs.nfs3.TestOffsetRange
Tests run: 5, Failures: 0, Errors: 0, Skipped: 0, Time elapsed: 0.091 sec - in org.apache.hadoop.hdfs.nfs.nfs3.TestOffsetRange
Running org.apache.hadoop.hdfs.nfs.nfs3.TestExportsTable
Tests run: 1, Failures: 0, Errors: 0, Skipped: 0, Time elapsed: 4.628 sec - in org.apache.hadoop.hdfs.nfs.nfs3.TestExportsTable
Results :
Tests run: 49, Failures: 0, Errors: 0, Skipped: 0
[INFO]
[INFO] --- maven-jar-plugin:2.5:jar (default-jar) @ hadoop-hdfs-nfs ---
[INFO] Building jar: <https://builds.apache.org/job/Hadoop-Hdfs-trunk/ws/hadoop-hdfs-project/hadoop-hdfs-nfs/target/hadoop-hdfs-nfs-3.0.0-SNAPSHOT.jar>
[INFO]
[INFO] --- maven-source-plugin:2.3:jar-no-fork (hadoop-java-sources) @ hadoop-hdfs-nfs ---
[INFO] Building jar: <https://builds.apache.org/job/Hadoop-Hdfs-trunk/ws/hadoop-hdfs-project/hadoop-hdfs-nfs/target/hadoop-hdfs-nfs-3.0.0-SNAPSHOT-sources.jar>
[INFO]
[INFO] --- maven-source-plugin:2.3:test-jar-no-fork (hadoop-java-sources) @ hadoop-hdfs-nfs ---
[INFO] Building jar: <https://builds.apache.org/job/Hadoop-Hdfs-trunk/ws/hadoop-hdfs-project/hadoop-hdfs-nfs/target/hadoop-hdfs-nfs-3.0.0-SNAPSHOT-test-sources.jar>
[INFO]
[INFO] --- maven-enforcer-plugin:1.3.1:enforce (dist-enforce) @ hadoop-hdfs-nfs ---
[INFO]
[INFO] --- maven-site-plugin:3.4:attach-descriptor (attach-descriptor) @ hadoop-hdfs-nfs ---
[INFO]
[INFO] --- maven-javadoc-plugin:2.8.1:jar (module-javadocs) @ hadoop-hdfs-nfs ---
[INFO] Skipping javadoc generation
[INFO]
[INFO] --- maven-assembly-plugin:2.4:single (dist) @ hadoop-hdfs-nfs ---
[INFO] Reading assembly descriptor: ../../hadoop-assemblies/src/main/resources/assemblies/hadoop-hdfs-nfs-dist.xml
[WARNING] The following patterns were never triggered in this artifact exclusion filter:
o 'org.apache.hadoop:hadoop-common'
o 'org.slf4j:slf4j-api'
o 'org.slf4j:slf4j-log4j12'
o 'org.hsqldb:hsqldb'
[INFO] Copying files to <https://builds.apache.org/job/Hadoop-Hdfs-trunk/ws/hadoop-hdfs-project/hadoop-hdfs-nfs/target/hadoop-hdfs-nfs-3.0.0-SNAPSHOT>
[INFO]
[INFO] --- maven-enforcer-plugin:1.3.1:enforce (depcheck) @ hadoop-hdfs-nfs ---
[INFO]
[INFO] --- maven-checkstyle-plugin:2.15:checkstyle (default-cli) @ hadoop-hdfs-nfs ---
[INFO] There are 143 errors reported by Checkstyle 6.6 with checkstyle/checkstyle.xml ruleset.
[WARNING] Unable to locate Source XRef to link to - DISABLED
[INFO]
[INFO] --- findbugs-maven-plugin:3.0.0:findbugs (default-cli) @ hadoop-hdfs-nfs ---
[INFO] Fork Value is true
[INFO] Done FindBugs Analysis....
[INFO]
[INFO] ------------------------------------------------------------------------
[INFO] Building Apache Hadoop HDFS Project 3.0.0-SNAPSHOT
[INFO] ------------------------------------------------------------------------
[INFO]
[INFO] --- maven-clean-plugin:2.5:clean (default-clean) @ hadoop-hdfs-project ---
[INFO] Deleting <https://builds.apache.org/job/Hadoop-Hdfs-trunk/ws/hadoop-hdfs-project/target>
[INFO]
[INFO] --- maven-antrun-plugin:1.7:run (create-testdirs) @ hadoop-hdfs-project ---
[INFO] Executing tasks
main:
[mkdir] Created dir: <https://builds.apache.org/job/Hadoop-Hdfs-trunk/ws/hadoop-hdfs-project/target/test-dir>
[INFO] Executed tasks
[INFO]
[INFO] --- maven-source-plugin:2.3:jar-no-fork (hadoop-java-sources) @ hadoop-hdfs-project ---
[INFO]
[INFO] --- maven-source-plugin:2.3:test-jar-no-fork (hadoop-java-sources) @ hadoop-hdfs-project ---
[INFO]
[INFO] --- maven-enforcer-plugin:1.3.1:enforce (dist-enforce) @ hadoop-hdfs-project ---
[INFO]
[INFO] --- maven-site-plugin:3.4:attach-descriptor (attach-descriptor) @ hadoop-hdfs-project ---
[INFO]
[INFO] --- maven-javadoc-plugin:2.8.1:jar (module-javadocs) @ hadoop-hdfs-project ---
[INFO] Skipping javadoc generation
[INFO]
[INFO] --- maven-enforcer-plugin:1.3.1:enforce (depcheck) @ hadoop-hdfs-project ---
[INFO]
[INFO] --- maven-checkstyle-plugin:2.15:checkstyle (default-cli) @ hadoop-hdfs-project ---
[INFO]
[INFO] --- findbugs-maven-plugin:3.0.0:findbugs (default-cli) @ hadoop-hdfs-project ---
[INFO] ------------------------------------------------------------------------
[INFO] Reactor Summary:
[INFO]
[INFO] Apache Hadoop HDFS Client ......................... SUCCESS [04:24 min]
[INFO] Apache Hadoop HDFS ................................ SUCCESS [ 03:18 h]
[INFO] Apache Hadoop HDFS Native Client .................. SUCCESS [ 22.494 s]
[INFO] Apache Hadoop HttpFS .............................. FAILURE [03:36 min]
[INFO] Apache Hadoop HDFS BookKeeper Journal ............. SUCCESS [04:07 min]
[INFO] Apache Hadoop HDFS-NFS ............................ SUCCESS [01:49 min]
[INFO] Apache Hadoop HDFS Project ........................ SUCCESS [ 0.051 s]
[INFO] ------------------------------------------------------------------------
[INFO] BUILD FAILURE
[INFO] ------------------------------------------------------------------------
[INFO] Total time: 03:32 h
[INFO] Finished at: 2016-02-19T00:07:56+00:00
[INFO] Final Memory: 97M/1357M
[INFO] ------------------------------------------------------------------------
[ERROR] Failed to execute goal org.apache.maven.plugins:maven-assembly-plugin:2.4:single (dist) on project hadoop-hdfs-httpfs: Error reading assemblies: Descriptor with ID 'hadoop-httpfs-dist' not found -> [Help 1]
[ERROR]
[ERROR] To see the full stack trace of the errors, re-run Maven with the -e switch.
[ERROR] Re-run Maven using the -X switch to enable full debug logging.
[ERROR]
[ERROR] For more information about the errors and possible solutions, please read the following articles:
[ERROR] [Help 1] http://cwiki.apache.org/confluence/display/MAVEN/MojoExecutionException
[ERROR]
[ERROR] After correcting the problems, you can resume the build with the command
[ERROR] mvn <goals> -rf :hadoop-hdfs-httpfs
Build step 'Execute shell' marked build as failure
Archiving artifacts
Recording test results
Jenkins build is back to normal : Hadoop-Hdfs-trunk #2848
Posted by Apache Jenkins Server <je...@builds.apache.org>.
See <https://builds.apache.org/job/Hadoop-Hdfs-trunk/2848/changes>