You are viewing a plain text version of this content. The canonical link for it is here.
Posted to dev@kafka.apache.org by Apache Jenkins Server <je...@builds.apache.org> on 2022/05/18 17:28:09 UTC

Jenkins build is unstable: Kafka » Kafka Branch Builder » trunk #941

See <https://ci-builds.apache.org/job/Kafka/job/kafka/job/trunk/941/display/redirect>


Build failed in Jenkins: Kafka » Kafka Branch Builder » trunk #942

Posted by Apache Jenkins Server <je...@builds.apache.org>.
See <https://ci-builds.apache.org/job/Kafka/job/kafka/job/trunk/942/display/redirect>

Changes:


------------------------------------------
[...truncated 628464 lines...]
[2022-05-18T20:03:32.591Z] org.apache.kafka.streams.integration.StoreUpgradeIntegrationTest > shouldMigratePersistentKeyValueStoreToTimestampedKeyValueStoreUsingPapi PASSED
[2022-05-18T20:03:32.591Z] 
[2022-05-18T20:03:32.591Z] org.apache.kafka.streams.integration.StoreUpgradeIntegrationTest > shouldMigratePersistentWindowStoreToTimestampedWindowStoreUsingPapi STARTED
[2022-05-18T20:04:24.858Z] 
[2022-05-18T20:04:24.858Z] org.apache.kafka.streams.integration.StoreUpgradeIntegrationTest > shouldMigratePersistentWindowStoreToTimestampedWindowStoreUsingPapi PASSED
[2022-05-18T20:04:24.858Z] 
[2022-05-18T20:04:24.858Z] org.apache.kafka.streams.integration.StoreUpgradeIntegrationTest > shouldProxyKeyValueStoreToTimestampedKeyValueStoreUsingPapi STARTED
[2022-05-18T20:05:11.985Z] 
[2022-05-18T20:05:11.985Z] org.apache.kafka.streams.integration.StoreUpgradeIntegrationTest > shouldProxyKeyValueStoreToTimestampedKeyValueStoreUsingPapi PASSED
[2022-05-18T20:05:11.985Z] 
[2022-05-18T20:05:11.985Z] org.apache.kafka.streams.integration.StoreUpgradeIntegrationTest > shouldMigrateInMemoryWindowStoreToTimestampedWindowStoreUsingPapi STARTED
[2022-05-18T20:05:58.846Z] 
[2022-05-18T20:05:58.846Z] org.apache.kafka.streams.integration.StoreUpgradeIntegrationTest > shouldMigrateInMemoryWindowStoreToTimestampedWindowStoreUsingPapi PASSED
[2022-05-18T20:05:58.846Z] 
[2022-05-18T20:05:58.846Z] org.apache.kafka.streams.integration.StreamTableJoinIntegrationTest > testInner[caching enabled = true] STARTED
[2022-05-18T20:06:04.312Z] 
[2022-05-18T20:06:04.312Z] org.apache.kafka.streams.integration.StreamTableJoinIntegrationTest > testInner[caching enabled = true] PASSED
[2022-05-18T20:06:04.312Z] 
[2022-05-18T20:06:04.312Z] org.apache.kafka.streams.integration.StreamTableJoinIntegrationTest > testLeft[caching enabled = true] STARTED
[2022-05-18T20:06:08.870Z] 
[2022-05-18T20:06:08.870Z] org.apache.kafka.streams.integration.StreamTableJoinIntegrationTest > testLeft[caching enabled = true] PASSED
[2022-05-18T20:06:08.870Z] 
[2022-05-18T20:06:08.870Z] org.apache.kafka.streams.integration.StreamTableJoinIntegrationTest > testInner[caching enabled = false] STARTED
[2022-05-18T20:06:13.125Z] 
[2022-05-18T20:06:13.125Z] org.apache.kafka.streams.integration.StreamTableJoinIntegrationTest > testInner[caching enabled = false] PASSED
[2022-05-18T20:06:13.125Z] 
[2022-05-18T20:06:13.125Z] org.apache.kafka.streams.integration.StreamTableJoinIntegrationTest > testLeft[caching enabled = false] STARTED
[2022-05-18T20:06:16.421Z] 
[2022-05-18T20:06:16.421Z] org.apache.kafka.streams.integration.StreamTableJoinIntegrationTest > testLeft[caching enabled = false] PASSED
[2022-05-18T20:06:16.421Z] 
[2022-05-18T20:06:16.421Z] org.apache.kafka.streams.integration.StreamsUncaughtExceptionHandlerIntegrationTest > shouldReplaceThreads STARTED
[2022-05-18T20:06:17.464Z] 
[2022-05-18T20:06:17.464Z] Exception: java.lang.AssertionError thrown from the UncaughtExceptionHandler in thread "appId_StreamsUncaughtExceptionHandlerIntegrationTestnull-3ceefbbc-d3a7-4871-9a4a-4f5e39b6b673-StreamThread-1"
[2022-05-18T20:06:20.727Z] 
[2022-05-18T20:06:20.727Z] Exception: java.lang.AssertionError thrown from the UncaughtExceptionHandler in thread "appId_StreamsUncaughtExceptionHandlerIntegrationTestnull-3ceefbbc-d3a7-4871-9a4a-4f5e39b6b673-StreamThread-2"
[2022-05-18T20:06:23.996Z] 
[2022-05-18T20:06:23.996Z] org.apache.kafka.streams.integration.StreamsUncaughtExceptionHandlerIntegrationTest > shouldReplaceThreads PASSED
[2022-05-18T20:06:23.996Z] 
[2022-05-18T20:06:23.996Z] org.apache.kafka.streams.integration.StreamsUncaughtExceptionHandlerIntegrationTest > shouldShutdownClientWhenIllegalStateException STARTED
[2022-05-18T20:06:29.499Z] 
[2022-05-18T20:06:29.499Z] org.apache.kafka.streams.integration.StreamsUncaughtExceptionHandlerIntegrationTest > shouldShutdownClientWhenIllegalStateException PASSED
[2022-05-18T20:06:29.499Z] 
[2022-05-18T20:06:29.499Z] org.apache.kafka.streams.integration.StreamsUncaughtExceptionHandlerIntegrationTest > shouldShutdownThreadUsingOldHandler STARTED
[2022-05-18T20:06:34.006Z] 
[2022-05-18T20:06:34.006Z] org.apache.kafka.streams.integration.StreamsUncaughtExceptionHandlerIntegrationTest > shouldShutdownThreadUsingOldHandler PASSED
[2022-05-18T20:06:34.006Z] 
[2022-05-18T20:06:34.006Z] org.apache.kafka.streams.integration.StreamsUncaughtExceptionHandlerIntegrationTest > shouldShutDownClientIfGlobalStreamThreadWantsToReplaceThread STARTED
[2022-05-18T20:06:36.100Z] 
[2022-05-18T20:06:36.100Z] Exception: java.lang.AssertionError thrown from the UncaughtExceptionHandler in thread "appId_StreamsUncaughtExceptionHandlerIntegrationTestnull-fcf5646b-df38-4abb-a771-49c8ed577140-GlobalStreamThread"
[2022-05-18T20:06:36.100Z] 
[2022-05-18T20:06:36.100Z] org.apache.kafka.streams.integration.StreamsUncaughtExceptionHandlerIntegrationTest > shouldShutDownClientIfGlobalStreamThreadWantsToReplaceThread PASSED
[2022-05-18T20:06:36.100Z] 
[2022-05-18T20:06:36.100Z] org.apache.kafka.streams.integration.StreamsUncaughtExceptionHandlerIntegrationTest > shouldShutdownClientWhenIllegalArgumentException STARTED
[2022-05-18T20:06:38.451Z] 
[2022-05-18T20:06:38.451Z] org.apache.kafka.streams.integration.StreamsUncaughtExceptionHandlerIntegrationTest > shouldShutdownClientWhenIllegalArgumentException PASSED
[2022-05-18T20:06:38.451Z] 
[2022-05-18T20:06:38.451Z] org.apache.kafka.streams.integration.StreamsUncaughtExceptionHandlerIntegrationTest > shouldReplaceSingleThread STARTED
[2022-05-18T20:06:40.818Z] 
[2022-05-18T20:06:40.818Z] Exception: java.lang.AssertionError thrown from the UncaughtExceptionHandler in thread "appId_StreamsUncaughtExceptionHandlerIntegrationTestnull-3af7d56f-45e1-4199-a84d-988a19e82281-StreamThread-1"
[2022-05-18T20:06:40.818Z] 
[2022-05-18T20:06:40.818Z] org.apache.kafka.streams.integration.StreamsUncaughtExceptionHandlerIntegrationTest > shouldReplaceSingleThread PASSED
[2022-05-18T20:06:40.818Z] 
[2022-05-18T20:06:40.818Z] org.apache.kafka.streams.integration.StreamsUncaughtExceptionHandlerIntegrationTest > shouldShutdownMultipleThreadApplication STARTED
[2022-05-18T20:06:52.857Z] 
[2022-05-18T20:06:52.858Z] org.apache.kafka.streams.integration.StreamsUncaughtExceptionHandlerIntegrationTest > shouldShutdownMultipleThreadApplication PASSED
[2022-05-18T20:06:52.858Z] 
[2022-05-18T20:06:52.858Z] org.apache.kafka.streams.integration.StreamsUncaughtExceptionHandlerIntegrationTest > shouldShutdownClient STARTED
[2022-05-18T20:06:57.047Z] 
[2022-05-18T20:06:57.047Z] org.apache.kafka.streams.integration.StreamsUncaughtExceptionHandlerIntegrationTest > shouldShutdownClient PASSED
[2022-05-18T20:06:57.047Z] 
[2022-05-18T20:06:57.047Z] org.apache.kafka.streams.integration.StreamsUncaughtExceptionHandlerIntegrationTest > shouldShutdownSingleThreadApplication STARTED
[2022-05-18T20:07:05.828Z] 
[2022-05-18T20:07:05.828Z] org.apache.kafka.streams.integration.StreamsUncaughtExceptionHandlerIntegrationTest > shouldShutdownSingleThreadApplication PASSED
[2022-05-18T20:07:05.828Z] 
[2022-05-18T20:07:05.828Z] org.apache.kafka.streams.integration.StreamsUncaughtExceptionHandlerIntegrationTest > shouldEmitSameRecordAfterFailover STARTED
[2022-05-18T20:07:11.200Z] 
[2022-05-18T20:07:11.200Z] org.apache.kafka.streams.integration.StreamsUncaughtExceptionHandlerIntegrationTest > shouldEmitSameRecordAfterFailover PASSED
[2022-05-18T20:07:13.292Z] 
[2022-05-18T20:07:13.292Z] org.apache.kafka.streams.integration.SuppressionDurabilityIntegrationTest > shouldRecoverBufferAfterShutdown[at_least_once] STARTED
[2022-05-18T20:08:05.862Z] 
[2022-05-18T20:08:05.862Z] org.apache.kafka.streams.integration.SuppressionDurabilityIntegrationTest > shouldRecoverBufferAfterShutdown[at_least_once] PASSED
[2022-05-18T20:08:05.862Z] 
[2022-05-18T20:08:05.862Z] org.apache.kafka.streams.integration.SuppressionDurabilityIntegrationTest > shouldRecoverBufferAfterShutdown[exactly_once] STARTED
[2022-05-18T20:09:07.019Z] 
[2022-05-18T20:09:07.019Z] org.apache.kafka.streams.integration.SuppressionDurabilityIntegrationTest > shouldRecoverBufferAfterShutdown[exactly_once] PASSED
[2022-05-18T20:09:07.019Z] 
[2022-05-18T20:09:07.019Z] org.apache.kafka.streams.integration.SuppressionDurabilityIntegrationTest > shouldRecoverBufferAfterShutdown[exactly_once_v2] STARTED
[2022-05-18T20:09:52.899Z] 
[2022-05-18T20:09:52.899Z] org.apache.kafka.streams.integration.SuppressionDurabilityIntegrationTest > shouldRecoverBufferAfterShutdown[exactly_once_v2] PASSED
[2022-05-18T20:09:53.848Z] 
[2022-05-18T20:09:53.848Z] org.apache.kafka.streams.integration.TableTableJoinIntegrationTest > testLeftInner[caching enabled = true] STARTED
[2022-05-18T20:10:04.328Z] 
[2022-05-18T20:10:04.328Z] org.apache.kafka.streams.integration.TableTableJoinIntegrationTest > testLeftInner[caching enabled = true] PASSED
[2022-05-18T20:10:04.328Z] 
[2022-05-18T20:10:04.328Z] org.apache.kafka.streams.integration.TableTableJoinIntegrationTest > testLeftOuter[caching enabled = true] STARTED
[2022-05-18T20:10:19.519Z] 
[2022-05-18T20:10:19.519Z] org.apache.kafka.streams.integration.TableTableJoinIntegrationTest > testLeftOuter[caching enabled = true] PASSED
[2022-05-18T20:10:19.519Z] 
[2022-05-18T20:10:19.519Z] org.apache.kafka.streams.integration.TableTableJoinIntegrationTest > testLeftLeft[caching enabled = true] STARTED
[2022-05-18T20:10:27.938Z] 
[2022-05-18T20:10:27.938Z] org.apache.kafka.streams.integration.TableTableJoinIntegrationTest > testLeftLeft[caching enabled = true] PASSED
[2022-05-18T20:10:27.938Z] 
[2022-05-18T20:10:27.938Z] org.apache.kafka.streams.integration.TableTableJoinIntegrationTest > testOuterLeft[caching enabled = true] STARTED
[2022-05-18T20:10:38.351Z] 
[2022-05-18T20:10:38.351Z] org.apache.kafka.streams.integration.TableTableJoinIntegrationTest > testOuterLeft[caching enabled = true] PASSED
[2022-05-18T20:10:38.351Z] 
[2022-05-18T20:10:38.351Z] org.apache.kafka.streams.integration.TableTableJoinIntegrationTest > testInner[caching enabled = true] STARTED
[2022-05-18T20:10:48.567Z] 
[2022-05-18T20:10:48.567Z] org.apache.kafka.streams.integration.TableTableJoinIntegrationTest > testInner[caching enabled = true] PASSED
[2022-05-18T20:10:48.567Z] 
[2022-05-18T20:10:48.567Z] org.apache.kafka.streams.integration.TableTableJoinIntegrationTest > testOuter[caching enabled = true] STARTED
[2022-05-18T20:10:58.337Z] 
[2022-05-18T20:10:58.337Z] org.apache.kafka.streams.integration.TableTableJoinIntegrationTest > testOuter[caching enabled = true] PASSED
[2022-05-18T20:10:58.337Z] 
[2022-05-18T20:10:58.337Z] org.apache.kafka.streams.integration.TableTableJoinIntegrationTest > testLeft[caching enabled = true] STARTED
[2022-05-18T20:11:10.725Z] 
[2022-05-18T20:11:10.725Z] org.apache.kafka.streams.integration.TableTableJoinIntegrationTest > testLeft[caching enabled = true] PASSED
[2022-05-18T20:11:10.725Z] 
[2022-05-18T20:11:10.725Z] org.apache.kafka.streams.integration.TableTableJoinIntegrationTest > testInnerInner[caching enabled = true] STARTED
[2022-05-18T20:11:20.988Z] 
[2022-05-18T20:11:20.988Z] org.apache.kafka.streams.integration.TableTableJoinIntegrationTest > testInnerInner[caching enabled = true] PASSED
[2022-05-18T20:11:20.988Z] 
[2022-05-18T20:11:20.988Z] org.apache.kafka.streams.integration.TableTableJoinIntegrationTest > testInnerOuter[caching enabled = true] STARTED
[2022-05-18T20:11:28.253Z] 
[2022-05-18T20:11:28.253Z] org.apache.kafka.streams.integration.TableTableJoinIntegrationTest > testInnerOuter[caching enabled = true] PASSED
[2022-05-18T20:11:28.253Z] 
[2022-05-18T20:11:28.253Z] org.apache.kafka.streams.integration.TableTableJoinIntegrationTest > testInnerLeft[caching enabled = true] STARTED
[2022-05-18T20:11:37.119Z] 
[2022-05-18T20:11:37.119Z] org.apache.kafka.streams.integration.TableTableJoinIntegrationTest > testInnerLeft[caching enabled = true] PASSED
[2022-05-18T20:11:37.119Z] 
[2022-05-18T20:11:37.119Z] org.apache.kafka.streams.integration.TableTableJoinIntegrationTest > testOuterInner[caching enabled = true] STARTED
[2022-05-18T20:11:48.633Z] 
[2022-05-18T20:11:48.633Z] org.apache.kafka.streams.integration.TableTableJoinIntegrationTest > testOuterInner[caching enabled = true] PASSED
[2022-05-18T20:11:48.633Z] 
[2022-05-18T20:11:48.633Z] org.apache.kafka.streams.integration.TableTableJoinIntegrationTest > testOuterOuter[caching enabled = true] STARTED
[2022-05-18T20:11:57.484Z] 
[2022-05-18T20:11:57.484Z] org.apache.kafka.streams.integration.TableTableJoinIntegrationTest > testOuterOuter[caching enabled = true] PASSED
[2022-05-18T20:11:57.484Z] 
[2022-05-18T20:11:57.484Z] org.apache.kafka.streams.integration.TableTableJoinIntegrationTest > testLeftInner[caching enabled = false] STARTED
[2022-05-18T20:12:09.739Z] 
[2022-05-18T20:12:09.739Z] org.apache.kafka.streams.integration.TableTableJoinIntegrationTest > testLeftInner[caching enabled = false] PASSED
[2022-05-18T20:12:09.739Z] 
[2022-05-18T20:12:09.739Z] org.apache.kafka.streams.integration.TableTableJoinIntegrationTest > testLeftOuter[caching enabled = false] STARTED
[2022-05-18T20:12:19.078Z] 
[2022-05-18T20:12:19.078Z] org.apache.kafka.streams.integration.TableTableJoinIntegrationTest > testLeftOuter[caching enabled = false] PASSED
[2022-05-18T20:12:19.078Z] 
[2022-05-18T20:12:19.078Z] org.apache.kafka.streams.integration.TableTableJoinIntegrationTest > testLeftLeft[caching enabled = false] STARTED
[2022-05-18T20:12:29.181Z] 
[2022-05-18T20:12:29.181Z] org.apache.kafka.streams.integration.TableTableJoinIntegrationTest > testLeftLeft[caching enabled = false] PASSED
[2022-05-18T20:12:29.181Z] 
[2022-05-18T20:12:29.181Z] org.apache.kafka.streams.integration.TableTableJoinIntegrationTest > testOuterLeft[caching enabled = false] STARTED
[2022-05-18T20:12:39.510Z] 
[2022-05-18T20:12:39.510Z] org.apache.kafka.streams.integration.TableTableJoinIntegrationTest > testOuterLeft[caching enabled = false] PASSED
[2022-05-18T20:12:39.510Z] 
[2022-05-18T20:12:39.510Z] org.apache.kafka.streams.integration.TableTableJoinIntegrationTest > testInner[caching enabled = false] STARTED
[2022-05-18T20:12:48.457Z] 
[2022-05-18T20:12:48.457Z] org.apache.kafka.streams.integration.TableTableJoinIntegrationTest > testInner[caching enabled = false] PASSED
[2022-05-18T20:12:48.457Z] 
[2022-05-18T20:12:48.457Z] org.apache.kafka.streams.integration.TableTableJoinIntegrationTest > testOuter[caching enabled = false] STARTED
[2022-05-18T20:13:00.707Z] 
[2022-05-18T20:13:00.707Z] org.apache.kafka.streams.integration.TableTableJoinIntegrationTest > testOuter[caching enabled = false] PASSED
[2022-05-18T20:13:00.707Z] 
[2022-05-18T20:13:00.707Z] org.apache.kafka.streams.integration.TableTableJoinIntegrationTest > testLeft[caching enabled = false] STARTED
[2022-05-18T20:13:15.050Z] 
[2022-05-18T20:13:15.050Z] org.apache.kafka.streams.integration.TableTableJoinIntegrationTest > testLeft[caching enabled = false] PASSED
[2022-05-18T20:13:15.050Z] 
[2022-05-18T20:13:15.050Z] org.apache.kafka.streams.integration.TableTableJoinIntegrationTest > testInnerInner[caching enabled = false] STARTED
[2022-05-18T20:13:27.253Z] 
[2022-05-18T20:13:27.253Z] org.apache.kafka.streams.integration.TableTableJoinIntegrationTest > testInnerInner[caching enabled = false] PASSED
[2022-05-18T20:13:27.253Z] 
[2022-05-18T20:13:27.253Z] org.apache.kafka.streams.integration.TableTableJoinIntegrationTest > testInnerOuter[caching enabled = false] STARTED
[2022-05-18T20:13:41.142Z] 
[2022-05-18T20:13:41.142Z] org.apache.kafka.streams.integration.TableTableJoinIntegrationTest > testInnerOuter[caching enabled = false] PASSED
[2022-05-18T20:13:41.142Z] 
[2022-05-18T20:13:41.142Z] org.apache.kafka.streams.integration.TableTableJoinIntegrationTest > testInnerLeft[caching enabled = false] STARTED
[2022-05-18T20:13:55.074Z] 
[2022-05-18T20:13:55.074Z] org.apache.kafka.streams.integration.TableTableJoinIntegrationTest > testInnerLeft[caching enabled = false] PASSED
[2022-05-18T20:13:55.074Z] 
[2022-05-18T20:13:55.074Z] org.apache.kafka.streams.integration.TableTableJoinIntegrationTest > testOuterInner[caching enabled = false] STARTED
[2022-05-18T20:14:07.921Z] 
[2022-05-18T20:14:07.921Z] org.apache.kafka.streams.integration.TableTableJoinIntegrationTest > testOuterInner[caching enabled = false] PASSED
[2022-05-18T20:14:07.921Z] 
[2022-05-18T20:14:07.921Z] org.apache.kafka.streams.integration.TableTableJoinIntegrationTest > testOuterOuter[caching enabled = false] STARTED
[2022-05-18T20:14:20.051Z] 
[2022-05-18T20:14:20.051Z] org.apache.kafka.streams.integration.TableTableJoinIntegrationTest > testOuterOuter[caching enabled = false] PASSED
[2022-05-18T20:14:20.051Z] 
[2022-05-18T20:14:20.051Z] org.apache.kafka.streams.integration.TaskMetadataIntegrationTest > shouldReportCorrectEndOffsetInformation STARTED
[2022-05-18T20:14:21.171Z] 
[2022-05-18T20:14:21.171Z] org.apache.kafka.streams.integration.TaskMetadataIntegrationTest > shouldReportCorrectEndOffsetInformation PASSED
[2022-05-18T20:14:21.171Z] 
[2022-05-18T20:14:21.171Z] org.apache.kafka.streams.integration.TaskMetadataIntegrationTest > shouldReportCorrectCommittedOffsetInformation STARTED
[2022-05-18T20:14:23.635Z] 
[2022-05-18T20:14:23.635Z] org.apache.kafka.streams.integration.TaskMetadataIntegrationTest > shouldReportCorrectCommittedOffsetInformation PASSED
[2022-05-18T20:14:28.070Z] streams-1: SMOKE-TEST-CLIENT-CLOSED
[2022-05-18T20:14:28.070Z] streams-2: SMOKE-TEST-CLIENT-CLOSED
[2022-05-18T20:14:28.070Z] streams-4: SMOKE-TEST-CLIENT-CLOSED
[2022-05-18T20:14:28.070Z] streams-3: SMOKE-TEST-CLIENT-CLOSED
[2022-05-18T20:14:28.070Z] streams-0: SMOKE-TEST-CLIENT-CLOSED
[2022-05-18T20:14:28.070Z] streams-5: SMOKE-TEST-CLIENT-CLOSED
[2022-05-18T20:14:28.070Z] 
[2022-05-18T20:14:28.070Z] > Task :streams:integrationTest FAILED
[2022-05-18T20:14:28.070Z] 
[2022-05-18T20:14:28.070Z] FAILURE: Build failed with an exception.
[2022-05-18T20:14:28.070Z] 
[2022-05-18T20:14:28.070Z] * What went wrong:
[2022-05-18T20:14:28.070Z] Execution failed for task ':streams:integrationTest'.
[2022-05-18T20:14:28.070Z] > Process 'Gradle Test Executor 161' finished with non-zero exit value 1
[2022-05-18T20:14:28.070Z]   This problem might be caused by incorrect test process configuration.
[2022-05-18T20:14:28.070Z]   Please refer to the test execution section in the User Manual at https://docs.gradle.org/7.4.2/userguide/java_testing.html#sec:test_execution
[2022-05-18T20:14:28.070Z] 
[2022-05-18T20:14:28.070Z] * Try:
[2022-05-18T20:14:28.070Z] > Run with --stacktrace option to get the stack trace.
[2022-05-18T20:14:28.070Z] > Run with --info or --debug option to get more log output.
[2022-05-18T20:14:28.070Z] > Run with --scan to get full insights.
[2022-05-18T20:14:28.070Z] 
[2022-05-18T20:14:28.070Z] * Get more help at https://help.gradle.org
[2022-05-18T20:14:28.070Z] 
[2022-05-18T20:14:28.070Z] BUILD FAILED in 2h 39m 40s
[2022-05-18T20:14:28.070Z] 209 actionable tasks: 113 executed, 96 up-to-date
[2022-05-18T20:14:29.287Z] 
[2022-05-18T20:14:29.287Z] See the profiling report at: file:///home/jenkins/workspace/Kafka_kafka_trunk/build/reports/profile/profile-2022-05-18-17-34-51.html
[2022-05-18T20:14:29.287Z] A fine-grained performance profile is available: use the --scan option.
[Pipeline] }
[Pipeline] // withEnv
[Pipeline] }
[Pipeline] // withEnv
[Pipeline] }
[Pipeline] // withEnv
[Pipeline] }
[Pipeline] // node
[Pipeline] }
[Pipeline] // timestamps
[Pipeline] }
[Pipeline] // timeout
[Pipeline] }
[Pipeline] // stage
[Pipeline] }
Failed in branch JDK 11 and Scala 2.12
[Pipeline] // parallel
[Pipeline] }
[Pipeline] // stage
[Pipeline] stage
[Pipeline] { (Declarative: Post Actions)
[Pipeline] node
Running on builds29 in /home/jenkins/workspace/Kafka_kafka_trunk
[Pipeline] {
[Pipeline] script
[Pipeline] {
[Pipeline] step