You are viewing a plain text version of this content. The canonical link for it is here.
Posted to dev@kafka.apache.org by Apache Jenkins Server <je...@builds.apache.org> on 2020/07/29 04:12:41 UTC

Build failed in Jenkins: kafka-trunk-jdk8 #4749

See <https://builds.apache.org/job/kafka-trunk-jdk8/4749/display/redirect?page=changes>

Changes:

[github] KAFKA-10224: Update jersey license from CDDL to EPLv2 (#9089)


------------------------------------------
[...truncated 2.76 MB...]
org.apache.kafka.streams.integration.KTableKTableForeignKeyJoinIntegrationTest > joinShouldProduceNullsWhenValueHasNonMatchingForeignKey[leftJoin=false, optimization=none, materialized=false, rejoin=true] STARTED

org.apache.kafka.streams.integration.KTableKTableForeignKeyJoinIntegrationTest > joinShouldProduceNullsWhenValueHasNonMatchingForeignKey[leftJoin=false, optimization=none, materialized=false, rejoin=true] PASSED

org.apache.kafka.streams.integration.KTableKTableForeignKeyJoinIntegrationTest > doJoinFromLeftThenDeleteLeftEntity[leftJoin=false, optimization=none, materialized=false, rejoin=true] STARTED

org.apache.kafka.streams.integration.KTableKTableForeignKeyJoinIntegrationTest > doJoinFromLeftThenDeleteLeftEntity[leftJoin=false, optimization=none, materialized=false, rejoin=true] PASSED

org.apache.kafka.streams.integration.KTableKTableForeignKeyJoinIntegrationTest > doJoinFromRightThenDeleteRightEntity[leftJoin=false, optimization=none, materialized=false, rejoin=true] STARTED

org.apache.kafka.streams.integration.KTableKTableForeignKeyJoinIntegrationTest > doJoinFromRightThenDeleteRightEntity[leftJoin=false, optimization=none, materialized=false, rejoin=true] PASSED

org.apache.kafka.streams.integration.KTableKTableForeignKeyJoinIntegrationTest > shouldUnsubscribeOldForeignKeyIfLeftSideIsUpdated[leftJoin=false, optimization=none, materialized=false, rejoin=false] STARTED

org.apache.kafka.streams.integration.KTableKTableForeignKeyJoinIntegrationTest > shouldUnsubscribeOldForeignKeyIfLeftSideIsUpdated[leftJoin=false, optimization=none, materialized=false, rejoin=false] PASSED

org.apache.kafka.streams.integration.KTableKTableForeignKeyJoinIntegrationTest > shouldNotEmitTombstonesWhenDeletingNonExistingRecords[leftJoin=false, optimization=none, materialized=false, rejoin=false] STARTED

org.apache.kafka.streams.integration.KTableKTableForeignKeyJoinIntegrationTest > shouldNotEmitTombstonesWhenDeletingNonExistingRecords[leftJoin=false, optimization=none, materialized=false, rejoin=false] PASSED

org.apache.kafka.streams.integration.KTableKTableForeignKeyJoinIntegrationTest > shouldEmitTombstoneWhenDeletingNonJoiningRecords[leftJoin=false, optimization=none, materialized=false, rejoin=false] STARTED

org.apache.kafka.streams.integration.KTableKTableForeignKeyJoinIntegrationTest > shouldEmitTombstoneWhenDeletingNonJoiningRecords[leftJoin=false, optimization=none, materialized=false, rejoin=false] PASSED

org.apache.kafka.streams.integration.KTableKTableForeignKeyJoinIntegrationTest > joinShouldProduceNullsWhenValueHasNonMatchingForeignKey[leftJoin=false, optimization=none, materialized=false, rejoin=false] STARTED

org.apache.kafka.streams.integration.KTableKTableForeignKeyJoinIntegrationTest > joinShouldProduceNullsWhenValueHasNonMatchingForeignKey[leftJoin=false, optimization=none, materialized=false, rejoin=false] PASSED

org.apache.kafka.streams.integration.KTableKTableForeignKeyJoinIntegrationTest > doJoinFromLeftThenDeleteLeftEntity[leftJoin=false, optimization=none, materialized=false, rejoin=false] STARTED

org.apache.kafka.streams.integration.KTableKTableForeignKeyJoinIntegrationTest > doJoinFromLeftThenDeleteLeftEntity[leftJoin=false, optimization=none, materialized=false, rejoin=false] PASSED

org.apache.kafka.streams.integration.KTableKTableForeignKeyJoinIntegrationTest > doJoinFromRightThenDeleteRightEntity[leftJoin=false, optimization=none, materialized=false, rejoin=false] STARTED

org.apache.kafka.streams.integration.KTableKTableForeignKeyJoinIntegrationTest > doJoinFromRightThenDeleteRightEntity[leftJoin=false, optimization=none, materialized=false, rejoin=false] PASSED

org.apache.kafka.streams.integration.SuppressionDurabilityIntegrationTest > shouldRecoverBufferAfterShutdown[at_least_once] STARTED

org.apache.kafka.streams.integration.SuppressionDurabilityIntegrationTest > shouldRecoverBufferAfterShutdown[at_least_once] PASSED

org.apache.kafka.streams.integration.SuppressionDurabilityIntegrationTest > shouldRecoverBufferAfterShutdown[exactly_once] STARTED

org.apache.kafka.streams.integration.SuppressionDurabilityIntegrationTest > shouldRecoverBufferAfterShutdown[exactly_once] PASSED

org.apache.kafka.streams.integration.SuppressionDurabilityIntegrationTest > shouldRecoverBufferAfterShutdown[exactly_once_beta] STARTED

org.apache.kafka.streams.integration.SuppressionDurabilityIntegrationTest > shouldRecoverBufferAfterShutdown[exactly_once_beta] PASSED

org.apache.kafka.streams.integration.RocksDBMetricsIntegrationTest > shouldExposeRocksDBMetricsBeforeAndAfterFailureWithEmptyStateDir[at_least_once] STARTED

org.apache.kafka.streams.integration.RocksDBMetricsIntegrationTest > shouldExposeRocksDBMetricsBeforeAndAfterFailureWithEmptyStateDir[at_least_once] PASSED

org.apache.kafka.streams.integration.RocksDBMetricsIntegrationTest > shouldExposeRocksDBMetricsBeforeAndAfterFailureWithEmptyStateDir[exactly_once] STARTED

org.apache.kafka.streams.integration.RocksDBMetricsIntegrationTest > shouldExposeRocksDBMetricsBeforeAndAfterFailureWithEmptyStateDir[exactly_once] PASSED

org.apache.kafka.streams.integration.RocksDBMetricsIntegrationTest > shouldExposeRocksDBMetricsBeforeAndAfterFailureWithEmptyStateDir[exactly_once_beta] STARTED

org.apache.kafka.streams.integration.RocksDBMetricsIntegrationTest > shouldExposeRocksDBMetricsBeforeAndAfterFailureWithEmptyStateDir[exactly_once_beta] PASSED

org.apache.kafka.streams.integration.KStreamAggregationIntegrationTest > shouldReduceSessionWindows STARTED

org.apache.kafka.streams.integration.KStreamAggregationIntegrationTest > shouldReduceSessionWindows PASSED

org.apache.kafka.streams.integration.KStreamAggregationIntegrationTest > shouldReduce STARTED

org.apache.kafka.streams.integration.KStreamAggregationIntegrationTest > shouldReduce PASSED

org.apache.kafka.streams.integration.KStreamAggregationIntegrationTest > shouldAggregate STARTED

org.apache.kafka.streams.integration.KStreamAggregationIntegrationTest > shouldAggregate PASSED

org.apache.kafka.streams.integration.KStreamAggregationIntegrationTest > shouldCount STARTED

org.apache.kafka.streams.integration.KStreamAggregationIntegrationTest > shouldCount PASSED

org.apache.kafka.streams.integration.KStreamAggregationIntegrationTest > shouldGroupByKey STARTED

org.apache.kafka.streams.integration.KStreamAggregationIntegrationTest > shouldGroupByKey PASSED

org.apache.kafka.streams.integration.KStreamAggregationIntegrationTest > shouldCountWithInternalStore STARTED

org.apache.kafka.streams.integration.KStreamAggregationIntegrationTest > shouldCountWithInternalStore PASSED

org.apache.kafka.streams.integration.KStreamAggregationIntegrationTest > shouldCountUnlimitedWindows STARTED

org.apache.kafka.streams.integration.KStreamAggregationIntegrationTest > shouldCountUnlimitedWindows PASSED

org.apache.kafka.streams.integration.KStreamAggregationIntegrationTest > shouldReduceWindowed STARTED

org.apache.kafka.streams.integration.KStreamAggregationIntegrationTest > shouldReduceWindowed PASSED

org.apache.kafka.streams.integration.KStreamAggregationIntegrationTest > shouldCountSessionWindows STARTED

org.apache.kafka.streams.integration.KStreamAggregationIntegrationTest > shouldCountSessionWindows PASSED

org.apache.kafka.streams.integration.KStreamAggregationIntegrationTest > shouldAggregateWindowed STARTED

org.apache.kafka.streams.integration.KStreamAggregationIntegrationTest > shouldAggregateWindowed PASSED

org.apache.kafka.streams.integration.GlobalKTableIntegrationTest > shouldGetToRunningWithOnlyGlobalTopology STARTED

org.apache.kafka.streams.integration.GlobalKTableIntegrationTest > shouldGetToRunningWithOnlyGlobalTopology PASSED

org.apache.kafka.streams.integration.GlobalKTableIntegrationTest > shouldKStreamGlobalKTableLeftJoin STARTED

org.apache.kafka.streams.integration.GlobalKTableIntegrationTest > shouldKStreamGlobalKTableLeftJoin PASSED

org.apache.kafka.streams.integration.GlobalKTableIntegrationTest > shouldRestoreGlobalInMemoryKTableOnRestart STARTED

org.apache.kafka.streams.integration.GlobalKTableIntegrationTest > shouldRestoreGlobalInMemoryKTableOnRestart PASSED

org.apache.kafka.streams.integration.GlobalKTableIntegrationTest > shouldKStreamGlobalKTableJoin STARTED

org.apache.kafka.streams.integration.GlobalKTableIntegrationTest > shouldKStreamGlobalKTableJoin PASSED

org.apache.kafka.streams.integration.RestoreIntegrationTest > shouldRecycleStateFromStandbyTaskPromotedToActiveTaskAndNotRestore STARTED

org.apache.kafka.streams.integration.RestoreIntegrationTest > shouldRecycleStateFromStandbyTaskPromotedToActiveTaskAndNotRestore PASSED

org.apache.kafka.streams.integration.RestoreIntegrationTest > shouldProcessDataFromStoresWithLoggingDisabled STARTED

org.apache.kafka.streams.integration.RestoreIntegrationTest > shouldProcessDataFromStoresWithLoggingDisabled PASSED

org.apache.kafka.streams.integration.RestoreIntegrationTest > shouldRestoreStateFromSourceTopic STARTED

org.apache.kafka.streams.integration.RestoreIntegrationTest > shouldRestoreStateFromSourceTopic PASSED

org.apache.kafka.streams.integration.RestoreIntegrationTest > shouldSuccessfullyStartWhenLoggingDisabled STARTED

org.apache.kafka.streams.integration.RestoreIntegrationTest > shouldSuccessfullyStartWhenLoggingDisabled PASSED

org.apache.kafka.streams.integration.RestoreIntegrationTest > shouldRestoreStateFromChangelogTopic STARTED

org.apache.kafka.streams.integration.RestoreIntegrationTest > shouldRestoreStateFromChangelogTopic PASSED

org.apache.kafka.streams.integration.FineGrainedAutoResetIntegrationTest > shouldOnlyReadRecordsWhereEarliestSpecifiedWithNoCommittedOffsetsWithGlobalAutoOffsetResetLatest STARTED

org.apache.kafka.streams.integration.FineGrainedAutoResetIntegrationTest > shouldOnlyReadRecordsWhereEarliestSpecifiedWithNoCommittedOffsetsWithGlobalAutoOffsetResetLatest PASSED

org.apache.kafka.streams.integration.FineGrainedAutoResetIntegrationTest > shouldThrowExceptionOverlappingPattern STARTED

org.apache.kafka.streams.integration.FineGrainedAutoResetIntegrationTest > shouldThrowExceptionOverlappingPattern PASSED

org.apache.kafka.streams.integration.FineGrainedAutoResetIntegrationTest > shouldThrowExceptionOverlappingTopic STARTED

org.apache.kafka.streams.integration.FineGrainedAutoResetIntegrationTest > shouldThrowExceptionOverlappingTopic PASSED

org.apache.kafka.streams.integration.FineGrainedAutoResetIntegrationTest > shouldOnlyReadRecordsWhereEarliestSpecifiedWithInvalidCommittedOffsets STARTED

org.apache.kafka.streams.integration.FineGrainedAutoResetIntegrationTest > shouldOnlyReadRecordsWhereEarliestSpecifiedWithInvalidCommittedOffsets PASSED

org.apache.kafka.streams.integration.FineGrainedAutoResetIntegrationTest > shouldOnlyReadRecordsWhereEarliestSpecifiedWithNoCommittedOffsetsWithDefaultGlobalAutoOffsetResetEarliest STARTED

org.apache.kafka.streams.integration.FineGrainedAutoResetIntegrationTest > shouldOnlyReadRecordsWhereEarliestSpecifiedWithNoCommittedOffsetsWithDefaultGlobalAutoOffsetResetEarliest PASSED

org.apache.kafka.streams.integration.FineGrainedAutoResetIntegrationTest > shouldThrowStreamsExceptionNoResetSpecified STARTED

org.apache.kafka.streams.integration.FineGrainedAutoResetIntegrationTest > shouldThrowStreamsExceptionNoResetSpecified PASSED

org.apache.kafka.streams.integration.ResetIntegrationWithSslTest > testReprocessingFromScratchAfterResetWithIntermediateInternalTopic STARTED

org.apache.kafka.streams.integration.ResetIntegrationWithSslTest > testReprocessingFromScratchAfterResetWithIntermediateInternalTopic PASSED

org.apache.kafka.streams.integration.ResetIntegrationWithSslTest > testReprocessingFromScratchAfterResetWithIntermediateUserTopic STARTED

org.apache.kafka.streams.integration.ResetIntegrationWithSslTest > testReprocessingFromScratchAfterResetWithIntermediateUserTopic PASSED

org.apache.kafka.streams.integration.ResetIntegrationWithSslTest > testReprocessingFromScratchAfterResetWithoutIntermediateUserTopic STARTED

org.apache.kafka.streams.integration.ResetIntegrationWithSslTest > testReprocessingFromScratchAfterResetWithoutIntermediateUserTopic PASSED

org.apache.kafka.streams.integration.KTableKTableForeignKeyJoinMaterializationIntegrationTest > shouldEmitTombstoneWhenDeletingNonJoiningRecords[materialized=false, queriable=false] STARTED

org.apache.kafka.streams.integration.KTableKTableForeignKeyJoinMaterializationIntegrationTest > shouldEmitTombstoneWhenDeletingNonJoiningRecords[materialized=false, queriable=false] PASSED

org.apache.kafka.streams.integration.KTableKTableForeignKeyJoinMaterializationIntegrationTest > shouldEmitTombstoneWhenDeletingNonJoiningRecords[materialized=true, queriable=false] STARTED

org.apache.kafka.streams.integration.KTableKTableForeignKeyJoinMaterializationIntegrationTest > shouldEmitTombstoneWhenDeletingNonJoiningRecords[materialized=true, queriable=false] PASSED

org.apache.kafka.streams.integration.KTableKTableForeignKeyJoinMaterializationIntegrationTest > shouldEmitTombstoneWhenDeletingNonJoiningRecords[materialized=true, queriable=true] STARTED

org.apache.kafka.streams.integration.KTableKTableForeignKeyJoinMaterializationIntegrationTest > shouldEmitTombstoneWhenDeletingNonJoiningRecords[materialized=true, queriable=true] PASSED

org.apache.kafka.streams.integration.StandbyTaskEOSIntegrationTest > shouldWipeOutStandbyStateDirectoryIfCheckpointIsMissing[exactly_once] STARTED

org.apache.kafka.streams.integration.StandbyTaskEOSIntegrationTest > shouldWipeOutStandbyStateDirectoryIfCheckpointIsMissing[exactly_once] PASSED

org.apache.kafka.streams.integration.StandbyTaskEOSIntegrationTest > shouldSurviveWithOneTaskAsStandby[exactly_once] STARTED

org.apache.kafka.streams.integration.StandbyTaskEOSIntegrationTest > shouldSurviveWithOneTaskAsStandby[exactly_once] PASSED

org.apache.kafka.streams.integration.StandbyTaskEOSIntegrationTest > shouldWipeOutStandbyStateDirectoryIfCheckpointIsMissing[exactly_once_beta] STARTED

org.apache.kafka.streams.integration.StandbyTaskEOSIntegrationTest > shouldWipeOutStandbyStateDirectoryIfCheckpointIsMissing[exactly_once_beta] PASSED

org.apache.kafka.streams.integration.StandbyTaskEOSIntegrationTest > shouldSurviveWithOneTaskAsStandby[exactly_once_beta] STARTED

org.apache.kafka.streams.integration.StandbyTaskEOSIntegrationTest > shouldSurviveWithOneTaskAsStandby[exactly_once_beta] PASSED
ERROR: Could not install GRADLE_4_10_3_HOME
java.lang.NullPointerException
ERROR: Could not install GRADLE_4_10_3_HOME
java.lang.NullPointerException
ERROR: Could not install GRADLE_4_10_3_HOME
java.lang.NullPointerException
ERROR: Could not install GRADLE_4_10_3_HOME
java.lang.NullPointerException
ERROR: Could not install GRADLE_4_10_3_HOME
java.lang.NullPointerException
ERROR: Could not install GRADLE_4_10_3_HOME
java.lang.NullPointerException
ERROR: Could not install GRADLE_4_10_3_HOME
java.lang.NullPointerException
ERROR: Could not install GRADLE_4_10_3_HOME
java.lang.NullPointerException
ERROR: Could not install GRADLE_4_10_3_HOME
java.lang.NullPointerException
Build timed out (after 600 minutes). Marking the build as failed.
Build was aborted
[FINDBUGS] Collecting findbugs analysis files...
Setting GRADLE_4_10_3_HOME=/home/jenkins/tools/gradle/4.10.3

org.apache.kafka.streams.processor.internals.GlobalStreamThreadTest > shouldDieOnInvalidOffsetExceptionDuringStartup SKIPPED

> Task :streams:test FAILED
[FINDBUGS] Searching for all files in <https://builds.apache.org/job/kafka-trunk-jdk8/ws/> that match the pattern **/build/reports/*bugs/*.xml
[FINDBUGS] Parsing 12 files in <https://builds.apache.org/job/kafka-trunk-jdk8/ws/>
[FINDBUGS] Successfully parsed file <https://builds.apache.org/job/kafka-trunk-jdk8/ws/clients/build/reports/spotbugs/main.xml> with 0 unique warnings and 0 duplicates.
[FINDBUGS] Successfully parsed file <https://builds.apache.org/job/kafka-trunk-jdk8/ws/connect/api/build/reports/spotbugs/main.xml> with 0 unique warnings and 0 duplicates.
[FINDBUGS] Successfully parsed file <https://builds.apache.org/job/kafka-trunk-jdk8/ws/connect/basic-auth-extension/build/reports/spotbugs/main.xml> with 0 unique warnings and 0 duplicates.
[FINDBUGS] Successfully parsed file <https://builds.apache.org/job/kafka-trunk-jdk8/ws/connect/file/build/reports/spotbugs/main.xml> with 0 unique warnings and 0 duplicates.
[FINDBUGS] Successfully parsed file <https://builds.apache.org/job/kafka-trunk-jdk8/ws/connect/json/build/reports/spotbugs/main.xml> with 0 unique warnings and 0 duplicates.
[FINDBUGS] Successfully parsed file <https://builds.apache.org/job/kafka-trunk-jdk8/ws/core/build/reports/spotbugs/main.xml> with 0 unique warnings and 0 duplicates.
[FINDBUGS] Successfully parsed file <https://builds.apache.org/job/kafka-trunk-jdk8/ws/examples/build/reports/spotbugs/main.xml> with 0 unique warnings and 0 duplicates.
[FINDBUGS] Successfully parsed file <https://builds.apache.org/job/kafka-trunk-jdk8/ws/generator/build/reports/spotbugs/main.xml> with 0 unique warnings and 0 duplicates.
[FINDBUGS] Successfully parsed file <https://builds.apache.org/job/kafka-trunk-jdk8/ws/jmh-benchmarks/build/reports/spotbugs/main.xml> with 0 unique warnings and 0 duplicates.
[FINDBUGS] Successfully parsed file <https://builds.apache.org/job/kafka-trunk-jdk8/ws/log4j-appender/build/reports/spotbugs/main.xml> with 0 unique warnings and 0 duplicates.
[FINDBUGS] Successfully parsed file <https://builds.apache.org/job/kafka-trunk-jdk8/ws/streams/build/reports/spotbugs/main.xml> with 0 unique warnings and 0 duplicates.
[FINDBUGS] Successfully parsed file <https://builds.apache.org/job/kafka-trunk-jdk8/ws/tools/build/reports/spotbugs/main.xml> with 0 unique warnings and 0 duplicates.
Setting GRADLE_4_10_3_HOME=/home/jenkins/tools/gradle/4.10.3
No credentials specified
Setting GRADLE_4_10_3_HOME=/home/jenkins/tools/gradle/4.10.3
<Git Blamer> Using GitBlamer to create author and commit information for all warnings.
<Git Blamer> GIT_COMMIT=3993041c7602506a8b194e3a67ac018b623a3cd8, workspace=<https://builds.apache.org/job/kafka-trunk-jdk8/ws/>
[FINDBUGS] Computing warning deltas based on reference build #4743
Recording test results
Setting GRADLE_4_10_3_HOME=/home/jenkins/tools/gradle/4.10.3
Setting GRADLE_4_10_3_HOME=/home/jenkins/tools/gradle/4.10.3
Not sending mail to unregistered user noreply@github.com

Jenkins build is back to normal : kafka-trunk-jdk8 #4753

Posted by Apache Jenkins Server <je...@builds.apache.org>.
See <https://builds.apache.org/job/kafka-trunk-jdk8/4753/display/redirect?page=changes>


Build failed in Jenkins: kafka-trunk-jdk8 #4752

Posted by Apache Jenkins Server <je...@builds.apache.org>.
See <https://builds.apache.org/job/kafka-trunk-jdk8/4752/display/redirect?page=changes>

Changes:

[github] KAFKA-10321: fix infinite blocking for global stream thread startup


------------------------------------------
[...truncated 3.18 MB...]

org.apache.kafka.streams.test.OutputVerifierTest > shouldFailIfValueIsDifferentForCompareKeyValueTimestampWithProducerRecord PASSED

org.apache.kafka.streams.test.OutputVerifierTest > shouldNotAllowNullProducerRecordWithExpectedRecordForCompareValueTimestamp STARTED

org.apache.kafka.streams.test.OutputVerifierTest > shouldNotAllowNullProducerRecordWithExpectedRecordForCompareValueTimestamp PASSED

org.apache.kafka.streams.test.OutputVerifierTest > shouldNotAllowNullExpectedRecordForCompareValue STARTED

org.apache.kafka.streams.test.OutputVerifierTest > shouldNotAllowNullExpectedRecordForCompareValue PASSED

org.apache.kafka.streams.test.OutputVerifierTest > shouldFailIfValueIsDifferentWithNullReversForCompareKeyValueTimestampWithProducerRecord STARTED

org.apache.kafka.streams.test.OutputVerifierTest > shouldFailIfValueIsDifferentWithNullReversForCompareKeyValueTimestampWithProducerRecord PASSED

org.apache.kafka.streams.test.OutputVerifierTest > shouldNotAllowNullProducerRecordForCompareKeyValue STARTED

org.apache.kafka.streams.test.OutputVerifierTest > shouldNotAllowNullProducerRecordForCompareKeyValue PASSED

org.apache.kafka.streams.test.OutputVerifierTest > shouldFailIfValueIsDifferentWithNullReversForCompareKeyValueWithProducerRecord STARTED

org.apache.kafka.streams.test.OutputVerifierTest > shouldFailIfValueIsDifferentWithNullReversForCompareKeyValueWithProducerRecord PASSED

org.apache.kafka.streams.test.OutputVerifierTest > shouldPassIfKeyAndValueAndTimestampIsEqualForCompareKeyValueTimestamp STARTED

org.apache.kafka.streams.test.OutputVerifierTest > shouldPassIfKeyAndValueAndTimestampIsEqualForCompareKeyValueTimestamp PASSED

org.apache.kafka.streams.test.OutputVerifierTest > shouldFailIfValueIsDifferentWithNullForCompareKeyValueTimestampWithProducerRecord STARTED

org.apache.kafka.streams.test.OutputVerifierTest > shouldFailIfValueIsDifferentWithNullForCompareKeyValueTimestampWithProducerRecord PASSED

org.apache.kafka.streams.test.OutputVerifierTest > shouldFailIfKeyIsDifferentWithNullReversForCompareKeyValueWithProducerRecord STARTED

org.apache.kafka.streams.test.OutputVerifierTest > shouldFailIfKeyIsDifferentWithNullReversForCompareKeyValueWithProducerRecord PASSED

org.apache.kafka.streams.test.OutputVerifierTest > shouldPassIfKeyAndValueIsEqualWithNullForCompareKeyValueWithProducerRecord STARTED

org.apache.kafka.streams.test.OutputVerifierTest > shouldPassIfKeyAndValueIsEqualWithNullForCompareKeyValueWithProducerRecord PASSED

org.apache.kafka.streams.test.OutputVerifierTest > shouldFailIfKeyIsDifferentWithNullForCompareKeyValueTimestampWithProducerRecord STARTED

org.apache.kafka.streams.test.OutputVerifierTest > shouldFailIfKeyIsDifferentWithNullForCompareKeyValueTimestampWithProducerRecord PASSED

org.apache.kafka.streams.test.OutputVerifierTest > shouldFailIfValueIsDifferentForCompareKeyValueTimestamp STARTED

org.apache.kafka.streams.test.OutputVerifierTest > shouldFailIfValueIsDifferentForCompareKeyValueTimestamp PASSED

org.apache.kafka.streams.test.OutputVerifierTest > shouldPassIfValueAndTimestampIsEqualForCompareValueTimestampWithProducerRecord STARTED

org.apache.kafka.streams.test.OutputVerifierTest > shouldPassIfValueAndTimestampIsEqualForCompareValueTimestampWithProducerRecord PASSED

org.apache.kafka.streams.test.OutputVerifierTest > shouldFailIfValueIsDifferentWithNullReversForCompareKeyValueTimestamp STARTED

org.apache.kafka.streams.test.OutputVerifierTest > shouldFailIfValueIsDifferentWithNullReversForCompareKeyValueTimestamp PASSED

org.apache.kafka.streams.test.OutputVerifierTest > shouldFailIfValueIsDifferentWithNullReverseForCompareValueTimestampWithProducerRecord STARTED

org.apache.kafka.streams.test.OutputVerifierTest > shouldFailIfValueIsDifferentWithNullReverseForCompareValueTimestampWithProducerRecord PASSED

org.apache.kafka.streams.test.wordcount.WindowedWordCountProcessorTest > shouldWorkWithInMemoryStore STARTED

org.apache.kafka.streams.test.wordcount.WindowedWordCountProcessorTest > shouldWorkWithInMemoryStore PASSED

org.apache.kafka.streams.test.wordcount.WindowedWordCountProcessorTest > shouldFailWithLogging STARTED

org.apache.kafka.streams.test.wordcount.WindowedWordCountProcessorTest > shouldFailWithLogging PASSED

org.apache.kafka.streams.test.wordcount.WindowedWordCountProcessorTest > shouldFailWithCaching STARTED

org.apache.kafka.streams.test.wordcount.WindowedWordCountProcessorTest > shouldFailWithCaching PASSED

org.apache.kafka.streams.test.wordcount.WindowedWordCountProcessorTest > shouldWorkWithPersistentStore STARTED

org.apache.kafka.streams.test.wordcount.WindowedWordCountProcessorTest > shouldWorkWithPersistentStore PASSED

org.apache.kafka.streams.internals.KeyValueStoreFacadeTest > shouldReturnIsOpen STARTED

org.apache.kafka.streams.internals.KeyValueStoreFacadeTest > shouldReturnIsOpen PASSED

org.apache.kafka.streams.internals.KeyValueStoreFacadeTest > shouldDeleteAndReturnPlainValue STARTED

org.apache.kafka.streams.internals.KeyValueStoreFacadeTest > shouldDeleteAndReturnPlainValue PASSED

org.apache.kafka.streams.internals.KeyValueStoreFacadeTest > shouldReturnName STARTED

org.apache.kafka.streams.internals.KeyValueStoreFacadeTest > shouldReturnName PASSED

org.apache.kafka.streams.internals.KeyValueStoreFacadeTest > shouldPutWithUnknownTimestamp STARTED

org.apache.kafka.streams.internals.KeyValueStoreFacadeTest > shouldPutWithUnknownTimestamp PASSED

org.apache.kafka.streams.internals.KeyValueStoreFacadeTest > shouldPutAllWithUnknownTimestamp STARTED

org.apache.kafka.streams.internals.KeyValueStoreFacadeTest > shouldPutAllWithUnknownTimestamp PASSED

org.apache.kafka.streams.internals.KeyValueStoreFacadeTest > shouldReturnIsPersistent STARTED

org.apache.kafka.streams.internals.KeyValueStoreFacadeTest > shouldReturnIsPersistent PASSED

org.apache.kafka.streams.internals.KeyValueStoreFacadeTest > shouldPutIfAbsentWithUnknownTimestamp STARTED

org.apache.kafka.streams.internals.KeyValueStoreFacadeTest > shouldPutIfAbsentWithUnknownTimestamp PASSED

org.apache.kafka.streams.internals.KeyValueStoreFacadeTest > shouldForwardClose STARTED

org.apache.kafka.streams.internals.KeyValueStoreFacadeTest > shouldForwardClose PASSED

org.apache.kafka.streams.internals.KeyValueStoreFacadeTest > shouldForwardFlush STARTED

org.apache.kafka.streams.internals.KeyValueStoreFacadeTest > shouldForwardFlush PASSED

org.apache.kafka.streams.internals.KeyValueStoreFacadeTest > shouldForwardInit STARTED

org.apache.kafka.streams.internals.KeyValueStoreFacadeTest > shouldForwardInit PASSED

> Task :streams:upgrade-system-tests-0110:spotbugsMain NO-SOURCE
> Task :streams:upgrade-system-tests-0110:test
> Task :streams:upgrade-system-tests-10:compileJava NO-SOURCE
> Task :streams:upgrade-system-tests-10:processResources NO-SOURCE
> Task :streams:upgrade-system-tests-10:classes UP-TO-DATE
> Task :streams:upgrade-system-tests-10:checkstyleMain NO-SOURCE
> Task :streams:upgrade-system-tests-10:compileTestJava
> Task :streams:upgrade-system-tests-10:processTestResources NO-SOURCE
> Task :streams:upgrade-system-tests-10:testClasses
> Task :streams:upgrade-system-tests-10:checkstyleTest
> Task :streams:upgrade-system-tests-10:spotbugsMain NO-SOURCE
> Task :streams:upgrade-system-tests-10:test
> Task :streams:upgrade-system-tests-11:compileJava NO-SOURCE
> Task :streams:upgrade-system-tests-11:processResources NO-SOURCE
> Task :streams:upgrade-system-tests-11:classes UP-TO-DATE
> Task :streams:upgrade-system-tests-11:checkstyleMain NO-SOURCE
> Task :streams:upgrade-system-tests-11:compileTestJava
> Task :streams:upgrade-system-tests-11:processTestResources NO-SOURCE
> Task :streams:upgrade-system-tests-11:testClasses
> Task :streams:upgrade-system-tests-11:checkstyleTest
> Task :streams:upgrade-system-tests-11:spotbugsMain NO-SOURCE
> Task :streams:upgrade-system-tests-11:test
> Task :streams:upgrade-system-tests-20:compileJava NO-SOURCE
> Task :streams:upgrade-system-tests-20:processResources NO-SOURCE
> Task :streams:upgrade-system-tests-20:classes UP-TO-DATE
> Task :streams:upgrade-system-tests-20:checkstyleMain NO-SOURCE
> Task :streams:upgrade-system-tests-20:compileTestJava
> Task :streams:upgrade-system-tests-20:processTestResources NO-SOURCE
> Task :streams:upgrade-system-tests-20:testClasses
> Task :streams:upgrade-system-tests-20:checkstyleTest
> Task :streams:upgrade-system-tests-20:spotbugsMain NO-SOURCE
> Task :streams:upgrade-system-tests-20:test
> Task :streams:upgrade-system-tests-21:compileJava NO-SOURCE
> Task :streams:upgrade-system-tests-21:processResources NO-SOURCE
> Task :streams:upgrade-system-tests-21:classes UP-TO-DATE
> Task :streams:upgrade-system-tests-21:checkstyleMain NO-SOURCE
> Task :streams:upgrade-system-tests-21:compileTestJava
> Task :streams:upgrade-system-tests-21:processTestResources NO-SOURCE
> Task :streams:upgrade-system-tests-21:testClasses
> Task :streams:upgrade-system-tests-21:checkstyleTest
> Task :streams:upgrade-system-tests-21:spotbugsMain NO-SOURCE
> Task :streams:upgrade-system-tests-21:test
> Task :streams:upgrade-system-tests-22:compileJava NO-SOURCE
> Task :streams:upgrade-system-tests-22:processResources NO-SOURCE
> Task :streams:upgrade-system-tests-22:classes UP-TO-DATE
> Task :streams:upgrade-system-tests-22:checkstyleMain NO-SOURCE
> Task :streams:upgrade-system-tests-22:compileTestJava
> Task :streams:upgrade-system-tests-22:processTestResources NO-SOURCE
> Task :streams:upgrade-system-tests-22:testClasses
> Task :streams:upgrade-system-tests-22:checkstyleTest
> Task :streams:upgrade-system-tests-22:spotbugsMain NO-SOURCE
> Task :streams:upgrade-system-tests-22:test
> Task :streams:upgrade-system-tests-23:compileJava NO-SOURCE
> Task :streams:upgrade-system-tests-23:processResources NO-SOURCE
> Task :streams:upgrade-system-tests-23:classes UP-TO-DATE
> Task :streams:upgrade-system-tests-23:checkstyleMain NO-SOURCE
> Task :streams:upgrade-system-tests-23:compileTestJava
> Task :streams:upgrade-system-tests-23:processTestResources NO-SOURCE
> Task :streams:upgrade-system-tests-23:testClasses
> Task :streams:upgrade-system-tests-23:checkstyleTest
> Task :streams:upgrade-system-tests-23:spotbugsMain NO-SOURCE
> Task :streams:upgrade-system-tests-23:test
> Task :streams:upgrade-system-tests-24:compileJava NO-SOURCE
> Task :streams:upgrade-system-tests-24:processResources NO-SOURCE
> Task :streams:upgrade-system-tests-24:classes UP-TO-DATE
> Task :streams:upgrade-system-tests-24:checkstyleMain NO-SOURCE
> Task :streams:upgrade-system-tests-24:compileTestJava
> Task :streams:upgrade-system-tests-24:processTestResources NO-SOURCE
> Task :streams:upgrade-system-tests-24:testClasses
> Task :streams:upgrade-system-tests-24:checkstyleTest
> Task :streams:upgrade-system-tests-24:spotbugsMain NO-SOURCE
> Task :streams:upgrade-system-tests-24:test
> Task :streams:upgrade-system-tests-25:compileJava NO-SOURCE
> Task :streams:upgrade-system-tests-25:processResources NO-SOURCE
> Task :streams:upgrade-system-tests-25:classes UP-TO-DATE
> Task :streams:upgrade-system-tests-25:checkstyleMain NO-SOURCE
> Task :streams:upgrade-system-tests-25:compileTestJava
> Task :streams:upgrade-system-tests-25:processTestResources NO-SOURCE
> Task :streams:upgrade-system-tests-25:testClasses
> Task :streams:upgrade-system-tests-25:checkstyleTest
> Task :streams:upgrade-system-tests-25:spotbugsMain NO-SOURCE
> Task :streams:upgrade-system-tests-25:test

FAILURE: Build failed with an exception.

* What went wrong:
Execution failed for task ':streams:test'.
> There were failing tests. See the report at: file://<https://builds.apache.org/job/kafka-trunk-jdk8/ws/streams/build/reports/tests/test/index.html>

* Try:
Run with --stacktrace option to get the stack trace. Run with --info or --debug option to get more log output. Run with --scan to get full insights.

* Get more help at https://help.gradle.org

Deprecated Gradle features were used in this build, making it incompatible with Gradle 7.0.
Use '--warning-mode all' to show the individual deprecation warnings.
See https://docs.gradle.org/6.5/userguide/command_line_interface.html#sec:command_line_warnings

BUILD FAILED in 2h 12m 15s
216 actionable tasks: 184 executed, 32 up-to-date
Build step 'Execute shell' marked build as failure
[FINDBUGS] Collecting findbugs analysis files...
Setting GRADLE_4_10_3_HOME=/home/jenkins/tools/gradle/4.10.3
[FINDBUGS] Searching for all files in <https://builds.apache.org/job/kafka-trunk-jdk8/ws/> that match the pattern **/build/reports/*bugs/*.xml
[FINDBUGS] Parsing 19 files in <https://builds.apache.org/job/kafka-trunk-jdk8/ws/>
[FINDBUGS] Successfully parsed file <https://builds.apache.org/job/kafka-trunk-jdk8/ws/clients/build/reports/spotbugs/main.xml> with 0 unique warnings and 0 duplicates.
[FINDBUGS] Successfully parsed file <https://builds.apache.org/job/kafka-trunk-jdk8/ws/connect/api/build/reports/spotbugs/main.xml> with 0 unique warnings and 0 duplicates.
[FINDBUGS] Successfully parsed file <https://builds.apache.org/job/kafka-trunk-jdk8/ws/connect/basic-auth-extension/build/reports/spotbugs/main.xml> with 0 unique warnings and 0 duplicates.
[FINDBUGS] Successfully parsed file <https://builds.apache.org/job/kafka-trunk-jdk8/ws/connect/file/build/reports/spotbugs/main.xml> with 0 unique warnings and 0 duplicates.
[FINDBUGS] Successfully parsed file <https://builds.apache.org/job/kafka-trunk-jdk8/ws/connect/json/build/reports/spotbugs/main.xml> with 0 unique warnings and 0 duplicates.
[FINDBUGS] Successfully parsed file <https://builds.apache.org/job/kafka-trunk-jdk8/ws/connect/mirror-client/build/reports/spotbugs/main.xml> with 0 unique warnings and 0 duplicates.
[FINDBUGS] Successfully parsed file <https://builds.apache.org/job/kafka-trunk-jdk8/ws/connect/mirror/build/reports/spotbugs/main.xml> with 0 unique warnings and 0 duplicates.
[FINDBUGS] Successfully parsed file <https://builds.apache.org/job/kafka-trunk-jdk8/ws/connect/runtime/build/reports/spotbugs/main.xml> with 0 unique warnings and 0 duplicates.
[FINDBUGS] Successfully parsed file <https://builds.apache.org/job/kafka-trunk-jdk8/ws/connect/transforms/build/reports/spotbugs/main.xml> with 0 unique warnings and 0 duplicates.
[FINDBUGS] Successfully parsed file <https://builds.apache.org/job/kafka-trunk-jdk8/ws/core/build/reports/spotbugs/main.xml> with 0 unique warnings and 0 duplicates.
[FINDBUGS] Successfully parsed file <https://builds.apache.org/job/kafka-trunk-jdk8/ws/examples/build/reports/spotbugs/main.xml> with 0 unique warnings and 0 duplicates.
[FINDBUGS] Successfully parsed file <https://builds.apache.org/job/kafka-trunk-jdk8/ws/generator/build/reports/spotbugs/main.xml> with 0 unique warnings and 0 duplicates.
[FINDBUGS] Successfully parsed file <https://builds.apache.org/job/kafka-trunk-jdk8/ws/jmh-benchmarks/build/reports/spotbugs/main.xml> with 0 unique warnings and 0 duplicates.
[FINDBUGS] Successfully parsed file <https://builds.apache.org/job/kafka-trunk-jdk8/ws/log4j-appender/build/reports/spotbugs/main.xml> with 0 unique warnings and 0 duplicates.
[FINDBUGS] Successfully parsed file <https://builds.apache.org/job/kafka-trunk-jdk8/ws/streams/build/reports/spotbugs/main.xml> with 0 unique warnings and 0 duplicates.
[FINDBUGS] Successfully parsed file <https://builds.apache.org/job/kafka-trunk-jdk8/ws/streams/examples/build/reports/spotbugs/main.xml> with 0 unique warnings and 0 duplicates.
[FINDBUGS] Successfully parsed file <https://builds.apache.org/job/kafka-trunk-jdk8/ws/streams/streams-scala/build/reports/spotbugs/main.xml> with 0 unique warnings and 0 duplicates.
[FINDBUGS] Successfully parsed file <https://builds.apache.org/job/kafka-trunk-jdk8/ws/streams/test-utils/build/reports/spotbugs/main.xml> with 0 unique warnings and 0 duplicates.
[FINDBUGS] Successfully parsed file <https://builds.apache.org/job/kafka-trunk-jdk8/ws/tools/build/reports/spotbugs/main.xml> with 0 unique warnings and 0 duplicates.
Setting GRADLE_4_10_3_HOME=/home/jenkins/tools/gradle/4.10.3
No credentials specified
Setting GRADLE_4_10_3_HOME=/home/jenkins/tools/gradle/4.10.3
<Git Blamer> Using GitBlamer to create author and commit information for all warnings.
<Git Blamer> GIT_COMMIT=2f64f6deb906cdfe4d006e530edeff2e79c05f76, workspace=<https://builds.apache.org/job/kafka-trunk-jdk8/ws/>
[FINDBUGS] Computing warning deltas based on reference build #4743
Recording test results
Setting GRADLE_4_10_3_HOME=/home/jenkins/tools/gradle/4.10.3
Setting GRADLE_4_10_3_HOME=/home/jenkins/tools/gradle/4.10.3
Not sending mail to unregistered user noreply@github.com

Build failed in Jenkins: kafka-trunk-jdk8 #4751

Posted by Apache Jenkins Server <je...@builds.apache.org>.
See <https://builds.apache.org/job/kafka-trunk-jdk8/4751/display/redirect?page=changes>

Changes:

[github] KAFKA-10309: KafkaProducer's sendOffsetsToTransaction should not block


------------------------------------------
[...truncated 3.18 MB...]
org.apache.kafka.streams.TestTopicsTest > testKeyValueList PASSED

org.apache.kafka.streams.TestTopicsTest > shouldNotAllowToCreateOutputWithNullDriver STARTED

org.apache.kafka.streams.TestTopicsTest > shouldNotAllowToCreateOutputWithNullDriver PASSED

org.apache.kafka.streams.TestTopicsTest > testValueList STARTED

org.apache.kafka.streams.TestTopicsTest > testValueList PASSED

org.apache.kafka.streams.TestTopicsTest > testRecordList STARTED

org.apache.kafka.streams.TestTopicsTest > testRecordList PASSED

org.apache.kafka.streams.TestTopicsTest > testNonExistingInputTopic STARTED

org.apache.kafka.streams.TestTopicsTest > testNonExistingInputTopic PASSED

org.apache.kafka.streams.TestTopicsTest > testKeyValuesToMap STARTED

org.apache.kafka.streams.TestTopicsTest > testKeyValuesToMap PASSED

org.apache.kafka.streams.TestTopicsTest > testRecordsToList STARTED

org.apache.kafka.streams.TestTopicsTest > testRecordsToList PASSED

org.apache.kafka.streams.TestTopicsTest > testKeyValueListDuration STARTED

org.apache.kafka.streams.TestTopicsTest > testKeyValueListDuration PASSED

org.apache.kafka.streams.TestTopicsTest > testInputToString STARTED

org.apache.kafka.streams.TestTopicsTest > testInputToString PASSED

org.apache.kafka.streams.TestTopicsTest > testTimestamp STARTED

org.apache.kafka.streams.TestTopicsTest > testTimestamp PASSED

org.apache.kafka.streams.TestTopicsTest > testWithHeaders STARTED

org.apache.kafka.streams.TestTopicsTest > testWithHeaders PASSED

org.apache.kafka.streams.TestTopicsTest > testKeyValue STARTED

org.apache.kafka.streams.TestTopicsTest > testKeyValue PASSED

org.apache.kafka.streams.TestTopicsTest > shouldNotAllowToCreateTopicWithNullTopicName STARTED

org.apache.kafka.streams.TestTopicsTest > shouldNotAllowToCreateTopicWithNullTopicName PASSED

org.apache.kafka.streams.internals.WindowStoreFacadeTest > shouldReturnIsOpen STARTED

org.apache.kafka.streams.internals.WindowStoreFacadeTest > shouldReturnIsOpen PASSED

org.apache.kafka.streams.internals.WindowStoreFacadeTest > shouldReturnName STARTED

org.apache.kafka.streams.internals.WindowStoreFacadeTest > shouldReturnName PASSED

org.apache.kafka.streams.internals.WindowStoreFacadeTest > shouldPutWithUnknownTimestamp STARTED

org.apache.kafka.streams.internals.WindowStoreFacadeTest > shouldPutWithUnknownTimestamp PASSED

org.apache.kafka.streams.internals.WindowStoreFacadeTest > shouldPutWindowStartTimestampWithUnknownTimestamp STARTED

org.apache.kafka.streams.internals.WindowStoreFacadeTest > shouldPutWindowStartTimestampWithUnknownTimestamp PASSED

org.apache.kafka.streams.internals.WindowStoreFacadeTest > shouldReturnIsPersistent STARTED

org.apache.kafka.streams.internals.WindowStoreFacadeTest > shouldReturnIsPersistent PASSED

org.apache.kafka.streams.internals.WindowStoreFacadeTest > shouldForwardClose STARTED

org.apache.kafka.streams.internals.WindowStoreFacadeTest > shouldForwardClose PASSED

org.apache.kafka.streams.internals.WindowStoreFacadeTest > shouldForwardFlush STARTED

org.apache.kafka.streams.internals.WindowStoreFacadeTest > shouldForwardFlush PASSED

org.apache.kafka.streams.internals.WindowStoreFacadeTest > shouldForwardInit STARTED

org.apache.kafka.streams.internals.WindowStoreFacadeTest > shouldForwardInit PASSED

> Task :streams:upgrade-system-tests-0100:processTestResources NO-SOURCE
> Task :streams:upgrade-system-tests-0100:testClasses
> Task :streams:upgrade-system-tests-0100:checkstyleTest
> Task :streams:upgrade-system-tests-0100:spotbugsMain NO-SOURCE
> Task :streams:upgrade-system-tests-0100:test
> Task :streams:upgrade-system-tests-0101:compileJava NO-SOURCE
> Task :streams:upgrade-system-tests-0101:processResources NO-SOURCE
> Task :streams:upgrade-system-tests-0101:classes UP-TO-DATE
> Task :streams:upgrade-system-tests-0101:checkstyleMain NO-SOURCE
> Task :streams:upgrade-system-tests-0101:compileTestJava
> Task :streams:upgrade-system-tests-0101:processTestResources NO-SOURCE
> Task :streams:upgrade-system-tests-0101:testClasses
> Task :streams:upgrade-system-tests-0101:checkstyleTest
> Task :streams:upgrade-system-tests-0101:spotbugsMain NO-SOURCE
> Task :streams:upgrade-system-tests-0101:test
> Task :streams:upgrade-system-tests-0102:compileJava NO-SOURCE
> Task :streams:upgrade-system-tests-0102:processResources NO-SOURCE
> Task :streams:upgrade-system-tests-0102:classes UP-TO-DATE
> Task :streams:upgrade-system-tests-0102:checkstyleMain NO-SOURCE
> Task :streams:upgrade-system-tests-0102:compileTestJava
> Task :streams:upgrade-system-tests-0102:processTestResources NO-SOURCE
> Task :streams:upgrade-system-tests-0102:testClasses
> Task :streams:upgrade-system-tests-0102:checkstyleTest
> Task :streams:upgrade-system-tests-0102:spotbugsMain NO-SOURCE
> Task :streams:upgrade-system-tests-0102:test
> Task :streams:upgrade-system-tests-0110:compileJava NO-SOURCE
> Task :streams:upgrade-system-tests-0110:processResources NO-SOURCE
> Task :streams:upgrade-system-tests-0110:classes UP-TO-DATE
> Task :streams:upgrade-system-tests-0110:checkstyleMain NO-SOURCE
> Task :streams:upgrade-system-tests-0110:compileTestJava
> Task :streams:upgrade-system-tests-0110:processTestResources NO-SOURCE
> Task :streams:upgrade-system-tests-0110:testClasses
> Task :streams:upgrade-system-tests-0110:checkstyleTest
> Task :streams:upgrade-system-tests-0110:spotbugsMain NO-SOURCE
> Task :streams:upgrade-system-tests-0110:test
> Task :streams:upgrade-system-tests-10:compileJava NO-SOURCE
> Task :streams:upgrade-system-tests-10:processResources NO-SOURCE
> Task :streams:upgrade-system-tests-10:classes UP-TO-DATE
> Task :streams:upgrade-system-tests-10:checkstyleMain NO-SOURCE
> Task :streams:upgrade-system-tests-10:compileTestJava
> Task :streams:upgrade-system-tests-10:processTestResources NO-SOURCE
> Task :streams:upgrade-system-tests-10:testClasses
> Task :streams:upgrade-system-tests-10:checkstyleTest
> Task :streams:upgrade-system-tests-10:spotbugsMain NO-SOURCE
> Task :streams:upgrade-system-tests-10:test
> Task :streams:upgrade-system-tests-11:compileJava NO-SOURCE
> Task :streams:upgrade-system-tests-11:processResources NO-SOURCE
> Task :streams:upgrade-system-tests-11:classes UP-TO-DATE
> Task :streams:upgrade-system-tests-11:checkstyleMain NO-SOURCE
> Task :streams:upgrade-system-tests-11:compileTestJava
> Task :streams:upgrade-system-tests-11:processTestResources NO-SOURCE
> Task :streams:upgrade-system-tests-11:testClasses
> Task :streams:upgrade-system-tests-11:checkstyleTest
> Task :streams:upgrade-system-tests-11:spotbugsMain NO-SOURCE
> Task :streams:upgrade-system-tests-11:test
> Task :streams:upgrade-system-tests-20:compileJava NO-SOURCE
> Task :streams:upgrade-system-tests-20:processResources NO-SOURCE
> Task :streams:upgrade-system-tests-20:classes UP-TO-DATE
> Task :streams:upgrade-system-tests-20:checkstyleMain NO-SOURCE
> Task :streams:upgrade-system-tests-20:compileTestJava
> Task :streams:upgrade-system-tests-20:processTestResources NO-SOURCE
> Task :streams:upgrade-system-tests-20:testClasses
> Task :streams:upgrade-system-tests-20:checkstyleTest
> Task :streams:upgrade-system-tests-20:spotbugsMain NO-SOURCE
> Task :streams:upgrade-system-tests-20:test
> Task :streams:upgrade-system-tests-21:compileJava NO-SOURCE
> Task :streams:upgrade-system-tests-21:processResources NO-SOURCE
> Task :streams:upgrade-system-tests-21:classes UP-TO-DATE
> Task :streams:upgrade-system-tests-21:checkstyleMain NO-SOURCE
> Task :streams:upgrade-system-tests-21:compileTestJava
> Task :streams:upgrade-system-tests-21:processTestResources NO-SOURCE
> Task :streams:upgrade-system-tests-21:testClasses
> Task :streams:upgrade-system-tests-21:checkstyleTest
> Task :streams:upgrade-system-tests-21:spotbugsMain NO-SOURCE
> Task :streams:upgrade-system-tests-21:test
> Task :streams:upgrade-system-tests-22:compileJava NO-SOURCE
> Task :streams:upgrade-system-tests-22:processResources NO-SOURCE
> Task :streams:upgrade-system-tests-22:classes UP-TO-DATE
> Task :streams:upgrade-system-tests-22:checkstyleMain NO-SOURCE
> Task :streams:upgrade-system-tests-22:compileTestJava
> Task :streams:upgrade-system-tests-22:processTestResources NO-SOURCE
> Task :streams:upgrade-system-tests-22:testClasses
> Task :streams:upgrade-system-tests-22:checkstyleTest
> Task :streams:upgrade-system-tests-22:spotbugsMain NO-SOURCE
> Task :streams:upgrade-system-tests-22:test
> Task :streams:upgrade-system-tests-23:compileJava NO-SOURCE
> Task :streams:upgrade-system-tests-23:processResources NO-SOURCE
> Task :streams:upgrade-system-tests-23:classes UP-TO-DATE
> Task :streams:upgrade-system-tests-23:checkstyleMain NO-SOURCE
> Task :streams:upgrade-system-tests-23:compileTestJava
> Task :streams:upgrade-system-tests-23:processTestResources NO-SOURCE
> Task :streams:upgrade-system-tests-23:testClasses
> Task :streams:upgrade-system-tests-23:checkstyleTest
> Task :streams:upgrade-system-tests-23:spotbugsMain NO-SOURCE
> Task :streams:upgrade-system-tests-23:test
> Task :streams:upgrade-system-tests-24:compileJava NO-SOURCE
> Task :streams:upgrade-system-tests-24:processResources NO-SOURCE
> Task :streams:upgrade-system-tests-24:classes UP-TO-DATE
> Task :streams:upgrade-system-tests-24:checkstyleMain NO-SOURCE
> Task :streams:upgrade-system-tests-24:compileTestJava
> Task :streams:upgrade-system-tests-24:processTestResources NO-SOURCE
> Task :streams:upgrade-system-tests-24:testClasses
> Task :streams:upgrade-system-tests-24:checkstyleTest
> Task :streams:upgrade-system-tests-24:spotbugsMain NO-SOURCE
> Task :streams:upgrade-system-tests-24:test
> Task :streams:upgrade-system-tests-25:compileJava NO-SOURCE
> Task :streams:upgrade-system-tests-25:processResources NO-SOURCE
> Task :streams:upgrade-system-tests-25:classes UP-TO-DATE
> Task :streams:upgrade-system-tests-25:checkstyleMain NO-SOURCE
> Task :streams:upgrade-system-tests-25:compileTestJava
> Task :streams:upgrade-system-tests-25:processTestResources NO-SOURCE
> Task :streams:upgrade-system-tests-25:testClasses
> Task :streams:upgrade-system-tests-25:checkstyleTest
> Task :streams:upgrade-system-tests-25:spotbugsMain NO-SOURCE
> Task :streams:upgrade-system-tests-25:test

FAILURE: Build failed with an exception.

* What went wrong:
Execution failed for task ':connect:runtime:test'.
> There were failing tests. See the report at: file://<https://builds.apache.org/job/kafka-trunk-jdk8/ws/connect/runtime/build/reports/tests/test/index.html>

* Try:
Run with --stacktrace option to get the stack trace. Run with --info or --debug option to get more log output. Run with --scan to get full insights.

* Get more help at https://help.gradle.org

Deprecated Gradle features were used in this build, making it incompatible with Gradle 7.0.
Use '--warning-mode all' to show the individual deprecation warnings.
See https://docs.gradle.org/6.5/userguide/command_line_interface.html#sec:command_line_warnings

BUILD FAILED in 1h 58m 13s
216 actionable tasks: 184 executed, 32 up-to-date
Build step 'Execute shell' marked build as failure
[FINDBUGS] Collecting findbugs analysis files...
Setting GRADLE_4_10_3_HOME=/home/jenkins/tools/gradle/4.10.3
[FINDBUGS] Searching for all files in <https://builds.apache.org/job/kafka-trunk-jdk8/ws/> that match the pattern **/build/reports/*bugs/*.xml
[FINDBUGS] Parsing 19 files in <https://builds.apache.org/job/kafka-trunk-jdk8/ws/>
[FINDBUGS] Successfully parsed file <https://builds.apache.org/job/kafka-trunk-jdk8/ws/clients/build/reports/spotbugs/main.xml> with 0 unique warnings and 0 duplicates.
[FINDBUGS] Successfully parsed file <https://builds.apache.org/job/kafka-trunk-jdk8/ws/connect/api/build/reports/spotbugs/main.xml> with 0 unique warnings and 0 duplicates.
[FINDBUGS] Successfully parsed file <https://builds.apache.org/job/kafka-trunk-jdk8/ws/connect/basic-auth-extension/build/reports/spotbugs/main.xml> with 0 unique warnings and 0 duplicates.
[FINDBUGS] Successfully parsed file <https://builds.apache.org/job/kafka-trunk-jdk8/ws/connect/file/build/reports/spotbugs/main.xml> with 0 unique warnings and 0 duplicates.
[FINDBUGS] Successfully parsed file <https://builds.apache.org/job/kafka-trunk-jdk8/ws/connect/json/build/reports/spotbugs/main.xml> with 0 unique warnings and 0 duplicates.
[FINDBUGS] Successfully parsed file <https://builds.apache.org/job/kafka-trunk-jdk8/ws/connect/mirror-client/build/reports/spotbugs/main.xml> with 0 unique warnings and 0 duplicates.
[FINDBUGS] Successfully parsed file <https://builds.apache.org/job/kafka-trunk-jdk8/ws/connect/mirror/build/reports/spotbugs/main.xml> with 0 unique warnings and 0 duplicates.
[FINDBUGS] Successfully parsed file <https://builds.apache.org/job/kafka-trunk-jdk8/ws/connect/runtime/build/reports/spotbugs/main.xml> with 0 unique warnings and 0 duplicates.
[FINDBUGS] Successfully parsed file <https://builds.apache.org/job/kafka-trunk-jdk8/ws/connect/transforms/build/reports/spotbugs/main.xml> with 0 unique warnings and 0 duplicates.
[FINDBUGS] Successfully parsed file <https://builds.apache.org/job/kafka-trunk-jdk8/ws/core/build/reports/spotbugs/main.xml> with 0 unique warnings and 0 duplicates.
[FINDBUGS] Successfully parsed file <https://builds.apache.org/job/kafka-trunk-jdk8/ws/examples/build/reports/spotbugs/main.xml> with 0 unique warnings and 0 duplicates.
[FINDBUGS] Successfully parsed file <https://builds.apache.org/job/kafka-trunk-jdk8/ws/generator/build/reports/spotbugs/main.xml> with 0 unique warnings and 0 duplicates.
[FINDBUGS] Successfully parsed file <https://builds.apache.org/job/kafka-trunk-jdk8/ws/jmh-benchmarks/build/reports/spotbugs/main.xml> with 0 unique warnings and 0 duplicates.
[FINDBUGS] Successfully parsed file <https://builds.apache.org/job/kafka-trunk-jdk8/ws/log4j-appender/build/reports/spotbugs/main.xml> with 0 unique warnings and 0 duplicates.
[FINDBUGS] Successfully parsed file <https://builds.apache.org/job/kafka-trunk-jdk8/ws/streams/build/reports/spotbugs/main.xml> with 0 unique warnings and 0 duplicates.
[FINDBUGS] Successfully parsed file <https://builds.apache.org/job/kafka-trunk-jdk8/ws/streams/examples/build/reports/spotbugs/main.xml> with 0 unique warnings and 0 duplicates.
[FINDBUGS] Successfully parsed file <https://builds.apache.org/job/kafka-trunk-jdk8/ws/streams/streams-scala/build/reports/spotbugs/main.xml> with 0 unique warnings and 0 duplicates.
[FINDBUGS] Successfully parsed file <https://builds.apache.org/job/kafka-trunk-jdk8/ws/streams/test-utils/build/reports/spotbugs/main.xml> with 0 unique warnings and 0 duplicates.
[FINDBUGS] Successfully parsed file <https://builds.apache.org/job/kafka-trunk-jdk8/ws/tools/build/reports/spotbugs/main.xml> with 0 unique warnings and 0 duplicates.
Setting GRADLE_4_10_3_HOME=/home/jenkins/tools/gradle/4.10.3
No credentials specified
Setting GRADLE_4_10_3_HOME=/home/jenkins/tools/gradle/4.10.3
<Git Blamer> Using GitBlamer to create author and commit information for all warnings.
<Git Blamer> GIT_COMMIT=783a6451f5f8c50dbe151caf5e76b74917690364, workspace=<https://builds.apache.org/job/kafka-trunk-jdk8/ws/>
[FINDBUGS] Computing warning deltas based on reference build #4743
Recording test results
Setting GRADLE_4_10_3_HOME=/home/jenkins/tools/gradle/4.10.3
Setting GRADLE_4_10_3_HOME=/home/jenkins/tools/gradle/4.10.3
Not sending mail to unregistered user noreply@github.com

Build failed in Jenkins: kafka-trunk-jdk8 #4750

Posted by Apache Jenkins Server <je...@builds.apache.org>.
See <https://builds.apache.org/job/kafka-trunk-jdk8/4750/display/redirect?page=changes>

Changes:

[github] KAFKA-10270: A broker to controller channel manager (#9012)


------------------------------------------
[...truncated 6.37 MB...]

org.apache.kafka.streams.internals.WindowStoreFacadeTest > shouldPutWithUnknownTimestamp PASSED

org.apache.kafka.streams.internals.WindowStoreFacadeTest > shouldPutWindowStartTimestampWithUnknownTimestamp STARTED

org.apache.kafka.streams.internals.WindowStoreFacadeTest > shouldPutWindowStartTimestampWithUnknownTimestamp PASSED

org.apache.kafka.streams.internals.WindowStoreFacadeTest > shouldReturnIsPersistent STARTED

org.apache.kafka.streams.internals.WindowStoreFacadeTest > shouldReturnIsPersistent PASSED

org.apache.kafka.streams.internals.WindowStoreFacadeTest > shouldForwardClose STARTED

org.apache.kafka.streams.internals.WindowStoreFacadeTest > shouldForwardClose PASSED

org.apache.kafka.streams.internals.WindowStoreFacadeTest > shouldForwardFlush STARTED

org.apache.kafka.streams.internals.WindowStoreFacadeTest > shouldForwardFlush PASSED

org.apache.kafka.streams.internals.WindowStoreFacadeTest > shouldForwardInit STARTED

org.apache.kafka.streams.internals.WindowStoreFacadeTest > shouldForwardInit PASSED

org.apache.kafka.streams.TestTopicsTest > testNonUsedOutputTopic STARTED

org.apache.kafka.streams.TestTopicsTest > testNonUsedOutputTopic PASSED

org.apache.kafka.streams.TestTopicsTest > testEmptyTopic STARTED

org.apache.kafka.streams.TestTopicsTest > testEmptyTopic PASSED

org.apache.kafka.streams.TestTopicsTest > testStartTimestamp STARTED

org.apache.kafka.streams.TestTopicsTest > testStartTimestamp PASSED

org.apache.kafka.streams.TestTopicsTest > testNegativeAdvance STARTED

org.apache.kafka.streams.TestTopicsTest > testNegativeAdvance PASSED

org.apache.kafka.streams.TestTopicsTest > shouldNotAllowToCreateWithNullDriver STARTED

org.apache.kafka.streams.TestTopicsTest > shouldNotAllowToCreateWithNullDriver PASSED

org.apache.kafka.streams.TestTopicsTest > testDuration STARTED

org.apache.kafka.streams.TestTopicsTest > testDuration PASSED

org.apache.kafka.streams.TestTopicsTest > testOutputToString STARTED

org.apache.kafka.streams.TestTopicsTest > testOutputToString PASSED

org.apache.kafka.streams.TestTopicsTest > testValue STARTED

org.apache.kafka.streams.TestTopicsTest > testValue PASSED

org.apache.kafka.streams.TestTopicsTest > testTimestampAutoAdvance STARTED

org.apache.kafka.streams.TestTopicsTest > testTimestampAutoAdvance PASSED

org.apache.kafka.streams.TestTopicsTest > testOutputWrongSerde STARTED

org.apache.kafka.streams.TestTopicsTest > testOutputWrongSerde PASSED

org.apache.kafka.streams.TestTopicsTest > shouldNotAllowToCreateOutputTopicWithNullTopicName STARTED

org.apache.kafka.streams.TestTopicsTest > shouldNotAllowToCreateOutputTopicWithNullTopicName PASSED

org.apache.kafka.streams.TestTopicsTest > testWrongSerde STARTED

org.apache.kafka.streams.TestTopicsTest > testWrongSerde PASSED

org.apache.kafka.streams.TestTopicsTest > testKeyValuesToMapWithNull STARTED

org.apache.kafka.streams.TestTopicsTest > testKeyValuesToMapWithNull PASSED

org.apache.kafka.streams.TestTopicsTest > testNonExistingOutputTopic STARTED

org.apache.kafka.streams.TestTopicsTest > testNonExistingOutputTopic PASSED

org.apache.kafka.streams.TestTopicsTest > testMultipleTopics STARTED

org.apache.kafka.streams.TestTopicsTest > testMultipleTopics PASSED

org.apache.kafka.streams.TestTopicsTest > testKeyValueList STARTED

org.apache.kafka.streams.TestTopicsTest > testKeyValueList PASSED

org.apache.kafka.streams.TestTopicsTest > shouldNotAllowToCreateOutputWithNullDriver STARTED

org.apache.kafka.streams.TestTopicsTest > shouldNotAllowToCreateOutputWithNullDriver PASSED

org.apache.kafka.streams.TestTopicsTest > testValueList STARTED

org.apache.kafka.streams.TestTopicsTest > testValueList PASSED

org.apache.kafka.streams.TestTopicsTest > testRecordList STARTED

org.apache.kafka.streams.TestTopicsTest > testRecordList PASSED

org.apache.kafka.streams.TestTopicsTest > testNonExistingInputTopic STARTED

org.apache.kafka.streams.TestTopicsTest > testNonExistingInputTopic PASSED

org.apache.kafka.streams.TestTopicsTest > testKeyValuesToMap STARTED

org.apache.kafka.streams.TestTopicsTest > testKeyValuesToMap PASSED

org.apache.kafka.streams.TestTopicsTest > testRecordsToList STARTED

org.apache.kafka.streams.TestTopicsTest > testRecordsToList PASSED

org.apache.kafka.streams.TestTopicsTest > testKeyValueListDuration STARTED

org.apache.kafka.streams.TestTopicsTest > testKeyValueListDuration PASSED

org.apache.kafka.streams.TestTopicsTest > testInputToString STARTED

org.apache.kafka.streams.TestTopicsTest > testInputToString PASSED

org.apache.kafka.streams.TestTopicsTest > testTimestamp STARTED

org.apache.kafka.streams.TestTopicsTest > testTimestamp PASSED

org.apache.kafka.streams.TestTopicsTest > testWithHeaders STARTED

org.apache.kafka.streams.TestTopicsTest > testWithHeaders PASSED

org.apache.kafka.streams.TestTopicsTest > testKeyValue STARTED

org.apache.kafka.streams.TestTopicsTest > testKeyValue PASSED

org.apache.kafka.streams.TestTopicsTest > shouldNotAllowToCreateTopicWithNullTopicName STARTED

org.apache.kafka.streams.TestTopicsTest > shouldNotAllowToCreateTopicWithNullTopicName PASSED

> Task :streams:upgrade-system-tests-11:spotbugsMain NO-SOURCE
> Task :streams:upgrade-system-tests-11:test
> Task :streams:upgrade-system-tests-20:compileJava NO-SOURCE
> Task :streams:upgrade-system-tests-20:processResources NO-SOURCE
> Task :streams:upgrade-system-tests-20:classes UP-TO-DATE
> Task :streams:upgrade-system-tests-20:checkstyleMain NO-SOURCE
> Task :streams:upgrade-system-tests-20:compileTestJava
> Task :streams:upgrade-system-tests-20:processTestResources NO-SOURCE
> Task :streams:upgrade-system-tests-20:testClasses
> Task :streams:upgrade-system-tests-20:checkstyleTest
> Task :streams:upgrade-system-tests-20:spotbugsMain NO-SOURCE
> Task :streams:upgrade-system-tests-20:test
> Task :streams:upgrade-system-tests-21:compileJava NO-SOURCE
> Task :streams:upgrade-system-tests-21:processResources NO-SOURCE
> Task :streams:upgrade-system-tests-21:classes UP-TO-DATE
> Task :streams:upgrade-system-tests-21:checkstyleMain NO-SOURCE
> Task :streams:upgrade-system-tests-21:compileTestJava
> Task :streams:upgrade-system-tests-21:processTestResources NO-SOURCE
> Task :streams:upgrade-system-tests-21:testClasses
> Task :streams:upgrade-system-tests-21:checkstyleTest
> Task :streams:upgrade-system-tests-21:spotbugsMain NO-SOURCE
> Task :streams:upgrade-system-tests-21:test
> Task :streams:upgrade-system-tests-22:compileJava NO-SOURCE
> Task :streams:upgrade-system-tests-22:processResources NO-SOURCE
> Task :streams:upgrade-system-tests-22:classes UP-TO-DATE
> Task :streams:upgrade-system-tests-22:checkstyleMain NO-SOURCE
> Task :streams:upgrade-system-tests-22:compileTestJava
> Task :streams:upgrade-system-tests-22:processTestResources NO-SOURCE
> Task :streams:upgrade-system-tests-22:testClasses
> Task :streams:upgrade-system-tests-22:checkstyleTest
> Task :streams:upgrade-system-tests-22:spotbugsMain NO-SOURCE
> Task :streams:upgrade-system-tests-22:test
> Task :streams:upgrade-system-tests-23:compileJava NO-SOURCE
> Task :streams:upgrade-system-tests-23:processResources NO-SOURCE
> Task :streams:upgrade-system-tests-23:classes UP-TO-DATE
> Task :streams:upgrade-system-tests-23:checkstyleMain NO-SOURCE
> Task :streams:upgrade-system-tests-23:compileTestJava
> Task :streams:upgrade-system-tests-23:processTestResources NO-SOURCE
> Task :streams:upgrade-system-tests-23:testClasses
> Task :streams:upgrade-system-tests-23:checkstyleTest
> Task :streams:upgrade-system-tests-23:spotbugsMain NO-SOURCE
> Task :streams:upgrade-system-tests-23:test
> Task :streams:upgrade-system-tests-24:compileJava NO-SOURCE
> Task :streams:upgrade-system-tests-24:processResources NO-SOURCE
> Task :streams:upgrade-system-tests-24:classes UP-TO-DATE
> Task :streams:upgrade-system-tests-24:checkstyleMain NO-SOURCE
> Task :streams:upgrade-system-tests-24:compileTestJava
> Task :streams:upgrade-system-tests-24:processTestResources NO-SOURCE
> Task :streams:upgrade-system-tests-24:testClasses
> Task :streams:upgrade-system-tests-24:checkstyleTest
> Task :streams:upgrade-system-tests-24:spotbugsMain NO-SOURCE
> Task :streams:upgrade-system-tests-24:test
> Task :streams:upgrade-system-tests-25:compileJava NO-SOURCE
> Task :streams:upgrade-system-tests-25:processResources NO-SOURCE
> Task :streams:upgrade-system-tests-25:classes UP-TO-DATE
> Task :streams:upgrade-system-tests-25:checkstyleMain NO-SOURCE
> Task :streams:upgrade-system-tests-25:compileTestJava
> Task :streams:upgrade-system-tests-25:processTestResources NO-SOURCE
> Task :streams:upgrade-system-tests-25:testClasses
> Task :streams:upgrade-system-tests-25:checkstyleTest
> Task :streams:upgrade-system-tests-25:spotbugsMain NO-SOURCE
> Task :streams:upgrade-system-tests-25:test

FAILURE: Build failed with an exception.

* What went wrong:
Execution failed for task ':core:test'.
> There were failing tests. See the report at: file://<https://builds.apache.org/job/kafka-trunk-jdk8/ws/core/build/reports/tests/test/index.html>

* Try:
Run with --stacktrace option to get the stack trace. Run with --info or --debug option to get more log output. Run with --scan to get full insights.

* Get more help at https://help.gradle.org

Deprecated Gradle features were used in this build, making it incompatible with Gradle 7.0.
Use '--warning-mode all' to show the individual deprecation warnings.
See https://docs.gradle.org/6.5/userguide/command_line_interface.html#sec:command_line_warnings

BUILD FAILED in 2h 17m 12s
216 actionable tasks: 212 executed, 4 up-to-date
Build step 'Execute shell' marked build as failure
[FINDBUGS] Collecting findbugs analysis files...
Setting GRADLE_4_10_3_HOME=/home/jenkins/tools/gradle/4.10.3
[FINDBUGS] Searching for all files in <https://builds.apache.org/job/kafka-trunk-jdk8/ws/> that match the pattern **/build/reports/*bugs/*.xml
[FINDBUGS] Parsing 19 files in <https://builds.apache.org/job/kafka-trunk-jdk8/ws/>
[FINDBUGS] Successfully parsed file <https://builds.apache.org/job/kafka-trunk-jdk8/ws/clients/build/reports/spotbugs/main.xml> with 0 unique warnings and 0 duplicates.
[FINDBUGS] Successfully parsed file <https://builds.apache.org/job/kafka-trunk-jdk8/ws/connect/api/build/reports/spotbugs/main.xml> with 0 unique warnings and 0 duplicates.
[FINDBUGS] Successfully parsed file <https://builds.apache.org/job/kafka-trunk-jdk8/ws/connect/basic-auth-extension/build/reports/spotbugs/main.xml> with 0 unique warnings and 0 duplicates.
[FINDBUGS] Successfully parsed file <https://builds.apache.org/job/kafka-trunk-jdk8/ws/connect/file/build/reports/spotbugs/main.xml> with 0 unique warnings and 0 duplicates.
[FINDBUGS] Successfully parsed file <https://builds.apache.org/job/kafka-trunk-jdk8/ws/connect/json/build/reports/spotbugs/main.xml> with 0 unique warnings and 0 duplicates.
[FINDBUGS] Successfully parsed file <https://builds.apache.org/job/kafka-trunk-jdk8/ws/connect/mirror-client/build/reports/spotbugs/main.xml> with 0 unique warnings and 0 duplicates.
[FINDBUGS] Successfully parsed file <https://builds.apache.org/job/kafka-trunk-jdk8/ws/connect/mirror/build/reports/spotbugs/main.xml> with 0 unique warnings and 0 duplicates.
[FINDBUGS] Successfully parsed file <https://builds.apache.org/job/kafka-trunk-jdk8/ws/connect/runtime/build/reports/spotbugs/main.xml> with 0 unique warnings and 0 duplicates.
[FINDBUGS] Successfully parsed file <https://builds.apache.org/job/kafka-trunk-jdk8/ws/connect/transforms/build/reports/spotbugs/main.xml> with 0 unique warnings and 0 duplicates.
[FINDBUGS] Successfully parsed file <https://builds.apache.org/job/kafka-trunk-jdk8/ws/core/build/reports/spotbugs/main.xml> with 0 unique warnings and 0 duplicates.
[FINDBUGS] Successfully parsed file <https://builds.apache.org/job/kafka-trunk-jdk8/ws/examples/build/reports/spotbugs/main.xml> with 0 unique warnings and 0 duplicates.
[FINDBUGS] Successfully parsed file <https://builds.apache.org/job/kafka-trunk-jdk8/ws/generator/build/reports/spotbugs/main.xml> with 0 unique warnings and 0 duplicates.
[FINDBUGS] Successfully parsed file <https://builds.apache.org/job/kafka-trunk-jdk8/ws/jmh-benchmarks/build/reports/spotbugs/main.xml> with 0 unique warnings and 0 duplicates.
[FINDBUGS] Successfully parsed file <https://builds.apache.org/job/kafka-trunk-jdk8/ws/log4j-appender/build/reports/spotbugs/main.xml> with 0 unique warnings and 0 duplicates.
[FINDBUGS] Successfully parsed file <https://builds.apache.org/job/kafka-trunk-jdk8/ws/streams/build/reports/spotbugs/main.xml> with 0 unique warnings and 0 duplicates.
[FINDBUGS] Successfully parsed file <https://builds.apache.org/job/kafka-trunk-jdk8/ws/streams/examples/build/reports/spotbugs/main.xml> with 0 unique warnings and 0 duplicates.
[FINDBUGS] Successfully parsed file <https://builds.apache.org/job/kafka-trunk-jdk8/ws/streams/streams-scala/build/reports/spotbugs/main.xml> with 0 unique warnings and 0 duplicates.
[FINDBUGS] Successfully parsed file <https://builds.apache.org/job/kafka-trunk-jdk8/ws/streams/test-utils/build/reports/spotbugs/main.xml> with 0 unique warnings and 0 duplicates.
[FINDBUGS] Successfully parsed file <https://builds.apache.org/job/kafka-trunk-jdk8/ws/tools/build/reports/spotbugs/main.xml> with 0 unique warnings and 0 duplicates.
Setting GRADLE_4_10_3_HOME=/home/jenkins/tools/gradle/4.10.3
No credentials specified
Setting GRADLE_4_10_3_HOME=/home/jenkins/tools/gradle/4.10.3
<Git Blamer> Using GitBlamer to create author and commit information for all warnings.
<Git Blamer> GIT_COMMIT=de2e6938c8648f02254a645a8fff9c2fa8364ef1, workspace=<https://builds.apache.org/job/kafka-trunk-jdk8/ws/>
[FINDBUGS] Computing warning deltas based on reference build #4743
Recording test results
Setting GRADLE_4_10_3_HOME=/home/jenkins/tools/gradle/4.10.3
Setting GRADLE_4_10_3_HOME=/home/jenkins/tools/gradle/4.10.3
Not sending mail to unregistered user noreply@github.com

Re: Build failed in Jenkins: kafka-trunk-jdk8 #4749

Posted by Benny Lee <Be...@cba.com.au>.

________________________________
From: Apache Jenkins Server <je...@builds.apache.org>
Sent: Wednesday, 29 July 2020 2:12 PM
To: dev@kafka.apache.org <de...@kafka.apache.org>
Subject: Build failed in Jenkins: kafka-trunk-jdk8 #4749

See <https://builds.apache.org/job/kafka-trunk-jdk8/4749/display/redirect?page=changes>

Changes:

[github] KAFKA-10224: Update jersey license from CDDL to EPLv2 (#9089)


------------------------------------------
[...truncated 2.76 MB...]
org.apache.kafka.streams.integration.KTableKTableForeignKeyJoinIntegrationTest > joinShouldProduceNullsWhenValueHasNonMatchingForeignKey[leftJoin=false, optimization=none, materialized=false, rejoin=true] STARTED

org.apache.kafka.streams.integration.KTableKTableForeignKeyJoinIntegrationTest > joinShouldProduceNullsWhenValueHasNonMatchingForeignKey[leftJoin=false, optimization=none, materialized=false, rejoin=true] PASSED

org.apache.kafka.streams.integration.KTableKTableForeignKeyJoinIntegrationTest > doJoinFromLeftThenDeleteLeftEntity[leftJoin=false, optimization=none, materialized=false, rejoin=true] STARTED

org.apache.kafka.streams.integration.KTableKTableForeignKeyJoinIntegrationTest > doJoinFromLeftThenDeleteLeftEntity[leftJoin=false, optimization=none, materialized=false, rejoin=true] PASSED

org.apache.kafka.streams.integration.KTableKTableForeignKeyJoinIntegrationTest > doJoinFromRightThenDeleteRightEntity[leftJoin=false, optimization=none, materialized=false, rejoin=true] STARTED

org.apache.kafka.streams.integration.KTableKTableForeignKeyJoinIntegrationTest > doJoinFromRightThenDeleteRightEntity[leftJoin=false, optimization=none, materialized=false, rejoin=true] PASSED

org.apache.kafka.streams.integration.KTableKTableForeignKeyJoinIntegrationTest > shouldUnsubscribeOldForeignKeyIfLeftSideIsUpdated[leftJoin=false, optimization=none, materialized=false, rejoin=false] STARTED

org.apache.kafka.streams.integration.KTableKTableForeignKeyJoinIntegrationTest > shouldUnsubscribeOldForeignKeyIfLeftSideIsUpdated[leftJoin=false, optimization=none, materialized=false, rejoin=false] PASSED

org.apache.kafka.streams.integration.KTableKTableForeignKeyJoinIntegrationTest > shouldNotEmitTombstonesWhenDeletingNonExistingRecords[leftJoin=false, optimization=none, materialized=false, rejoin=false] STARTED

org.apache.kafka.streams.integration.KTableKTableForeignKeyJoinIntegrationTest > shouldNotEmitTombstonesWhenDeletingNonExistingRecords[leftJoin=false, optimization=none, materialized=false, rejoin=false] PASSED

org.apache.kafka.streams.integration.KTableKTableForeignKeyJoinIntegrationTest > shouldEmitTombstoneWhenDeletingNonJoiningRecords[leftJoin=false, optimization=none, materialized=false, rejoin=false] STARTED

org.apache.kafka.streams.integration.KTableKTableForeignKeyJoinIntegrationTest > shouldEmitTombstoneWhenDeletingNonJoiningRecords[leftJoin=false, optimization=none, materialized=false, rejoin=false] PASSED

org.apache.kafka.streams.integration.KTableKTableForeignKeyJoinIntegrationTest > joinShouldProduceNullsWhenValueHasNonMatchingForeignKey[leftJoin=false, optimization=none, materialized=false, rejoin=false] STARTED

org.apache.kafka.streams.integration.KTableKTableForeignKeyJoinIntegrationTest > joinShouldProduceNullsWhenValueHasNonMatchingForeignKey[leftJoin=false, optimization=none, materialized=false, rejoin=false] PASSED

org.apache.kafka.streams.integration.KTableKTableForeignKeyJoinIntegrationTest > doJoinFromLeftThenDeleteLeftEntity[leftJoin=false, optimization=none, materialized=false, rejoin=false] STARTED

org.apache.kafka.streams.integration.KTableKTableForeignKeyJoinIntegrationTest > doJoinFromLeftThenDeleteLeftEntity[leftJoin=false, optimization=none, materialized=false, rejoin=false] PASSED

org.apache.kafka.streams.integration.KTableKTableForeignKeyJoinIntegrationTest > doJoinFromRightThenDeleteRightEntity[leftJoin=false, optimization=none, materialized=false, rejoin=false] STARTED

org.apache.kafka.streams.integration.KTableKTableForeignKeyJoinIntegrationTest > doJoinFromRightThenDeleteRightEntity[leftJoin=false, optimization=none, materialized=false, rejoin=false] PASSED

org.apache.kafka.streams.integration.SuppressionDurabilityIntegrationTest > shouldRecoverBufferAfterShutdown[at_least_once] STARTED

org.apache.kafka.streams.integration.SuppressionDurabilityIntegrationTest > shouldRecoverBufferAfterShutdown[at_least_once] PASSED

org.apache.kafka.streams.integration.SuppressionDurabilityIntegrationTest > shouldRecoverBufferAfterShutdown[exactly_once] STARTED

org.apache.kafka.streams.integration.SuppressionDurabilityIntegrationTest > shouldRecoverBufferAfterShutdown[exactly_once] PASSED

org.apache.kafka.streams.integration.SuppressionDurabilityIntegrationTest > shouldRecoverBufferAfterShutdown[exactly_once_beta] STARTED

org.apache.kafka.streams.integration.SuppressionDurabilityIntegrationTest > shouldRecoverBufferAfterShutdown[exactly_once_beta] PASSED

org.apache.kafka.streams.integration.RocksDBMetricsIntegrationTest > shouldExposeRocksDBMetricsBeforeAndAfterFailureWithEmptyStateDir[at_least_once] STARTED

org.apache.kafka.streams.integration.RocksDBMetricsIntegrationTest > shouldExposeRocksDBMetricsBeforeAndAfterFailureWithEmptyStateDir[at_least_once] PASSED

org.apache.kafka.streams.integration.RocksDBMetricsIntegrationTest > shouldExposeRocksDBMetricsBeforeAndAfterFailureWithEmptyStateDir[exactly_once] STARTED

org.apache.kafka.streams.integration.RocksDBMetricsIntegrationTest > shouldExposeRocksDBMetricsBeforeAndAfterFailureWithEmptyStateDir[exactly_once] PASSED

org.apache.kafka.streams.integration.RocksDBMetricsIntegrationTest > shouldExposeRocksDBMetricsBeforeAndAfterFailureWithEmptyStateDir[exactly_once_beta] STARTED

org.apache.kafka.streams.integration.RocksDBMetricsIntegrationTest > shouldExposeRocksDBMetricsBeforeAndAfterFailureWithEmptyStateDir[exactly_once_beta] PASSED

org.apache.kafka.streams.integration.KStreamAggregationIntegrationTest > shouldReduceSessionWindows STARTED

org.apache.kafka.streams.integration.KStreamAggregationIntegrationTest > shouldReduceSessionWindows PASSED

org.apache.kafka.streams.integration.KStreamAggregationIntegrationTest > shouldReduce STARTED

org.apache.kafka.streams.integration.KStreamAggregationIntegrationTest > shouldReduce PASSED

org.apache.kafka.streams.integration.KStreamAggregationIntegrationTest > shouldAggregate STARTED

org.apache.kafka.streams.integration.KStreamAggregationIntegrationTest > shouldAggregate PASSED

org.apache.kafka.streams.integration.KStreamAggregationIntegrationTest > shouldCount STARTED

org.apache.kafka.streams.integration.KStreamAggregationIntegrationTest > shouldCount PASSED

org.apache.kafka.streams.integration.KStreamAggregationIntegrationTest > shouldGroupByKey STARTED

org.apache.kafka.streams.integration.KStreamAggregationIntegrationTest > shouldGroupByKey PASSED

org.apache.kafka.streams.integration.KStreamAggregationIntegrationTest > shouldCountWithInternalStore STARTED

org.apache.kafka.streams.integration.KStreamAggregationIntegrationTest > shouldCountWithInternalStore PASSED

org.apache.kafka.streams.integration.KStreamAggregationIntegrationTest > shouldCountUnlimitedWindows STARTED

org.apache.kafka.streams.integration.KStreamAggregationIntegrationTest > shouldCountUnlimitedWindows PASSED

org.apache.kafka.streams.integration.KStreamAggregationIntegrationTest > shouldReduceWindowed STARTED

org.apache.kafka.streams.integration.KStreamAggregationIntegrationTest > shouldReduceWindowed PASSED

org.apache.kafka.streams.integration.KStreamAggregationIntegrationTest > shouldCountSessionWindows STARTED

org.apache.kafka.streams.integration.KStreamAggregationIntegrationTest > shouldCountSessionWindows PASSED

org.apache.kafka.streams.integration.KStreamAggregationIntegrationTest > shouldAggregateWindowed STARTED

org.apache.kafka.streams.integration.KStreamAggregationIntegrationTest > shouldAggregateWindowed PASSED

org.apache.kafka.streams.integration.GlobalKTableIntegrationTest > shouldGetToRunningWithOnlyGlobalTopology STARTED

org.apache.kafka.streams.integration.GlobalKTableIntegrationTest > shouldGetToRunningWithOnlyGlobalTopology PASSED

org.apache.kafka.streams.integration.GlobalKTableIntegrationTest > shouldKStreamGlobalKTableLeftJoin STARTED

org.apache.kafka.streams.integration.GlobalKTableIntegrationTest > shouldKStreamGlobalKTableLeftJoin PASSED

org.apache.kafka.streams.integration.GlobalKTableIntegrationTest > shouldRestoreGlobalInMemoryKTableOnRestart STARTED

org.apache.kafka.streams.integration.GlobalKTableIntegrationTest > shouldRestoreGlobalInMemoryKTableOnRestart PASSED

org.apache.kafka.streams.integration.GlobalKTableIntegrationTest > shouldKStreamGlobalKTableJoin STARTED

org.apache.kafka.streams.integration.GlobalKTableIntegrationTest > shouldKStreamGlobalKTableJoin PASSED

org.apache.kafka.streams.integration.RestoreIntegrationTest > shouldRecycleStateFromStandbyTaskPromotedToActiveTaskAndNotRestore STARTED

org.apache.kafka.streams.integration.RestoreIntegrationTest > shouldRecycleStateFromStandbyTaskPromotedToActiveTaskAndNotRestore PASSED

org.apache.kafka.streams.integration.RestoreIntegrationTest > shouldProcessDataFromStoresWithLoggingDisabled STARTED

org.apache.kafka.streams.integration.RestoreIntegrationTest > shouldProcessDataFromStoresWithLoggingDisabled PASSED

org.apache.kafka.streams.integration.RestoreIntegrationTest > shouldRestoreStateFromSourceTopic STARTED

org.apache.kafka.streams.integration.RestoreIntegrationTest > shouldRestoreStateFromSourceTopic PASSED

org.apache.kafka.streams.integration.RestoreIntegrationTest > shouldSuccessfullyStartWhenLoggingDisabled STARTED

org.apache.kafka.streams.integration.RestoreIntegrationTest > shouldSuccessfullyStartWhenLoggingDisabled PASSED

org.apache.kafka.streams.integration.RestoreIntegrationTest > shouldRestoreStateFromChangelogTopic STARTED

org.apache.kafka.streams.integration.RestoreIntegrationTest > shouldRestoreStateFromChangelogTopic PASSED

org.apache.kafka.streams.integration.FineGrainedAutoResetIntegrationTest > shouldOnlyReadRecordsWhereEarliestSpecifiedWithNoCommittedOffsetsWithGlobalAutoOffsetResetLatest STARTED

org.apache.kafka.streams.integration.FineGrainedAutoResetIntegrationTest > shouldOnlyReadRecordsWhereEarliestSpecifiedWithNoCommittedOffsetsWithGlobalAutoOffsetResetLatest PASSED

org.apache.kafka.streams.integration.FineGrainedAutoResetIntegrationTest > shouldThrowExceptionOverlappingPattern STARTED

org.apache.kafka.streams.integration.FineGrainedAutoResetIntegrationTest > shouldThrowExceptionOverlappingPattern PASSED

org.apache.kafka.streams.integration.FineGrainedAutoResetIntegrationTest > shouldThrowExceptionOverlappingTopic STARTED

org.apache.kafka.streams.integration.FineGrainedAutoResetIntegrationTest > shouldThrowExceptionOverlappingTopic PASSED

org.apache.kafka.streams.integration.FineGrainedAutoResetIntegrationTest > shouldOnlyReadRecordsWhereEarliestSpecifiedWithInvalidCommittedOffsets STARTED

org.apache.kafka.streams.integration.FineGrainedAutoResetIntegrationTest > shouldOnlyReadRecordsWhereEarliestSpecifiedWithInvalidCommittedOffsets PASSED

org.apache.kafka.streams.integration.FineGrainedAutoResetIntegrationTest > shouldOnlyReadRecordsWhereEarliestSpecifiedWithNoCommittedOffsetsWithDefaultGlobalAutoOffsetResetEarliest STARTED

org.apache.kafka.streams.integration.FineGrainedAutoResetIntegrationTest > shouldOnlyReadRecordsWhereEarliestSpecifiedWithNoCommittedOffsetsWithDefaultGlobalAutoOffsetResetEarliest PASSED

org.apache.kafka.streams.integration.FineGrainedAutoResetIntegrationTest > shouldThrowStreamsExceptionNoResetSpecified STARTED

org.apache.kafka.streams.integration.FineGrainedAutoResetIntegrationTest > shouldThrowStreamsExceptionNoResetSpecified PASSED

org.apache.kafka.streams.integration.ResetIntegrationWithSslTest > testReprocessingFromScratchAfterResetWithIntermediateInternalTopic STARTED

org.apache.kafka.streams.integration.ResetIntegrationWithSslTest > testReprocessingFromScratchAfterResetWithIntermediateInternalTopic PASSED

org.apache.kafka.streams.integration.ResetIntegrationWithSslTest > testReprocessingFromScratchAfterResetWithIntermediateUserTopic STARTED

org.apache.kafka.streams.integration.ResetIntegrationWithSslTest > testReprocessingFromScratchAfterResetWithIntermediateUserTopic PASSED

org.apache.kafka.streams.integration.ResetIntegrationWithSslTest > testReprocessingFromScratchAfterResetWithoutIntermediateUserTopic STARTED

org.apache.kafka.streams.integration.ResetIntegrationWithSslTest > testReprocessingFromScratchAfterResetWithoutIntermediateUserTopic PASSED

org.apache.kafka.streams.integration.KTableKTableForeignKeyJoinMaterializationIntegrationTest > shouldEmitTombstoneWhenDeletingNonJoiningRecords[materialized=false, queriable=false] STARTED

org.apache.kafka.streams.integration.KTableKTableForeignKeyJoinMaterializationIntegrationTest > shouldEmitTombstoneWhenDeletingNonJoiningRecords[materialized=false, queriable=false] PASSED

org.apache.kafka.streams.integration.KTableKTableForeignKeyJoinMaterializationIntegrationTest > shouldEmitTombstoneWhenDeletingNonJoiningRecords[materialized=true, queriable=false] STARTED

org.apache.kafka.streams.integration.KTableKTableForeignKeyJoinMaterializationIntegrationTest > shouldEmitTombstoneWhenDeletingNonJoiningRecords[materialized=true, queriable=false] PASSED

org.apache.kafka.streams.integration.KTableKTableForeignKeyJoinMaterializationIntegrationTest > shouldEmitTombstoneWhenDeletingNonJoiningRecords[materialized=true, queriable=true] STARTED

org.apache.kafka.streams.integration.KTableKTableForeignKeyJoinMaterializationIntegrationTest > shouldEmitTombstoneWhenDeletingNonJoiningRecords[materialized=true, queriable=true] PASSED

org.apache.kafka.streams.integration.StandbyTaskEOSIntegrationTest > shouldWipeOutStandbyStateDirectoryIfCheckpointIsMissing[exactly_once] STARTED

org.apache.kafka.streams.integration.StandbyTaskEOSIntegrationTest > shouldWipeOutStandbyStateDirectoryIfCheckpointIsMissing[exactly_once] PASSED

org.apache.kafka.streams.integration.StandbyTaskEOSIntegrationTest > shouldSurviveWithOneTaskAsStandby[exactly_once] STARTED

org.apache.kafka.streams.integration.StandbyTaskEOSIntegrationTest > shouldSurviveWithOneTaskAsStandby[exactly_once] PASSED

org.apache.kafka.streams.integration.StandbyTaskEOSIntegrationTest > shouldWipeOutStandbyStateDirectoryIfCheckpointIsMissing[exactly_once_beta] STARTED

org.apache.kafka.streams.integration.StandbyTaskEOSIntegrationTest > shouldWipeOutStandbyStateDirectoryIfCheckpointIsMissing[exactly_once_beta] PASSED

org.apache.kafka.streams.integration.StandbyTaskEOSIntegrationTest > shouldSurviveWithOneTaskAsStandby[exactly_once_beta] STARTED

org.apache.kafka.streams.integration.StandbyTaskEOSIntegrationTest > shouldSurviveWithOneTaskAsStandby[exactly_once_beta] PASSED
ERROR: Could not install GRADLE_4_10_3_HOME
java.lang.NullPointerException
ERROR: Could not install GRADLE_4_10_3_HOME
java.lang.NullPointerException
ERROR: Could not install GRADLE_4_10_3_HOME
java.lang.NullPointerException
ERROR: Could not install GRADLE_4_10_3_HOME
java.lang.NullPointerException
ERROR: Could not install GRADLE_4_10_3_HOME
java.lang.NullPointerException
ERROR: Could not install GRADLE_4_10_3_HOME
java.lang.NullPointerException
ERROR: Could not install GRADLE_4_10_3_HOME
java.lang.NullPointerException
ERROR: Could not install GRADLE_4_10_3_HOME
java.lang.NullPointerException
ERROR: Could not install GRADLE_4_10_3_HOME
java.lang.NullPointerException
Build timed out (after 600 minutes). Marking the build as failed.
Build was aborted
[FINDBUGS] Collecting findbugs analysis files...
Setting GRADLE_4_10_3_HOME=/home/jenkins/tools/gradle/4.10.3

org.apache.kafka.streams.processor.internals.GlobalStreamThreadTest > shouldDieOnInvalidOffsetExceptionDuringStartup SKIPPED

> Task :streams:test FAILED
[FINDBUGS] Searching for all files in <https://builds.apache.org/job/kafka-trunk-jdk8/ws/> that match the pattern **/build/reports/*bugs/*.xml
[FINDBUGS] Parsing 12 files in <https://builds.apache.org/job/kafka-trunk-jdk8/ws/>
[FINDBUGS] Successfully parsed file <https://builds.apache.org/job/kafka-trunk-jdk8/ws/clients/build/reports/spotbugs/main.xml> with 0 unique warnings and 0 duplicates.
[FINDBUGS] Successfully parsed file <https://builds.apache.org/job/kafka-trunk-jdk8/ws/connect/api/build/reports/spotbugs/main.xml> with 0 unique warnings and 0 duplicates.
[FINDBUGS] Successfully parsed file <https://builds.apache.org/job/kafka-trunk-jdk8/ws/connect/basic-auth-extension/build/reports/spotbugs/main.xml> with 0 unique warnings and 0 duplicates.
[FINDBUGS] Successfully parsed file <https://builds.apache.org/job/kafka-trunk-jdk8/ws/connect/file/build/reports/spotbugs/main.xml> with 0 unique warnings and 0 duplicates.
[FINDBUGS] Successfully parsed file <https://builds.apache.org/job/kafka-trunk-jdk8/ws/connect/json/build/reports/spotbugs/main.xml> with 0 unique warnings and 0 duplicates.
[FINDBUGS] Successfully parsed file <https://builds.apache.org/job/kafka-trunk-jdk8/ws/core/build/reports/spotbugs/main.xml> with 0 unique warnings and 0 duplicates.
[FINDBUGS] Successfully parsed file <https://builds.apache.org/job/kafka-trunk-jdk8/ws/examples/build/reports/spotbugs/main.xml> with 0 unique warnings and 0 duplicates.
[FINDBUGS] Successfully parsed file <https://builds.apache.org/job/kafka-trunk-jdk8/ws/generator/build/reports/spotbugs/main.xml> with 0 unique warnings and 0 duplicates.
[FINDBUGS] Successfully parsed file <https://builds.apache.org/job/kafka-trunk-jdk8/ws/jmh-benchmarks/build/reports/spotbugs/main.xml> with 0 unique warnings and 0 duplicates.
[FINDBUGS] Successfully parsed file <https://builds.apache.org/job/kafka-trunk-jdk8/ws/log4j-appender/build/reports/spotbugs/main.xml> with 0 unique warnings and 0 duplicates.
[FINDBUGS] Successfully parsed file <https://builds.apache.org/job/kafka-trunk-jdk8/ws/streams/build/reports/spotbugs/main.xml> with 0 unique warnings and 0 duplicates.
[FINDBUGS] Successfully parsed file <https://builds.apache.org/job/kafka-trunk-jdk8/ws/tools/build/reports/spotbugs/main.xml> with 0 unique warnings and 0 duplicates.
Setting GRADLE_4_10_3_HOME=/home/jenkins/tools/gradle/4.10.3
No credentials specified
Setting GRADLE_4_10_3_HOME=/home/jenkins/tools/gradle/4.10.3
<Git Blamer> Using GitBlamer to create author and commit information for all warnings.
<Git Blamer> GIT_COMMIT=3993041c7602506a8b194e3a67ac018b623a3cd8, workspace=<https://builds.apache.org/job/kafka-trunk-jdk8/ws/>
[FINDBUGS] Computing warning deltas based on reference build #4743
Recording test results
Setting GRADLE_4_10_3_HOME=/home/jenkins/tools/gradle/4.10.3
Setting GRADLE_4_10_3_HOME=/home/jenkins/tools/gradle/4.10.3
Not sending mail to unregistered user noreply@github.com

************** IMPORTANT MESSAGE *****************************
This e-mail message is intended only for the addressee(s) and contains information which may be
confidential.
If you are not the intended recipient please advise the sender by return email, do not use or
disclose the contents, and delete the message and any attachments from your system. Unless
specifically indicated, this email does not constitute formal advice or commitment by the sender
or the Commonwealth Bank of Australia (ABN 48 123 123 124 AFSL and Australian credit licence 234945)
or its subsidiaries.
We can be contacted through our web site: commbank.com.au.
If you no longer wish to receive commercial electronic messages from us, please reply to this
e-mail by typing Unsubscribe in the subject line.
**************************************************************