You are viewing a plain text version of this content. The canonical link for it is here.
Posted to issues@nifi.apache.org by "ASF GitHub Bot (JIRA)" <ji...@apache.org> on 2017/06/06 00:04:12 UTC

[jira] [Commented] (NIFI-3836) CryptoUtilsTest testShouldNotValidateUnreadableFileBasedKeyProvider test failure on Docker maven:latest

    [ https://issues.apache.org/jira/browse/NIFI-3836?page=com.atlassian.jira.plugin.system.issuetabpanels:comment-tabpanel&focusedCommentId=16037876#comment-16037876 ] 

ASF GitHub Bot commented on NIFI-3836:
--------------------------------------

Github user jfrazee commented on the issue:

    https://github.com/apache/nifi/pull/1865
  
    @alopresto +1 will open another JIRA for covering the rest of the problems.


> CryptoUtilsTest testShouldNotValidateUnreadableFileBasedKeyProvider test failure on Docker maven:latest
> -------------------------------------------------------------------------------------------------------
>
>                 Key: NIFI-3836
>                 URL: https://issues.apache.org/jira/browse/NIFI-3836
>             Project: Apache NiFi
>          Issue Type: Bug
>          Components: Tools and Build
>    Affects Versions: 1.2.0, 1.3.0
>         Environment: maven:latest (b5ab9b7ecf5a) on Docker for Mac 17.03.1-ce-mac5 (16048)
>            Reporter: Joey Frazee
>            Assignee: Andy LoPresto
>            Priority: Minor
>              Labels: permissions, test
>
> Running `mvn clean install` on Docker consistently fails with:
> {code}
> Tests run: 16, Failures: 1, Errors: 0, Skipped: 0, Time elapsed: 1.65 sec <<< FAILURE! - in org.apache.nifi.provenance.CryptoUtilsTest
> testShouldNotValidateUnreadableFileBasedKeyProvider(org.apache.nifi.provenance.CryptoUtilsTest)  Time elapsed: 0.111 sec  <<< FAILURE!
> org.codehaus.groovy.runtime.powerassert.PowerAssertionError: assert !unreadableKeyProviderIsValid
>        ||
>        |true
>        false
> 	at org.codehaus.groovy.runtime.InvokerHelper.assertFailed(InvokerHelper.java:402)
> 	at org.codehaus.groovy.runtime.ScriptBytecodeAdapter.assertFailed(ScriptBytecodeAdapter.java:650)
> 	at org.apache.nifi.provenance.CryptoUtilsTest.testShouldNotValidateUnreadableFileBasedKeyProvider(CryptoUtilsTest.groovy:214)
> Running org.apache.nifi.provenance.AESProvenanceEventEncryptorTest
> Tests run: 5, Failures: 0, Errors: 0, Skipped: 0, Time elapsed: 0.285 sec - in org.apache.nifi.provenance.AESProvenanceEventEncryptorTest
> Results :
> Failed tests: 
>   CryptoUtilsTest.testShouldNotValidateUnreadableFileBasedKeyProvider:214 assert !unreadableKeyProviderIsValid
>        ||
>        |true
>        false
> {code}



--
This message was sent by Atlassian JIRA
(v6.3.15#6346)