You are viewing a plain text version of this content. The canonical link for it is here.
Posted to builds@cassandra.apache.org by Apache Jenkins Server <je...@builds.apache.org> on 2023/08/16 15:08:20 UTC
Build complete: Cassandra-3.11 #484 [UNSTABLE] 681b6ca103d91d940a9fecb8cd812f58dd2490d0
-------------------------------------------------------------------------------
Build Cassandra-3.11 #484 Still Unstable
URL: https://ci-cassandra.apache.org/job/Cassandra-3.11/484/
-------------------------------------------------------------------------------
Changes:
[Stefan Miklosovic] Prepare debian changelog for 3.11.16
-------------------------------------------------------------------------------
Failed Tests:
28 tests failed.
FAILED: dtest-large-novnode.replication_test.TestSnitchConfigurationUpdate.test_rf_collapse_gossiping_property_file_snitch_multi_dc
FAILED: dtest-large.replace_address_test.TestReplaceAddress.test_replace_shutdown_node
FAILED: dtest-novnode.consistency_test.TestConsistency.test_readrepair
FAILED: dtest-offheap.repair_tests.incremental_repair_test.TestIncRepair.test_sstable_marking
FAILED: dtest-offheap.repair_tests.repair_test.TestRepair.test_simple_sequential_repair
FAILED: dtest-upgrade.upgrade_tests.upgrade_through_versions_test.TestUpgrade_current_2_1_x_To_indev_3_11_x.test_rolling_upgrade_with_internode_ssl
FAILED: dtest-upgrade.upgrade_tests.cql_tests.TestCQLNodes3RF3_Upgrade_indev_2_1_x_To_indev_3_11_x.test_delete_row
FAILED: dtest-upgrade.upgrade_tests.cql_tests.TestCQLNodes3RF3_Upgrade_indev_2_1_x_To_indev_3_11_x.test_function_with_null
FAILED: dtest-upgrade.upgrade_tests.cql_tests.TestCQLNodes2RF1_Upgrade_indev_2_1_x_To_indev_3_11_x.test_no_clustering
FAILED: dtest-upgrade.upgrade_tests.cql_tests.TestCQLNodes2RF1_Upgrade_indev_2_1_x_To_indev_3_11_x.test_nan_infinity
FAILED: dtest-upgrade.upgrade_tests.paging_test.TestPagingDataNodes3RF3_Upgrade_indev_2_1_x_To_indev_3_11_x.test_basic_paging
FAILED: dtest-upgrade.upgrade_tests.paging_test.TestPagingDataNodes2RF1_Upgrade_indev_2_1_x_To_indev_3_11_x.test_basic_compound_paging
FAILED: dtest-upgrade.upgrade_tests.upgrade_through_versions_test.TestUpgrade_indev_2_1_x_To_indev_3_11_x.test_bootstrap_multidc
FAILED: dtest-upgrade.upgrade_tests.thrift_upgrade_test.TestUpgradeSuperColumnsThrough.test_dense_supercolumn
FAILED: dtest-upgrade.upgrade_tests.upgrade_through_versions_test.TestUpgrade_indev_2_1_x_To_indev_3_11_x.test_rolling_upgrade_with_internode_ssl
FAILED: dtest-large-novnode.replace_address_test.TestReplaceAddress.test_replace_first_boot
FAILED: dtest-large-novnode.replace_address_test.TestReplaceAddress.test_replace_shutdown_node
FAILED: dtest-large-novnode.replace_address_test.TestReplaceAddress.test_replace_stopped_node
FAILED: dtest-novnode.jmx_test.TestJMX.test_compactionstats
FAILED: dtest-offheap.jmx_test.TestJMX.test_compactionstats
FAILED: dtest.jmx_test.TestJMX.test_compactionstats
FAILED: org.apache.cassandra.distributed.upgrade.DropCompactStorageWithClusteringAndValueColumnTest.testDropCompactWithClusteringAndValueColumn
FAILED: org.apache.cassandra.distributed.upgrade.MixedModeReadTest.mixedModeReadColumnSubsetDigestCheck
FAILED: dtest.repair_tests.repair_test.TestRepair.test_dead_sync_initiator
FAILED: org.apache.cassandra.distributed.test.ReprepareOldBehaviourTest.testReprepareMixedVersionWithoutReset
FAILED: dtest-offheap.repair_tests.repair_test.TestRepair.test_dead_sync_initiator
FAILED: dtest-novnode.repair_tests.repair_test.TestRepair.test_dead_sync_initiator
FAILED: dtest-upgrade.upgrade_internal_auth_test.TestAuthUpgrade.test_upgrade_legacy_table
-------------------------------------------------------------------------------
For complete test report and logs see https://nightlies.apache.org/cassandra/Cassandra-3.11/484/