You are viewing a plain text version of this content. The canonical link for it is here.
Posted to builds@beam.apache.org by Apache Jenkins Server <je...@builds.apache.org> on 2023/02/23 04:35:39 UTC

Build failed in Jenkins: beam_PreCommit_Portable_Python_Cron #6117

See <https://ci-beam.apache.org/job/beam_PreCommit_Portable_Python_Cron/6117/display/redirect>

Changes:


------------------------------------------
[...truncated 1.36 MB...]
INFO:apache_beam.utils.subprocess_server:      }
INFO:apache_beam.utils.subprocess_server:    }, {
INFO:apache_beam.utils.subprocess_server:      "urn": "beam:metric:pardo_execution_time:process_bundle_msecs:v1",
INFO:apache_beam.utils.subprocess_server:      "type": "beam:metrics:sum_int64:v1",
INFO:apache_beam.utils.subprocess_server:      "payload": "AA==",
INFO:apache_beam.utils.subprocess_server:      "labels": {
INFO:apache_beam.utils.subprocess_server:        "PTRANSFORM": "fn/read/ref_PCollection_PCollection_2/SplitAndSize0:0"
INFO:apache_beam.utils.subprocess_server:      }
INFO:apache_beam.utils.subprocess_server:    }, {
INFO:apache_beam.utils.subprocess_server:      "urn": "beam:metric:pardo_execution_time:start_bundle_msecs:v1",
INFO:apache_beam.utils.subprocess_server:      "type": "beam:metrics:sum_int64:v1",
INFO:apache_beam.utils.subprocess_server:      "payload": "AA==",
INFO:apache_beam.utils.subprocess_server:      "labels": {
INFO:apache_beam.utils.subprocess_server:        "PTRANSFORM": "ref_AppliedPTransform_PairWithOne_9"
INFO:apache_beam.utils.subprocess_server:      }
INFO:apache_beam.utils.subprocess_server:    }, {
INFO:apache_beam.utils.subprocess_server:      "urn": "beam:metric:ptransform_execution_time:total_msecs:v1",
INFO:apache_beam.utils.subprocess_server:      "type": "beam:metrics:sum_int64:v1",
INFO:apache_beam.utils.subprocess_server:      "payload": "AA==",
INFO:apache_beam.utils.subprocess_server:      "labels": {
INFO:apache_beam.utils.subprocess_server:        "PTRANSFORM": "ref_AppliedPTransform_Read-Read-SDFBoundedSourceReader-ParDo-SDFBoundedSourceDoFn-_7/ProcessSizedElementsAndRestrictions0"
INFO:apache_beam.utils.subprocess_server:      }
INFO:apache_beam.utils.subprocess_server:    }, {
INFO:apache_beam.utils.subprocess_server:      "urn": "beam:metric:pardo_execution_time:finish_bundle_msecs:v1",
INFO:apache_beam.utils.subprocess_server:      "type": "beam:metrics:sum_int64:v1",
INFO:apache_beam.utils.subprocess_server:      "payload": "AA==",
INFO:apache_beam.utils.subprocess_server:      "labels": {
INFO:apache_beam.utils.subprocess_server:        "PTRANSFORM": "ref_AppliedPTransform_PairWithOne_9"
INFO:apache_beam.utils.subprocess_server:      }
INFO:apache_beam.utils.subprocess_server:    }, {
INFO:apache_beam.utils.subprocess_server:      "urn": "beam:metric:pardo_execution_time:start_bundle_msecs:v1",
INFO:apache_beam.utils.subprocess_server:      "type": "beam:metrics:sum_int64:v1",
INFO:apache_beam.utils.subprocess_server:      "payload": "AA==",
INFO:apache_beam.utils.subprocess_server:      "labels": {
INFO:apache_beam.utils.subprocess_server:        "PTRANSFORM": "fn/write/ref_PCollection_PCollection_5:0"
INFO:apache_beam.utils.subprocess_server:      }
INFO:apache_beam.utils.subprocess_server:    }, {
INFO:apache_beam.utils.subprocess_server:      "urn": "beam:metric:ptransform_execution_time:total_msecs:v1",
INFO:apache_beam.utils.subprocess_server:      "type": "beam:metrics:sum_int64:v1",
INFO:apache_beam.utils.subprocess_server:      "payload": "AA==",
INFO:apache_beam.utils.subprocess_server:      "labels": {
INFO:apache_beam.utils.subprocess_server:        "PTRANSFORM": "ref_AppliedPTransform_Split_8"
INFO:apache_beam.utils.subprocess_server:      }
INFO:apache_beam.utils.subprocess_server:    }, {
INFO:apache_beam.utils.subprocess_server:      "urn": "beam:metric:element_count:v1",
INFO:apache_beam.utils.subprocess_server:      "type": "beam:metrics:sum_int64:v1",
INFO:apache_beam.utils.subprocess_server:      "payload": "YA==",
INFO:apache_beam.utils.subprocess_server:      "labels": {
INFO:apache_beam.utils.subprocess_server:        "PCOLLECTION": "ref_PCollection_PCollection_5"
INFO:apache_beam.utils.subprocess_server:      }
INFO:apache_beam.utils.subprocess_server:    }, {
INFO:apache_beam.utils.subprocess_server:      "urn": "beam:metric:pardo_execution_time:process_bundle_msecs:v1",
INFO:apache_beam.utils.subprocess_server:      "type": "beam:metrics:sum_int64:v1",
INFO:apache_beam.utils.subprocess_server:      "payload": "AA==",
INFO:apache_beam.utils.subprocess_server:      "labels": {
INFO:apache_beam.utils.subprocess_server:        "PTRANSFORM": "ref_AppliedPTransform_Read-Read-SDFBoundedSourceReader-ParDo-SDFBoundedSourceDoFn-_7/ProcessSizedElementsAndRestrictions0"
INFO:apache_beam.utils.subprocess_server:      }
INFO:apache_beam.utils.subprocess_server:    }, {
INFO:apache_beam.utils.subprocess_server:      "urn": "beam:metric:element_count:v1",
INFO:apache_beam.utils.subprocess_server:      "type": "beam:metrics:sum_int64:v1",
INFO:apache_beam.utils.subprocess_server:      "payload": "YA==",
INFO:apache_beam.utils.subprocess_server:      "labels": {
INFO:apache_beam.utils.subprocess_server:        "PCOLLECTION": "ref_PCollection_PCollection_4"
INFO:apache_beam.utils.subprocess_server:      }
INFO:apache_beam.utils.subprocess_server:    }, {
INFO:apache_beam.utils.subprocess_server:      "urn": "beam:metric:element_count:v1",
INFO:apache_beam.utils.subprocess_server:      "type": "beam:metrics:sum_int64:v1",
INFO:apache_beam.utils.subprocess_server:      "payload": "Gw==",
INFO:apache_beam.utils.subprocess_server:      "labels": {
INFO:apache_beam.utils.subprocess_server:        "PCOLLECTION": "ref_PCollection_PCollection_3"
INFO:apache_beam.utils.subprocess_server:      }
INFO:apache_beam.utils.subprocess_server:    }, {
INFO:apache_beam.utils.subprocess_server:      "urn": "beam:metric:ptransform_execution_time:total_msecs:v1",
INFO:apache_beam.utils.subprocess_server:      "type": "beam:metrics:sum_int64:v1",
INFO:apache_beam.utils.subprocess_server:      "payload": "AA==",
INFO:apache_beam.utils.subprocess_server:      "labels": {
INFO:apache_beam.utils.subprocess_server:        "PTRANSFORM": "fn/write/ref_PCollection_PCollection_5:0"
INFO:apache_beam.utils.subprocess_server:      }
INFO:apache_beam.utils.subprocess_server:    }, {
INFO:apache_beam.utils.subprocess_server:      "urn": "beam:metric:sampled_byte_size:v1",
INFO:apache_beam.utils.subprocess_server:      "type": "beam:metrics:distribution_int64:v1",
INFO:apache_beam.utils.subprocess_server:      "payload": "FYcGDVM=",
INFO:apache_beam.utils.subprocess_server:      "labels": {
INFO:apache_beam.utils.subprocess_server:        "PCOLLECTION": "ref_PCollection_PCollection_3"
INFO:apache_beam.utils.subprocess_server:      }
INFO:apache_beam.utils.subprocess_server:    }, {
INFO:apache_beam.utils.subprocess_server:      "urn": "beam:metric:sampled_byte_size:v1",
INFO:apache_beam.utils.subprocess_server:      "type": "beam:metrics:distribution_int64:v1",
INFO:apache_beam.utils.subprocess_server:      "payload": "AZMKkwqTCg==",
INFO:apache_beam.utils.subprocess_server:      "labels": {
INFO:apache_beam.utils.subprocess_server:        "PCOLLECTION": "ref_PCollection_PCollection_2/SplitAndSize0"
INFO:apache_beam.utils.subprocess_server:      }
INFO:apache_beam.utils.subprocess_server:    }, {
INFO:apache_beam.utils.subprocess_server:      "urn": "beam:metric:sampled_byte_size:v1",
INFO:apache_beam.utils.subprocess_server:      "type": "beam:metrics:distribution_int64:v1",
INFO:apache_beam.utils.subprocess_server:      "payload": "Iv4EEBk=",
INFO:apache_beam.utils.subprocess_server:      "labels": {
INFO:apache_beam.utils.subprocess_server:        "PCOLLECTION": "ref_PCollection_PCollection_5"
INFO:apache_beam.utils.subprocess_server:      }
INFO:apache_beam.utils.subprocess_server:    }, {
INFO:apache_beam.utils.subprocess_server:      "urn": "beam:metric:sampled_byte_size:v1",
INFO:apache_beam.utils.subprocess_server:      "type": "beam:metrics:distribution_int64:v1",
INFO:apache_beam.utils.subprocess_server:      "payload": "IaQEDhQ=",
INFO:apache_beam.utils.subprocess_server:      "labels": {
INFO:apache_beam.utils.subprocess_server:        "PCOLLECTION": "ref_PCollection_PCollection_4"
INFO:apache_beam.utils.subprocess_server:      }
INFO:apache_beam.utils.subprocess_server:    }]
INFO:apache_beam.utils.subprocess_server:  }
INFO:apache_beam.utils.subprocess_server:}
INFO:apache_beam.utils.subprocess_server:Feb 23, 2023 4:34:02 AM org.apache.flink.runtime.taskexecutor.slot.TaskSlotTableImpl freeSlotInternal
INFO:apache_beam.utils.subprocess_server:INFO: Free slot TaskSlot(index:0, state:ALLOCATED, resource profile: ResourceProfile{taskHeapMemory=512.000gb (549755813888 bytes), taskOffHeapMemory=512.000gb (549755813888 bytes), managedMemory=64.000mb (67108864 bytes), networkMemory=32.000mb (33554432 bytes)}, allocationId: bc632e523238a6ff348041eb4b57bde0, jobId: fe2f848115cf32b415e7d63ee074190f).
INFO:apache_beam.utils.subprocess_server:Feb 23, 2023 4:34:03 AM org.apache.flink.runtime.taskexecutor.TaskExecutor$JobLeaderListenerImpl jobManagerLostLeadership
INFO:apache_beam.utils.subprocess_server:INFO: JobManager for job fe2f848115cf32b415e7d63ee074190f with leader id b52c753f1e5dcf3946f54baa145f4518 lost leadership.
INFO:apache_beam.utils.subprocess_server:Feb 23, 2023 4:34:03 AM org.apache.flink.runtime.taskexecutor.DefaultJobLeaderService stop
INFO:apache_beam.utils.subprocess_server:INFO: Stop job leader service.
INFO:apache_beam.utils.subprocess_server:Feb 23, 2023 4:34:03 AM org.apache.flink.runtime.state.TaskExecutorLocalStateStoresManager shutdown
INFO:apache_beam.utils.subprocess_server:INFO: Shutting down TaskExecutorLocalStateStoresManager.
INFO:apache_beam.utils.subprocess_server:Feb 23, 2023 4:34:03 AM org.apache.flink.runtime.io.disk.FileChannelManagerImpl lambda$getFileCloser$0
INFO:apache_beam.utils.subprocess_server:INFO: FileChannelManager removed spill file directory /tmp/flink-io-9d158857-4d5d-483e-847b-e616a691b884
INFO:apache_beam.utils.subprocess_server:Feb 23, 2023 4:34:03 AM org.apache.flink.runtime.io.network.NettyShuffleEnvironment close
INFO:apache_beam.utils.subprocess_server:INFO: Shutting down the network environment and its components.
INFO:apache_beam.utils.subprocess_server:Feb 23, 2023 4:34:03 AM org.apache.flink.runtime.io.disk.FileChannelManagerImpl lambda$getFileCloser$0
INFO:apache_beam.utils.subprocess_server:INFO: FileChannelManager removed spill file directory /tmp/flink-netty-shuffle-8974c733-e74f-4a7d-b466-8758b203b6f1
INFO:apache_beam.utils.subprocess_server:Feb 23, 2023 4:34:03 AM org.apache.flink.runtime.taskexecutor.KvStateService shutdown
INFO:apache_beam.utils.subprocess_server:INFO: Shutting down the kvState service and its components.
INFO:apache_beam.utils.subprocess_server:Feb 23, 2023 4:34:03 AM org.apache.flink.runtime.taskexecutor.DefaultJobLeaderService stop
INFO:apache_beam.utils.subprocess_server:INFO: Stop job leader service.
INFO:apache_beam.utils.subprocess_server:Feb 23, 2023 4:34:03 AM org.apache.flink.runtime.filecache.FileCache shutdown
INFO:apache_beam.utils.subprocess_server:INFO: removed file cache directory /tmp/flink-dist-cache-d1471515-afbf-4ca8-a982-75f8d39952ab
INFO:apache_beam.utils.subprocess_server:Feb 23, 2023 4:34:03 AM org.apache.flink.runtime.taskexecutor.TaskExecutor handleOnStopException
INFO:apache_beam.utils.subprocess_server:INFO: Stopped TaskExecutor akka://flink/user/rpc/taskmanager_0.
INFO:apache_beam.runners.portability.portable_runner:Job state changed to DONE
INFO:apache_beam.utils.subprocess_server:Feb 23, 2023 4:34:03 AM org.apache.flink.runtime.webmonitor.WebMonitorEndpoint lambda$shutDownInternal$5
INFO:apache_beam.utils.subprocess_server:INFO: Removing cache directory /tmp/flink-web-ui
INFO:apache_beam.utils.subprocess_server:Feb 23, 2023 4:34:03 AM org.apache.flink.runtime.rest.RestServerEndpoint lambda$closeAsync$1
INFO:apache_beam.utils.subprocess_server:INFO: Shut down complete.
INFO:apache_beam.utils.subprocess_server:Feb 23, 2023 4:34:03 AM org.apache.flink.runtime.resourcemanager.ResourceManager deregisterApplication
INFO:apache_beam.utils.subprocess_server:INFO: Shut down cluster because application is in CANCELED, diagnostics DispatcherResourceManagerComponent has been closed..
INFO:apache_beam.utils.subprocess_server:Feb 23, 2023 4:34:03 AM org.apache.flink.runtime.entrypoint.component.DispatcherResourceManagerComponent closeAsyncInternal
INFO:apache_beam.utils.subprocess_server:INFO: Closing components.
INFO:apache_beam.utils.subprocess_server:Feb 23, 2023 4:34:03 AM org.apache.flink.runtime.dispatcher.runner.AbstractDispatcherLeaderProcess closeInternal
INFO:apache_beam.utils.subprocess_server:INFO: Stopping SessionDispatcherLeaderProcess.
INFO:apache_beam.utils.subprocess_server:Feb 23, 2023 4:34:03 AM org.apache.flink.runtime.resourcemanager.ResourceManagerServiceImpl closeAsync
INFO:apache_beam.utils.subprocess_server:INFO: Stopping resource manager service.
INFO:apache_beam.utils.subprocess_server:Feb 23, 2023 4:34:03 AM org.apache.flink.runtime.dispatcher.Dispatcher onStop
INFO:apache_beam.utils.subprocess_server:INFO: Stopping dispatcher akka://flink/user/rpc/dispatcher_2.
INFO:apache_beam.utils.subprocess_server:Feb 23, 2023 4:34:03 AM org.apache.flink.runtime.dispatcher.Dispatcher terminateRunningJobs
INFO:apache_beam.utils.subprocess_server:INFO: Stopping all currently running jobs of dispatcher akka://flink/user/rpc/dispatcher_2.
INFO:apache_beam.utils.subprocess_server:Feb 23, 2023 4:34:03 AM org.apache.flink.runtime.resourcemanager.slotmanager.DeclarativeSlotManager close
INFO:apache_beam.utils.subprocess_server:INFO: Closing the slot manager.
INFO:apache_beam.utils.subprocess_server:Feb 23, 2023 4:34:03 AM org.apache.flink.runtime.resourcemanager.slotmanager.DeclarativeSlotManager suspend
INFO:apache_beam.utils.subprocess_server:INFO: Suspending the slot manager.
INFO:apache_beam.utils.subprocess_server:Feb 23, 2023 4:34:03 AM org.apache.flink.runtime.dispatcher.Dispatcher lambda$onStop$1
INFO:apache_beam.utils.subprocess_server:INFO: Stopped dispatcher akka://flink/user/rpc/dispatcher_2.
INFO:apache_beam.utils.subprocess_server:Feb 23, 2023 4:34:03 AM org.apache.flink.runtime.rpc.akka.AkkaRpcService stopService
INFO:apache_beam.utils.subprocess_server:INFO: Stopping Akka RPC service.
INFO:apache_beam.utils.subprocess_server:Feb 23, 2023 4:34:03 AM org.apache.flink.runtime.blob.AbstractBlobCache close
INFO:apache_beam.utils.subprocess_server:INFO: Shutting down BLOB cache
INFO:apache_beam.utils.subprocess_server:Feb 23, 2023 4:34:03 AM org.apache.flink.runtime.blob.AbstractBlobCache close
INFO:apache_beam.utils.subprocess_server:INFO: Shutting down BLOB cache
INFO:apache_beam.utils.subprocess_server:Feb 23, 2023 4:34:03 AM org.apache.flink.runtime.blob.BlobServer close
INFO:apache_beam.utils.subprocess_server:INFO: Stopped BLOB server at 0.0.0.0:36249

> Task :sdks:python:test-suites:portable:py37:preCommitPy37

Deprecated Gradle features were used in this build, making it incompatible with Gradle 8.0.

You can use '--warning-mode all' to show the individual deprecation warnings and determine if they come from your own scripts or plugins.

See https://docs.gradle.org/7.5.1/userguide/command_line_interface.html#sec:command_line_warnings

BUILD SUCCESSFUL in 12m 12s
148 actionable tasks: 95 executed, 41 from cache, 12 up-to-date

Publishing build scan...
https://gradle.com/s/ap3ggnwmxs2dg

[Gradle] - Launching build.
[src] $ <https://ci-beam.apache.org/job/beam_PreCommit_Portable_Python_Cron/ws/src/gradlew> --continue --max-workers=8 -Dorg.gradle.jvmargs=-Xms2g -Dorg.gradle.jvmargs=-Xmx6g -Dorg.gradle.vfs.watch=false -Pdocker-pull-licenses :sdks:python:test-suites:portable:py310:preCommitPy310
To honour the JVM settings for this build a single-use Daemon process will be forked. See https://docs.gradle.org/7.5.1/userguide/gradle_daemon.html#sec:disabling_the_daemon.

FAILURE: Build failed with an exception.

* What went wrong:
Unable to start the daemon process.
This problem might be caused by incorrect configuration of the daemon.
For example, an unrecognized jvm option is used.
Please refer to the User Manual chapter on the daemon at https://docs.gradle.org/7.5.1/userguide/gradle_daemon.html
Process command line: /usr/lib/jvm/java-8-openjdk-amd64/bin/java -Xmx6g -Dfile.encoding=UTF-8 -Duser.country=US -Duser.language=en -Duser.variant -cp /home/jenkins/.gradle/wrapper/dists/gradle-7.5.1-bin/7jzzequgds1hbszbhq3npc5ng/gradle-7.5.1/lib/gradle-launcher-7.5.1.jar org.gradle.launcher.daemon.bootstrap.GradleDaemon 7.5.1
Please read the following process output to find out more:
-----------------------

FAILURE: Build failed with an exception.

* What went wrong:
Timeout waiting to lock daemon addresses registry. It is currently in use by another Gradle instance.
Owner PID: unknown
Our PID: 2284219
Owner Operation: unknown
Our operation: 
Lock file: /home/jenkins/.gradle/daemon/7.5.1/registry.bin.lock

* Try:
> Run with --info or --debug option to get more log output.
> Run with --scan to get full insights.

* Exception is:
org.gradle.cache.LockTimeoutException: Timeout waiting to lock daemon addresses registry. It is currently in use by another Gradle instance.
Owner PID: unknown
Our PID: 2284219
Owner Operation: unknown
Our operation: 
Lock file: /home/jenkins/.gradle/daemon/7.5.1/registry.bin.lock
	at org.gradle.cache.internal.DefaultFileLockManager$DefaultFileLock.timeoutException(DefaultFileLockManager.java:344)
	at org.gradle.cache.internal.DefaultFileLockManager$DefaultFileLock.lock(DefaultFileLockManager.java:305)
	at org.gradle.cache.internal.DefaultFileLockManager$DefaultFileLock.<init>(DefaultFileLockManager.java:164)
	at org.gradle.cache.internal.DefaultFileLockManager.lock(DefaultFileLockManager.java:110)
	at org.gradle.cache.internal.DefaultFileLockManager.lock(DefaultFileLockManager.java:96)
	at org.gradle.cache.internal.DefaultFileLockManager.lock(DefaultFileLockManager.java:91)
	at org.gradle.cache.internal.OnDemandFileAccess.updateFile(OnDemandFileAccess.java:51)
	at org.gradle.cache.internal.SimpleStateCache.update(SimpleStateCache.java:87)
	at org.gradle.cache.internal.FileIntegrityViolationSuppressingPersistentStateCacheDecorator$1.create(FileIntegrityViolationSuppressingPersistentStateCacheDecorator.java:50)
	at org.gradle.cache.internal.FileIntegrityViolationSuppressingPersistentStateCacheDecorator.doUpdate(FileIntegrityViolationSuppressingPersistentStateCacheDecorator.java:67)
	at org.gradle.cache.internal.FileIntegrityViolationSuppressingPersistentStateCacheDecorator.update(FileIntegrityViolationSuppressingPersistentStateCacheDecorator.java:47)
	at org.gradle.launcher.daemon.registry.PersistentDaemonRegistry.store(PersistentDaemonRegistry.java:232)
	at org.gradle.launcher.daemon.server.DaemonRegistryUpdater.onStart(DaemonRegistryUpdater.java:80)
	at org.gradle.launcher.daemon.server.Daemon.start(Daemon.java:171)
	at org.gradle.launcher.daemon.bootstrap.DaemonMain.doAction(DaemonMain.java:125)
	at org.gradle.launcher.bootstrap.EntryPoint.run(EntryPoint.java:50)
	at sun.reflect.NativeMethodAccessorImpl.invoke0(Native Method)
	at sun.reflect.NativeMethodAccessorImpl.invoke(NativeMethodAccessorImpl.java:62)
	at sun.reflect.DelegatingMethodAccessorImpl.invoke(DelegatingMethodAccessorImpl.java:43)
	at java.lang.reflect.Method.invoke(Method.java:498)
	at org.gradle.launcher.bootstrap.ProcessBootstrap.runNoExit(ProcessBootstrap.java:60)
	at org.gradle.launcher.bootstrap.ProcessBootstrap.run(ProcessBootstrap.java:37)
	at org.gradle.launcher.daemon.bootstrap.GradleDaemon.main(GradleDaemon.java:22)


* Get more help at https://help.gradle.org


* Try:
> Run with --stacktrace option to get the stack trace.
> Run with --info or --debug option to get more log output.
> Run with --scan to get full insights.

* Get more help at https://help.gradle.org
Build step 'Invoke Gradle script' changed build result to FAILURE
Build step 'Invoke Gradle script' marked build as failure

---------------------------------------------------------------------
To unsubscribe, e-mail: builds-unsubscribe@beam.apache.org
For additional commands, e-mail: builds-help@beam.apache.org


Jenkins build is back to normal : beam_PreCommit_Portable_Python_Cron #6119

Posted by Apache Jenkins Server <je...@builds.apache.org>.
See <https://ci-beam.apache.org/job/beam_PreCommit_Portable_Python_Cron/6119/display/redirect?page=changes>


---------------------------------------------------------------------
To unsubscribe, e-mail: builds-unsubscribe@beam.apache.org
For additional commands, e-mail: builds-help@beam.apache.org


Build failed in Jenkins: beam_PreCommit_Portable_Python_Cron #6118

Posted by Apache Jenkins Server <je...@builds.apache.org>.
See <https://ci-beam.apache.org/job/beam_PreCommit_Portable_Python_Cron/6118/display/redirect>

Changes:


------------------------------------------
Started by timer
Running as SYSTEM
[EnvInject] - Loading node environment variables.
Building remotely on apache-beam-jenkins-15 (beam) in workspace <https://ci-beam.apache.org/job/beam_PreCommit_Portable_Python_Cron/ws/>
The recommended git tool is: NONE
No credentials specified
Wiping out workspace first.
Cloning the remote Git repository
Using shallow clone with depth 1
Avoid fetching tags
Cloning repository https://github.com/apache/beam.git
 > git init <https://ci-beam.apache.org/job/beam_PreCommit_Portable_Python_Cron/ws/src> # timeout=10
Fetching upstream changes from https://github.com/apache/beam.git
 > git --version # timeout=10
 > git --version # 'git version 2.25.1'
 > git fetch --no-tags --force --progress --depth=1 -- https://github.com/apache/beam.git +refs/heads/*:refs/remotes/origin/* # timeout=10
 > git config remote.origin.url https://github.com/apache/beam.git # timeout=10
 > git config --add remote.origin.fetch +refs/heads/*:refs/remotes/origin/* # timeout=10
 > git config remote.origin.url https://github.com/apache/beam.git # timeout=10
Using shallow fetch with depth 1
Fetching upstream changes from https://github.com/apache/beam.git
 > git fetch --no-tags --force --progress --depth=1 -- https://github.com/apache/beam.git +refs/heads/*:refs/remotes/origin/* +refs/pull/${ghprbPullId}/*:refs/remotes/origin/pr/${ghprbPullId}/* # timeout=10
 > git rev-parse origin/master^{commit} # timeout=10
Checking out Revision 011296c14659f80c8ecbeefda79ecc3f1113bd95 (origin/master)
 > git config core.sparsecheckout # timeout=10
 > git checkout -f 011296c14659f80c8ecbeefda79ecc3f1113bd95 # timeout=10
Commit message: "Apply shallow clone for jenkins (#25595)"
 > git rev-list --no-walk 011296c14659f80c8ecbeefda79ecc3f1113bd95 # timeout=10
No emails were triggered.
[EnvInject] - Executing scripts and injecting environment variables after the SCM step.
[EnvInject] - Injecting as environment variables the properties content 
SETUPTOOLS_USE_DISTUTILS=stdlib
SPARK_LOCAL_IP=127.0.0.1

[EnvInject] - Variables injected successfully.
[Gradle] - Launching build.
[src] $ <https://ci-beam.apache.org/job/beam_PreCommit_Portable_Python_Cron/ws/src/gradlew> --continue --max-workers=8 -Dorg.gradle.jvmargs=-Xms2g -Dorg.gradle.jvmargs=-Xmx6g -Dorg.gradle.vfs.watch=false -Pdocker-pull-licenses :clean
To honour the JVM settings for this build a single-use Daemon process will be forked. See https://docs.gradle.org/7.5.1/userguide/gradle_daemon.html#sec:disabling_the_daemon.

FAILURE: Build failed with an exception.

* What went wrong:
Unable to start the daemon process.
This problem might be caused by incorrect configuration of the daemon.
For example, an unrecognized jvm option is used.
Please refer to the User Manual chapter on the daemon at https://docs.gradle.org/7.5.1/userguide/gradle_daemon.html
Process command line: /usr/lib/jvm/java-8-openjdk-amd64/bin/java -Xmx6g -Dfile.encoding=UTF-8 -Duser.country=US -Duser.language=en -Duser.variant -cp /home/jenkins/.gradle/wrapper/dists/gradle-7.5.1-bin/7jzzequgds1hbszbhq3npc5ng/gradle-7.5.1/lib/gradle-launcher-7.5.1.jar org.gradle.launcher.daemon.bootstrap.GradleDaemon 7.5.1
Please read the following process output to find out more:
-----------------------

FAILURE: Build failed with an exception.

* What went wrong:
Timeout waiting to lock daemon addresses registry. It is currently in use by another Gradle instance.
Owner PID: unknown
Our PID: 2452056
Owner Operation: unknown
Our operation: 
Lock file: /home/jenkins/.gradle/daemon/7.5.1/registry.bin.lock

* Try:
> Run with --info or --debug option to get more log output.
> Run with --scan to get full insights.

* Exception is:
org.gradle.cache.LockTimeoutException: Timeout waiting to lock daemon addresses registry. It is currently in use by another Gradle instance.
Owner PID: unknown
Our PID: 2452056
Owner Operation: unknown
Our operation: 
Lock file: /home/jenkins/.gradle/daemon/7.5.1/registry.bin.lock
	at org.gradle.cache.internal.DefaultFileLockManager$DefaultFileLock.timeoutException(DefaultFileLockManager.java:344)
	at org.gradle.cache.internal.DefaultFileLockManager$DefaultFileLock.lock(DefaultFileLockManager.java:305)
	at org.gradle.cache.internal.DefaultFileLockManager$DefaultFileLock.<init>(DefaultFileLockManager.java:164)
	at org.gradle.cache.internal.DefaultFileLockManager.lock(DefaultFileLockManager.java:110)
	at org.gradle.cache.internal.DefaultFileLockManager.lock(DefaultFileLockManager.java:96)
	at org.gradle.cache.internal.DefaultFileLockManager.lock(DefaultFileLockManager.java:91)
	at org.gradle.cache.internal.OnDemandFileAccess.updateFile(OnDemandFileAccess.java:51)
	at org.gradle.cache.internal.SimpleStateCache.update(SimpleStateCache.java:87)
	at org.gradle.cache.internal.FileIntegrityViolationSuppressingPersistentStateCacheDecorator$1.create(FileIntegrityViolationSuppressingPersistentStateCacheDecorator.java:50)
	at org.gradle.cache.internal.FileIntegrityViolationSuppressingPersistentStateCacheDecorator.doUpdate(FileIntegrityViolationSuppressingPersistentStateCacheDecorator.java:67)
	at org.gradle.cache.internal.FileIntegrityViolationSuppressingPersistentStateCacheDecorator.update(FileIntegrityViolationSuppressingPersistentStateCacheDecorator.java:47)
	at org.gradle.launcher.daemon.registry.PersistentDaemonRegistry.store(PersistentDaemonRegistry.java:232)
	at org.gradle.launcher.daemon.server.DaemonRegistryUpdater.onStart(DaemonRegistryUpdater.java:80)
	at org.gradle.launcher.daemon.server.Daemon.start(Daemon.java:171)
	at org.gradle.launcher.daemon.bootstrap.DaemonMain.doAction(DaemonMain.java:125)
	at org.gradle.launcher.bootstrap.EntryPoint.run(EntryPoint.java:50)
	at sun.reflect.NativeMethodAccessorImpl.invoke0(Native Method)
	at sun.reflect.NativeMethodAccessorImpl.invoke(NativeMethodAccessorImpl.java:62)
	at sun.reflect.DelegatingMethodAccessorImpl.invoke(DelegatingMethodAccessorImpl.java:43)
	at java.lang.reflect.Method.invoke(Method.java:498)
	at org.gradle.launcher.bootstrap.ProcessBootstrap.runNoExit(ProcessBootstrap.java:60)
	at org.gradle.launcher.bootstrap.ProcessBootstrap.run(ProcessBootstrap.java:37)
	at org.gradle.launcher.daemon.bootstrap.GradleDaemon.main(GradleDaemon.java:22)


* Get more help at https://help.gradle.org


* Try:
> Run with --stacktrace option to get the stack trace.
> Run with --info or --debug option to get more log output.
> Run with --scan to get full insights.

* Get more help at https://help.gradle.org
Build step 'Invoke Gradle script' changed build result to FAILURE
Build step 'Invoke Gradle script' marked build as failure

---------------------------------------------------------------------
To unsubscribe, e-mail: builds-unsubscribe@beam.apache.org
For additional commands, e-mail: builds-help@beam.apache.org