You are viewing a plain text version of this content. The canonical link for it is here.
Posted to builds@beam.apache.org by Apache Jenkins Server <je...@builds.apache.org> on 2019/07/22 11:45:17 UTC

Build failed in Jenkins: beam_PerformanceTests_MongoDBIO_IT #1920

See <https://builds.apache.org/job/beam_PerformanceTests_MongoDBIO_IT/1920/display/redirect>

------------------------------------------
GitHub pull request #9116 of commit b4663719d34dee7433c18ae568dec9f9ca104551, no merge conflicts.
Setting status of b4663719d34dee7433c18ae568dec9f9ca104551 to PENDING with url https://builds.apache.org/job/beam_PerformanceTests_MongoDBIO_IT/1920/ and message: 'Build started for merge commit.'
Using context: Java MongoDBIO Performance Test
[EnvInject] - Loading node environment variables.
Building remotely on apache-beam-jenkins-7 (beam) in workspace <https://builds.apache.org/job/beam_PerformanceTests_MongoDBIO_IT/ws/>
No credentials specified
 > git rev-parse --is-inside-work-tree # timeout=10
Fetching changes from the remote Git repository
 > git config remote.origin.url https://github.com/apache/beam.git # timeout=10
Fetching upstream changes from https://github.com/apache/beam.git
 > git --version # timeout=10
 > git fetch --tags --progress https://github.com/apache/beam.git +refs/heads/*:refs/remotes/origin/* +refs/pull/9116/*:refs/remotes/origin/pr/9116/*
 > git rev-parse refs/remotes/origin/pr/9116/merge^{commit} # timeout=10
 > git rev-parse refs/remotes/origin/origin/pr/9116/merge^{commit} # timeout=10
Checking out Revision db7a4b0bded3abc7a75a748062ea7a0e81cf0212 (refs/remotes/origin/pr/9116/merge)
 > git config core.sparsecheckout # timeout=10
 > git checkout -f db7a4b0bded3abc7a75a748062ea7a0e81cf0212
Commit message: "Merge b4663719d34dee7433c18ae568dec9f9ca104551 into f6367cc1a4565060e5f1bf652ad5725ac5b43aa6"
First time build. Skipping changelog.
Cleaning workspace
 > git rev-parse --verify HEAD # timeout=10
Resetting working tree
 > git reset --hard # timeout=10
 > git clean -fdx # timeout=10
[EnvInject] - Executing scripts and injecting environment variables after the SCM step.
[EnvInject] - Injecting as environment variables the properties content 
SPARK_LOCAL_IP=127.0.0.1

[EnvInject] - Variables injected successfully.
[beam_PerformanceTests_MongoDBIO_IT] $ /bin/bash -xe /tmp/jenkins6793820686066855537.sh
+ cp /home/jenkins/.kube/config <https://builds.apache.org/job/beam_PerformanceTests_MongoDBIO_IT/ws/config-beam-performancetests-mongodbio-it-1920>
[EnvInject] - Injecting environment variables from a build step.
[EnvInject] - Injecting as environment variables the properties content 
KUBERNETES_NAMESPACE=beam-performancetests-mongodbio-it-1920
KUBECONFIG="<https://builds.apache.org/job/beam_PerformanceTests_MongoDBIO_IT/ws/config-beam-performancetests-mongodbio-it-1920">

[EnvInject] - Variables injected successfully.
[beam_PerformanceTests_MongoDBIO_IT] $ /bin/bash -xe /tmp/jenkins6407884401871720812.sh
+ <https://builds.apache.org/job/beam_PerformanceTests_MongoDBIO_IT/ws/src/.test-infra/kubernetes/> create beam-performancetests-mongodbio-it-1920
/tmp/jenkins6407884401871720812.sh: line 2: <https://builds.apache.org/job/beam_PerformanceTests_MongoDBIO_IT/ws/src/.test-infra/kubernetes/>: Is a directory
Build step 'Execute shell' marked build as failure

---------------------------------------------------------------------
To unsubscribe, e-mail: builds-unsubscribe@beam.apache.org
For additional commands, e-mail: builds-help@beam.apache.org


Jenkins build is back to normal : beam_PerformanceTests_MongoDBIO_IT #1924

Posted by Apache Jenkins Server <je...@builds.apache.org>.
See <https://builds.apache.org/job/beam_PerformanceTests_MongoDBIO_IT/1924/display/redirect?page=changes>


---------------------------------------------------------------------
To unsubscribe, e-mail: builds-unsubscribe@beam.apache.org
For additional commands, e-mail: builds-help@beam.apache.org


Build failed in Jenkins: beam_PerformanceTests_MongoDBIO_IT #1923

Posted by Apache Jenkins Server <je...@builds.apache.org>.
See <https://builds.apache.org/job/beam_PerformanceTests_MongoDBIO_IT/1923/display/redirect?page=changes>

Changes:

[ehudm] [BEAM-7679] Add randomness to ITs' BQ dataset name

[valentyn] Default to PiplelineState.UNKNOWN when job state returned from v1beta3

[valentyn] fixup: Address review feedback.

[alireza4263] [BEAM-7783] Adding BeamTableStatistics.

------------------------------------------
[...truncated 353.28 KB...]
    INFO: 2019-07-22T19:29:55.210Z: Fusing consumer Calculate hashcode/Values/Values/Map into Calculate hashcode/Combine.perKey(Hashing)/Combine.GroupedValues/Extract
    Jul 22, 2019 7:29:56 PM org.apache.beam.runners.dataflow.util.MonitoringUtil$LoggingHandler process
    INFO: 2019-07-22T19:29:55.253Z: Fusing consumer Calculate hashcode/Combine.perKey(Hashing)/GroupByKey/Reify into Calculate hashcode/Combine.perKey(Hashing)/GroupByKey+Calculate hashcode/Combine.perKey(Hashing)/Combine.GroupedValues/Partial
    Jul 22, 2019 7:29:56 PM org.apache.beam.runners.dataflow.util.MonitoringUtil$LoggingHandler process
    INFO: 2019-07-22T19:29:55.302Z: Fusing consumer Map documents to Strings/Map into Collect read time metrics
    Jul 22, 2019 7:29:56 PM org.apache.beam.runners.dataflow.util.MonitoringUtil$LoggingHandler process
    INFO: 2019-07-22T19:29:55.344Z: Fusing consumer Calculate hashcode/Combine.perKey(Hashing)/Combine.GroupedValues/Extract into Calculate hashcode/Combine.perKey(Hashing)/Combine.GroupedValues
    Jul 22, 2019 7:29:56 PM org.apache.beam.runners.dataflow.util.MonitoringUtil$LoggingHandler process
    INFO: 2019-07-22T19:29:55.379Z: Fusing consumer Calculate hashcode/Combine.perKey(Hashing)/GroupByKey+Calculate hashcode/Combine.perKey(Hashing)/Combine.GroupedValues/Partial into Calculate hashcode/WithKeys/AddKeys/Map
    Jul 22, 2019 7:29:56 PM org.apache.beam.runners.dataflow.util.MonitoringUtil$LoggingHandler process
    INFO: 2019-07-22T19:29:55.420Z: Fusing consumer Calculate hashcode/ProduceDefault into Calculate hashcode/CreateVoid/Read(CreateSource)
    Jul 22, 2019 7:29:56 PM org.apache.beam.runners.dataflow.util.MonitoringUtil$LoggingHandler process
    INFO: 2019-07-22T19:29:55.469Z: Fusing consumer PAssert$0/GroupGlobally/GroupDummyAndContents/Reify into PAssert$0/GroupGlobally/WindowIntoDummy/Window.Assign
    Jul 22, 2019 7:29:56 PM org.apache.beam.runners.dataflow.util.MonitoringUtil$LoggingHandler process
    INFO: 2019-07-22T19:29:55.514Z: Fusing consumer PAssert$0/GroupGlobally/GroupDummyAndContents/Write into PAssert$0/GroupGlobally/GroupDummyAndContents/Reify
    Jul 22, 2019 7:29:56 PM org.apache.beam.runners.dataflow.util.MonitoringUtil$LoggingHandler process
    INFO: 2019-07-22T19:29:55.556Z: Fusing consumer PAssert$0/GroupGlobally/WindowIntoDummy/Window.Assign into PAssert$0/GroupGlobally/Create.Values/Read(CreateSource)
    Jul 22, 2019 7:29:56 PM org.apache.beam.runners.dataflow.util.MonitoringUtil$LoggingHandler process
    INFO: 2019-07-22T19:29:56.031Z: Executing operation PAssert$0/GroupGlobally/GatherAllOutputs/GroupByKey/Create
    Jul 22, 2019 7:29:56 PM org.apache.beam.runners.dataflow.util.MonitoringUtil$LoggingHandler process
    INFO: 2019-07-22T19:29:56.072Z: Executing operation PAssert$0/GroupGlobally/GroupDummyAndContents/Create
    Jul 22, 2019 7:29:56 PM org.apache.beam.runners.dataflow.util.MonitoringUtil$LoggingHandler process
    INFO: 2019-07-22T19:29:56.112Z: Starting 1 workers in us-central1-a...
    Jul 22, 2019 7:29:56 PM org.apache.beam.runners.dataflow.util.MonitoringUtil$LoggingHandler process
    INFO: 2019-07-22T19:29:56.112Z: Executing operation Calculate hashcode/Combine.perKey(Hashing)/GroupByKey/Create
    Jul 22, 2019 7:29:57 PM org.apache.beam.runners.dataflow.util.MonitoringUtil$LoggingHandler process
    INFO: 2019-07-22T19:29:56.171Z: Finished operation PAssert$0/GroupGlobally/GatherAllOutputs/GroupByKey/Create
    Jul 22, 2019 7:29:57 PM org.apache.beam.runners.dataflow.util.MonitoringUtil$LoggingHandler process
    INFO: 2019-07-22T19:29:56.216Z: Finished operation Calculate hashcode/Combine.perKey(Hashing)/GroupByKey/Create
    Jul 22, 2019 7:29:57 PM org.apache.beam.runners.dataflow.util.MonitoringUtil$LoggingHandler process
    INFO: 2019-07-22T19:29:56.216Z: Finished operation PAssert$0/GroupGlobally/GroupDummyAndContents/Create
    Jul 22, 2019 7:29:57 PM org.apache.beam.runners.dataflow.util.MonitoringUtil$LoggingHandler process
    INFO: 2019-07-22T19:29:56.414Z: Executing operation Read all documents/Read(BoundedMongoDbSource)+Collect read time metrics+Map documents to Strings/Map+Calculate hashcode/WithKeys/AddKeys/Map+Calculate hashcode/Combine.perKey(Hashing)/GroupByKey+Calculate hashcode/Combine.perKey(Hashing)/Combine.GroupedValues/Partial+Calculate hashcode/Combine.perKey(Hashing)/GroupByKey/Reify+Calculate hashcode/Combine.perKey(Hashing)/GroupByKey/Write
    Jul 22, 2019 7:29:57 PM org.apache.beam.runners.dataflow.util.MonitoringUtil$LoggingHandler process
    INFO: 2019-07-22T19:29:56.483Z: Executing operation PAssert$0/GroupGlobally/Create.Values/Read(CreateSource)+PAssert$0/GroupGlobally/WindowIntoDummy/Window.Assign+PAssert$0/GroupGlobally/GroupDummyAndContents/Reify+PAssert$0/GroupGlobally/GroupDummyAndContents/Write
    Jul 22, 2019 7:30:03 PM org.apache.beam.runners.dataflow.util.MonitoringUtil$LoggingHandler process
    INFO: 2019-07-22T19:30:00.830Z: Worker configuration: n1-standard-1 in us-central1-a.
    Jul 22, 2019 7:30:36 PM org.apache.beam.runners.dataflow.util.MonitoringUtil$LoggingHandler process
    INFO: 2019-07-22T19:30:34.638Z: Workers have started successfully.
    Jul 22, 2019 7:30:57 PM org.apache.beam.runners.dataflow.util.MonitoringUtil$LoggingHandler process
    INFO: 2019-07-22T19:30:56.616Z: Autoscaling: Raised the number of workers to 1 based on the rate of progress in the currently running step(s).
    Jul 22, 2019 7:31:08 PM org.apache.beam.runners.dataflow.util.MonitoringUtil$LoggingHandler process
    INFO: 2019-07-22T19:31:05.901Z: Workers have started successfully.
    Jul 22, 2019 7:31:27 PM org.apache.beam.runners.dataflow.util.MonitoringUtil$LoggingHandler process
    INFO: 2019-07-22T19:31:25.909Z: Finished operation PAssert$0/GroupGlobally/Create.Values/Read(CreateSource)+PAssert$0/GroupGlobally/WindowIntoDummy/Window.Assign+PAssert$0/GroupGlobally/GroupDummyAndContents/Reify+PAssert$0/GroupGlobally/GroupDummyAndContents/Write
    Jul 22, 2019 7:31:44 PM org.apache.beam.runners.dataflow.DataflowPipelineJob lambda$waitUntilFinish$0
    WARNING: Job is already running in Google Cloud Platform, Ctrl-C will not cancel it.
    To cancel the job in the cloud, run:
    > gcloud dataflow jobs --project=apache-beam-testing cancel --region=us-central1 2019-07-22_12_29_42-2299702388695407822

org.apache.beam.sdk.io.mongodb.MongoDBIOIT > testWriteAndRead SKIPPED

> Task :sdks:java:io:mongodb:integrationTest FAILED
:sdks:java:io:mongodb:integrationTest (Thread[Execution worker for ':' Thread 7,5,main]) completed. Took 9 mins 56.552 secs.

Deprecated Gradle features were used in this build, making it incompatible with Gradle 6.0.
Use '--warning-mode all' to show the individual deprecation warnings.
See https://docs.gradle.org/5.2.1/userguide/command_line_interface.html#sec:command_line_warnings
80 actionable tasks: 40 executed, 22 from cache, 18 up-to-date

STDERR: Note: <https://builds.apache.org/job/beam_PerformanceTests_MongoDBIO_IT/ws/src/sdks/java/io/mongodb/src/test/java/org/apache/beam/sdk/io/mongodb/MongoDBGridFSIOTest.java> uses or overrides a deprecated API.
Note: Recompile with -Xlint:deprecation for details.

FAILURE: Build failed with an exception.

* What went wrong:
Execution failed for task ':sdks:java:io:mongodb:integrationTest'.
> Process 'Gradle Test Executor 1' finished with non-zero exit value 143
  This problem might be caused by incorrect test process configuration.
  Please refer to the test execution section in the User Manual at https://docs.gradle.org/5.2.1/userguide/java_testing.html#sec:test_execution

* Try:
Run with --debug option to get more log output. Run with --scan to get full insights.

* Exception is:
org.gradle.api.tasks.TaskExecutionException: Execution failed for task ':sdks:java:io:mongodb:integrationTest'.
	at org.gradle.api.internal.tasks.execution.ExecuteActionsTaskExecuter$2.accept(ExecuteActionsTaskExecuter.java:121)
	at org.gradle.api.internal.tasks.execution.ExecuteActionsTaskExecuter$2.accept(ExecuteActionsTaskExecuter.java:117)
	at org.gradle.internal.Try$Failure.ifSuccessfulOrElse(Try.java:184)
	at org.gradle.api.internal.tasks.execution.ExecuteActionsTaskExecuter.execute(ExecuteActionsTaskExecuter.java:110)
	at org.gradle.api.internal.tasks.execution.ResolveIncrementalChangesTaskExecuter.execute(ResolveIncrementalChangesTaskExecuter.java:84)
	at org.gradle.api.internal.tasks.execution.ResolveTaskOutputCachingStateExecuter.execute(ResolveTaskOutputCachingStateExecuter.java:91)
	at org.gradle.api.internal.tasks.execution.FinishSnapshotTaskInputsBuildOperationTaskExecuter.execute(FinishSnapshotTaskInputsBuildOperationTaskExecuter.java:51)
	at org.gradle.api.internal.tasks.execution.ResolveBuildCacheKeyExecuter.execute(ResolveBuildCacheKeyExecuter.java:102)
	at org.gradle.api.internal.tasks.execution.ResolveBeforeExecutionStateTaskExecuter.execute(ResolveBeforeExecutionStateTaskExecuter.java:74)
	at org.gradle.api.internal.tasks.execution.ValidatingTaskExecuter.execute(ValidatingTaskExecuter.java:58)
	at org.gradle.api.internal.tasks.execution.SkipEmptySourceFilesTaskExecuter.execute(SkipEmptySourceFilesTaskExecuter.java:109)
	at org.gradle.api.internal.tasks.execution.ResolveBeforeExecutionOutputsTaskExecuter.execute(ResolveBeforeExecutionOutputsTaskExecuter.java:67)
	at org.gradle.api.internal.tasks.execution.StartSnapshotTaskInputsBuildOperationTaskExecuter.execute(StartSnapshotTaskInputsBuildOperationTaskExecuter.java:52)
	at org.gradle.api.internal.tasks.execution.ResolveAfterPreviousExecutionStateTaskExecuter.execute(ResolveAfterPreviousExecutionStateTaskExecuter.java:46)
	at org.gradle.api.internal.tasks.execution.CleanupStaleOutputsExecuter.execute(CleanupStaleOutputsExecuter.java:93)
	at org.gradle.api.internal.tasks.execution.FinalizePropertiesTaskExecuter.execute(FinalizePropertiesTaskExecuter.java:45)
	at org.gradle.api.internal.tasks.execution.ResolveTaskExecutionModeExecuter.execute(ResolveTaskExecutionModeExecuter.java:94)
	at org.gradle.api.internal.tasks.execution.SkipTaskWithNoActionsExecuter.execute(SkipTaskWithNoActionsExecuter.java:57)
	at org.gradle.api.internal.tasks.execution.SkipOnlyIfTaskExecuter.execute(SkipOnlyIfTaskExecuter.java:56)
	at org.gradle.api.internal.tasks.execution.CatchExceptionTaskExecuter.execute(CatchExceptionTaskExecuter.java:36)
	at org.gradle.api.internal.tasks.execution.EventFiringTaskExecuter$1.executeTask(EventFiringTaskExecuter.java:63)
	at org.gradle.api.internal.tasks.execution.EventFiringTaskExecuter$1.call(EventFiringTaskExecuter.java:49)
	at org.gradle.api.internal.tasks.execution.EventFiringTaskExecuter$1.call(EventFiringTaskExecuter.java:46)
	at org.gradle.internal.operations.DefaultBuildOperationExecutor$CallableBuildOperationWorker.execute(DefaultBuildOperationExecutor.java:416)
	at org.gradle.internal.operations.DefaultBuildOperationExecutor$CallableBuildOperationWorker.execute(DefaultBuildOperationExecutor.java:406)
	at org.gradle.internal.operations.DefaultBuildOperationExecutor$1.execute(DefaultBuildOperationExecutor.java:165)
	at org.gradle.internal.operations.DefaultBuildOperationExecutor.execute(DefaultBuildOperationExecutor.java:250)
	at org.gradle.internal.operations.DefaultBuildOperationExecutor.execute(DefaultBuildOperationExecutor.java:158)
	at org.gradle.internal.operations.DefaultBuildOperationExecutor.call(DefaultBuildOperationExecutor.java:102)
	at org.gradle.internal.operations.DelegatingBuildOperationExecutor.call(DelegatingBuildOperationExecutor.java:36)
	at org.gradle.api.internal.tasks.execution.EventFiringTaskExecuter.execute(EventFiringTaskExecuter.java:46)
	at org.gradle.execution.plan.LocalTaskNodeExecutor.execute(LocalTaskNodeExecutor.java:43)
	at org.gradle.execution.taskgraph.DefaultTaskExecutionGraph$InvokeNodeExecutorsAction.execute(DefaultTaskExecutionGraph.java:355)
	at org.gradle.execution.taskgraph.DefaultTaskExecutionGraph$InvokeNodeExecutorsAction.execute(DefaultTaskExecutionGraph.java:343)
	at org.gradle.execution.taskgraph.DefaultTaskExecutionGraph$BuildOperationAwareExecutionAction.execute(DefaultTaskExecutionGraph.java:336)
	at org.gradle.execution.taskgraph.DefaultTaskExecutionGraph$BuildOperationAwareExecutionAction.execute(DefaultTaskExecutionGraph.java:322)
	at org.gradle.execution.plan.DefaultPlanExecutor$ExecutorWorker$1.execute(DefaultPlanExecutor.java:134)
	at org.gradle.execution.plan.DefaultPlanExecutor$ExecutorWorker$1.execute(DefaultPlanExecutor.java:129)
	at org.gradle.execution.plan.DefaultPlanExecutor$ExecutorWorker.execute(DefaultPlanExecutor.java:202)
	at org.gradle.execution.plan.DefaultPlanExecutor$ExecutorWorker.executeNextNode(DefaultPlanExecutor.java:193)
	at org.gradle.execution.plan.DefaultPlanExecutor$ExecutorWorker.run(DefaultPlanExecutor.java:129)
	at org.gradle.internal.concurrent.ExecutorPolicy$CatchAndRecordFailures.onExecute(ExecutorPolicy.java:63)
	at org.gradle.internal.concurrent.ManagedExecutorImpl$1.run(ManagedExecutorImpl.java:46)
	at org.gradle.internal.concurrent.ThreadFactoryImpl$ManagedThreadRunnable.run(ThreadFactoryImpl.java:55)
Caused by: org.gradle.process.internal.ExecException: Process 'Gradle Test Executor 1' finished with non-zero exit value 143
This problem might be caused by incorrect test process configuration.
Please refer to the test execution section in the User Manual at https://docs.gradle.org/5.2.1/userguide/java_testing.html#sec:test_execution
	at org.gradle.api.internal.tasks.testing.worker.ForkingTestClassProcessor.stop(ForkingTestClassProcessor.java:163)
	at org.gradle.api.internal.tasks.testing.processors.RestartEveryNTestClassProcessor.endBatch(RestartEveryNTestClassProcessor.java:77)
	at org.gradle.api.internal.tasks.testing.processors.RestartEveryNTestClassProcessor.stop(RestartEveryNTestClassProcessor.java:62)
	at org.gradle.internal.dispatch.ReflectionDispatch.dispatch(ReflectionDispatch.java:35)
	at org.gradle.internal.dispatch.ReflectionDispatch.dispatch(ReflectionDispatch.java:24)
	at org.gradle.internal.dispatch.FailureHandlingDispatch.dispatch(FailureHandlingDispatch.java:29)
	at org.gradle.internal.dispatch.AsyncDispatch.dispatchMessages(AsyncDispatch.java:87)
	at org.gradle.internal.dispatch.AsyncDispatch.access$000(AsyncDispatch.java:36)
	at org.gradle.internal.dispatch.AsyncDispatch$1.run(AsyncDispatch.java:71)
	at org.gradle.internal.concurrent.InterruptibleRunnable.run(InterruptibleRunnable.java:42)
	at org.gradle.internal.operations.CurrentBuildOperationPreservingRunnable.run(CurrentBuildOperationPreservingRunnable.java:42)
	... 3 more


* Get more help at https://help.gradle.org

BUILD FAILED in 10m 26s
The message received from the daemon indicates that the daemon has disappeared.
Build request sent: Build{id=93e22b68-c8e3-4354-94b8-53ba2186f86d, currentDir=<https://builds.apache.org/job/beam_PerformanceTests_MongoDBIO_IT/ws/src}>
Attempting to read last messages from the daemon log...
Daemon pid: 10497
  log file: /home/jenkins/.gradle/daemon/5.2.1/daemon-10497.out.log
----- Last  20 lines from daemon log file - daemon-10497.out.log -----
	at org.gradle.internal.dispatch.ReflectionDispatch.dispatch(ReflectionDispatch.java:35)
	at org.gradle.internal.dispatch.ReflectionDispatch.dispatch(ReflectionDispatch.java:24)
	at org.gradle.internal.dispatch.FailureHandlingDispatch.dispatch(FailureHandlingDispatch.java:29)
	at org.gradle.internal.dispatch.AsyncDispatch.dispatchMessages(AsyncDispatch.java:87)
	at org.gradle.internal.dispatch.AsyncDispatch.access$000(AsyncDispatch.java:36)
	at org.gradle.internal.dispatch.AsyncDispatch$1.run(AsyncDispatch.java:71)
	at org.gradle.internal.concurrent.InterruptibleRunnable.run(InterruptibleRunnable.java:42)
	at org.gradle.internal.operations.CurrentBuildOperationPreservingRunnable.run(CurrentBuildOperationPreservingRunnable.java:42)
	... 3 more


* Get more help at https://help.gradle.org

Deprecated Gradle features were used in this build, making it incompatible with Gradle 6.0.
Use '--warning-mode all' to show the individual deprecation warnings.
See https://docs.gradle.org/5.2.1/userguide/command_line_interface.html#sec:command_line_warnings

BUILD FAILED in 10m 26s
80 actionable tasks: 40 executed, 22 from cache, 18 up-to-date
Daemon vm is shutting down... The daemon has exited normally or was terminated in response to a user interrupt.
----- End of the daemon log -----


FAILURE: Build failed with an exception.

* What went wrong:
Gradle build daemon disappeared unexpectedly (it may have been killed or may have crashed)

* Try:
Run with --debug option to get more log output. Run with --scan to get full insights.

* Exception is:
org.gradle.launcher.daemon.client.DaemonDisappearedException: Gradle build daemon disappeared unexpectedly (it may have been killed or may have crashed)
	at org.gradle.launcher.daemon.client.DaemonClient.handleDaemonDisappearance(DaemonClient.java:241)
	at org.gradle.launcher.daemon.client.DaemonClient.monitorBuild(DaemonClient.java:217)
	at org.gradle.launcher.daemon.client.DaemonClient.executeBuild(DaemonClient.java:179)
	at org.gradle.launcher.daemon.client.DaemonClient.execute(DaemonClient.java:142)
	at org.gradle.launcher.daemon.client.DaemonClient.execute(DaemonClient.java:94)
	at org.gradle.launcher.cli.RunBuildAction.run(RunBuildAction.java:55)
	at org.gradle.internal.Actions$RunnableActionAdapter.execute(Actions.java:207)
	at org.gradle.launcher.cli.CommandLineActionFactory$ParseAndBuildAction.execute(CommandLineActionFactory.java:403)
	at org.gradle.launcher.cli.CommandLineActionFactory$ParseAndBuildAction.execute(CommandLineActionFactory.java:376)
	at org.gradle.launcher.cli.ExceptionReportingAction.execute(ExceptionReportingAction.java:37)
	at org.gradle.launcher.cli.ExceptionReportingAction.execute(ExceptionReportingAction.java:23)
	at org.gradle.launcher.cli.CommandLineActionFactory$WithLogging.execute(CommandLineActionFactory.java:369)
	at org.gradle.launcher.cli.CommandLineActionFactory$WithLogging.execute(CommandLineActionFactory.java:299)
	at org.gradle.launcher.Main.doAction(Main.java:36)
	at org.gradle.launcher.bootstrap.EntryPoint.run(EntryPoint.java:45)
	at sun.reflect.NativeMethodAccessorImpl.invoke0(Native Method)
	at sun.reflect.NativeMethodAccessorImpl.invoke(NativeMethodAccessorImpl.java:62)
	at sun.reflect.DelegatingMethodAccessorImpl.invoke(DelegatingMethodAccessorImpl.java:43)
	at java.lang.reflect.Method.invoke(Method.java:498)
	at org.gradle.launcher.bootstrap.ProcessBootstrap.runNoExit(ProcessBootstrap.java:60)
	at org.gradle.launcher.bootstrap.ProcessBootstrap.run(ProcessBootstrap.java:37)
	at org.gradle.launcher.GradleMain.main(GradleMain.java:23)
	at sun.reflect.NativeMethodAccessorImpl.invoke0(Native Method)
	at sun.reflect.NativeMethodAccessorImpl.invoke(NativeMethodAccessorImpl.java:62)
	at sun.reflect.DelegatingMethodAccessorImpl.invoke(DelegatingMethodAccessorImpl.java:43)
	at java.lang.reflect.Method.invoke(Method.java:498)
	at org.gradle.wrapper.BootstrapMainStarter.start(BootstrapMainStarter.java:31)
	at org.gradle.wrapper.WrapperExecutor.execute(WrapperExecutor.java:108)
	at org.gradle.wrapper.GradleWrapperMain.main(GradleWrapperMain.java:61)


* Get more help at https://help.gradle.org

2019-07-22 19:31:46,327 01f82083 MainThread beam_integration_benchmark(1/1) ERROR    Error during benchmark beam_integration_benchmark
Traceback (most recent call last):
  File "<https://builds.apache.org/job/beam_PerformanceTests_MongoDBIO_IT/ws/PerfKitBenchmarker/perfkitbenchmarker/pkb.py",> line 841, in RunBenchmark
    DoRunPhase(spec, collector, detailed_timer)
  File "<https://builds.apache.org/job/beam_PerformanceTests_MongoDBIO_IT/ws/PerfKitBenchmarker/perfkitbenchmarker/pkb.py",> line 690, in DoRunPhase
    samples = spec.BenchmarkRun(spec)
  File "<https://builds.apache.org/job/beam_PerformanceTests_MongoDBIO_IT/ws/PerfKitBenchmarker/perfkitbenchmarker/linux_benchmarks/beam_integration_benchmark.py",> line 160, in Run
    job_type=job_type)
  File "<https://builds.apache.org/job/beam_PerformanceTests_MongoDBIO_IT/ws/PerfKitBenchmarker/perfkitbenchmarker/providers/gcp/gcp_dpb_dataflow.py",> line 90, in SubmitJob
    assert retcode == 0, "Integration Test Failed."
AssertionError: Integration Test Failed.
2019-07-22 19:31:46,329 01f82083 MainThread beam_integration_benchmark(1/1) INFO     Cleaning up benchmark beam_integration_benchmark
2019-07-22 19:31:46,329 01f82083 MainThread beam_integration_benchmark(1/1) INFO     Running: kubectl --kubeconfig=<https://builds.apache.org/job/beam_PerformanceTests_MongoDBIO_IT/ws/config-beam-performancetests-mongodbio-it-1923> delete -f <https://builds.apache.org/job/beam_PerformanceTests_MongoDBIO_IT/ws/src/.test-infra/kubernetes/mongodb/load-balancer/mongo.yml> --ignore-not-found
2019-07-22 19:31:46,654 01f82083 MainThread beam_integration_benchmark(1/1) ERROR    Exception running benchmark
Traceback (most recent call last):
  File "<https://builds.apache.org/job/beam_PerformanceTests_MongoDBIO_IT/ws/PerfKitBenchmarker/perfkitbenchmarker/pkb.py",> line 984, in RunBenchmarkTask
    RunBenchmark(spec, collector)
  File "<https://builds.apache.org/job/beam_PerformanceTests_MongoDBIO_IT/ws/PerfKitBenchmarker/perfkitbenchmarker/pkb.py",> line 841, in RunBenchmark
    DoRunPhase(spec, collector, detailed_timer)
  File "<https://builds.apache.org/job/beam_PerformanceTests_MongoDBIO_IT/ws/PerfKitBenchmarker/perfkitbenchmarker/pkb.py",> line 690, in DoRunPhase
    samples = spec.BenchmarkRun(spec)
  File "<https://builds.apache.org/job/beam_PerformanceTests_MongoDBIO_IT/ws/PerfKitBenchmarker/perfkitbenchmarker/linux_benchmarks/beam_integration_benchmark.py",> line 160, in Run
    job_type=job_type)
  File "<https://builds.apache.org/job/beam_PerformanceTests_MongoDBIO_IT/ws/PerfKitBenchmarker/perfkitbenchmarker/providers/gcp/gcp_dpb_dataflow.py",> line 90, in SubmitJob
    assert retcode == 0, "Integration Test Failed."
AssertionError: Integration Test Failed.
2019-07-22 19:31:46,655 01f82083 MainThread beam_integration_benchmark(1/1) ERROR    Benchmark 1/1 beam_integration_benchmark (UID: beam_integration_benchmark0) failed. Execution will continue.
2019-07-22 19:31:46,656 01f82083 MainThread beam_integration_benchmark(1/1) INFO     Benchmark run statuses:
---------------------------------------------------------------------------------
Name                        UID                          Status  Failed Substatus
---------------------------------------------------------------------------------
beam_integration_benchmark  beam_integration_benchmark0  FAILED                  
---------------------------------------------------------------------------------
Success rate: 0.00% (0/1)
2019-07-22 19:31:46,656 01f82083 MainThread beam_integration_benchmark(1/1) INFO     Complete logs can be found at: <https://builds.apache.org/job/beam_PerformanceTests_MongoDBIO_IT/ws/runs/01f82083/pkb.log>
2019-07-22 19:31:46,656 01f82083 MainThread beam_integration_benchmark(1/1) INFO     Completion statuses can be found at: <https://builds.apache.org/job/beam_PerformanceTests_MongoDBIO_IT/ws/runs/01f82083/completion_statuses.json>
Build step 'Execute shell' marked build as failure

---------------------------------------------------------------------
To unsubscribe, e-mail: builds-unsubscribe@beam.apache.org
For additional commands, e-mail: builds-help@beam.apache.org


Build failed in Jenkins: beam_PerformanceTests_MongoDBIO_IT #1922

Posted by Apache Jenkins Server <je...@builds.apache.org>.
See <https://builds.apache.org/job/beam_PerformanceTests_MongoDBIO_IT/1922/display/redirect>

------------------------------------------
GitHub pull request #9116 of commit 0bfe5c4e39ab50398663c1bec94a6279674b7aba, no merge conflicts.
Setting status of 0bfe5c4e39ab50398663c1bec94a6279674b7aba to PENDING with url https://builds.apache.org/job/beam_PerformanceTests_MongoDBIO_IT/1922/ and message: 'Build started for merge commit.'
Using context: Java MongoDBIO Performance Test
[EnvInject] - Loading node environment variables.
Building remotely on apache-beam-jenkins-11 (beam) in workspace <https://builds.apache.org/job/beam_PerformanceTests_MongoDBIO_IT/ws/>
No credentials specified
 > git rev-parse --is-inside-work-tree # timeout=10
Fetching changes from the remote Git repository
 > git config remote.origin.url https://github.com/apache/beam.git # timeout=10
Fetching upstream changes from https://github.com/apache/beam.git
 > git --version # timeout=10
 > git fetch --tags --progress https://github.com/apache/beam.git +refs/heads/*:refs/remotes/origin/* +refs/pull/9116/*:refs/remotes/origin/pr/9116/*
 > git rev-parse refs/remotes/origin/pr/9116/merge^{commit} # timeout=10
 > git rev-parse refs/remotes/origin/origin/pr/9116/merge^{commit} # timeout=10
Checking out Revision a9af8ecf1533a91f6322694523c9a8bf92835de5 (refs/remotes/origin/pr/9116/merge)
 > git config core.sparsecheckout # timeout=10
 > git checkout -f a9af8ecf1533a91f6322694523c9a8bf92835de5
Commit message: "Merge 0bfe5c4e39ab50398663c1bec94a6279674b7aba into f6367cc1a4565060e5f1bf652ad5725ac5b43aa6"
First time build. Skipping changelog.
Cleaning workspace
 > git rev-parse --verify HEAD # timeout=10
Resetting working tree
 > git reset --hard # timeout=10
 > git clean -fdx # timeout=10
[EnvInject] - Executing scripts and injecting environment variables after the SCM step.
[EnvInject] - Injecting as environment variables the properties content 
SPARK_LOCAL_IP=127.0.0.1

[EnvInject] - Variables injected successfully.
[beam_PerformanceTests_MongoDBIO_IT] $ /bin/bash -xe /tmp/jenkins3495584664039414711.sh
+ cp /home/jenkins/.kube/config <https://builds.apache.org/job/beam_PerformanceTests_MongoDBIO_IT/ws/config-beam-performancetests-mongodbio-it-1922>
[EnvInject] - Injecting environment variables from a build step.
[EnvInject] - Injecting as environment variables the properties content 
KUBERNETES_NAMESPACE=beam-performancetests-mongodbio-it-1922
KUBECONFIG="<https://builds.apache.org/job/beam_PerformanceTests_MongoDBIO_IT/ws/config-beam-performancetests-mongodbio-it-1922">

[EnvInject] - Variables injected successfully.
[beam_PerformanceTests_MongoDBIO_IT] $ /bin/bash -xe /tmp/jenkins8005762640821382653.sh
+ <https://builds.apache.org/job/beam_PerformanceTests_MongoDBIO_IT/ws/src/.test-infra/kubernetes/kubernetes.sh> createNamespace beam-performancetests-mongodbio-it-1922
+ KUBECONFIG='"<https://builds.apache.org/job/beam_PerformanceTests_MongoDBIO_IT/ws/config-beam-performancetests-mongodbio-it-1922"'>
+ KUBERNETES_NAMESPACE=beam-performancetests-mongodbio-it-1922
+ KUBECTL='kubectl --kubeconfig="<https://builds.apache.org/job/beam_PerformanceTests_MongoDBIO_IT/ws/config-beam-performancetests-mongodbio-it-1922"> --namespace=beam-performancetests-mongodbio-it-1922'
+ createNamespace beam-performancetests-mongodbio-it-1922
+ eval 'kubectl --kubeconfig="<https://builds.apache.org/job/beam_PerformanceTests_MongoDBIO_IT/ws/config-beam-performancetests-mongodbio-it-1922"> create namespace beam-performancetests-mongodbio-it-1922'
++ kubectl --kubeconfig=<https://builds.apache.org/job/beam_PerformanceTests_MongoDBIO_IT/ws/config-beam-performancetests-mongodbio-it-1922> create namespace beam-performancetests-mongodbio-it-1922
namespace/beam-performancetests-mongodbio-it-1922 created
[beam_PerformanceTests_MongoDBIO_IT] $ /bin/bash -xe /tmp/jenkins2818847409661470384.sh
+ <https://builds.apache.org/job/beam_PerformanceTests_MongoDBIO_IT/ws/src/.test-infra/kubernetes/kubernetes.sh> apply <https://builds.apache.org/job/beam_PerformanceTests_MongoDBIO_IT/ws/src/.test-infra/kubernetes/mongodb/load-balancer/mongo.yml>
+ KUBECONFIG='"<https://builds.apache.org/job/beam_PerformanceTests_MongoDBIO_IT/ws/config-beam-performancetests-mongodbio-it-1922"'>
+ KUBERNETES_NAMESPACE=beam-performancetests-mongodbio-it-1922
+ KUBECTL='kubectl --kubeconfig="<https://builds.apache.org/job/beam_PerformanceTests_MongoDBIO_IT/ws/config-beam-performancetests-mongodbio-it-1922"> --namespace=beam-performancetests-mongodbio-it-1922'
+ apply <https://builds.apache.org/job/beam_PerformanceTests_MongoDBIO_IT/ws/src/.test-infra/kubernetes/mongodb/load-balancer/mongo.yml>
+ eval 'kubectl --kubeconfig="<https://builds.apache.org/job/beam_PerformanceTests_MongoDBIO_IT/ws/config-beam-performancetests-mongodbio-it-1922"> --namespace=beam-performancetests-mongodbio-it-1922 apply -R -f <https://builds.apache.org/job/beam_PerformanceTests_MongoDBIO_IT/ws/src/.test-infra/kubernetes/mongodb/load-balancer/mongo.yml'>
++ kubectl --kubeconfig=<https://builds.apache.org/job/beam_PerformanceTests_MongoDBIO_IT/ws/config-beam-performancetests-mongodbio-it-1922> --namespace=beam-performancetests-mongodbio-it-1922 apply -R -f <https://builds.apache.org/job/beam_PerformanceTests_MongoDBIO_IT/ws/src/.test-infra/kubernetes/mongodb/load-balancer/mongo.yml>
service/mongo-load-balancer-service created
replicationcontroller/mongo created
[beam_PerformanceTests_MongoDBIO_IT] $ /bin/bash -xe /tmp/jenkins1391238989071411513.sh
++ eval <https://builds.apache.org/job/beam_PerformanceTests_MongoDBIO_IT/ws/src/.test-infra/kubernetes/kubernetes.sh> loadBalancerIP mongo-load-balancer-service
+++ <https://builds.apache.org/job/beam_PerformanceTests_MongoDBIO_IT/ws/src/.test-infra/kubernetes/kubernetes.sh> loadBalancerIP mongo-load-balancer-service
+ KUBECONFIG='"<https://builds.apache.org/job/beam_PerformanceTests_MongoDBIO_IT/ws/config-beam-performancetests-mongodbio-it-1922"'>
+ KUBERNETES_NAMESPACE=beam-performancetests-mongodbio-it-1922
+ KUBECTL='kubectl --kubeconfig="<https://builds.apache.org/job/beam_PerformanceTests_MongoDBIO_IT/ws/config-beam-performancetests-mongodbio-it-1922"> --namespace=beam-performancetests-mongodbio-it-1922'
+ loadBalancerIP mongo-load-balancer-service
+ local name=mongo-load-balancer-service
+ local 'command=kubectl --kubeconfig="<https://builds.apache.org/job/beam_PerformanceTests_MongoDBIO_IT/ws/config-beam-performancetests-mongodbio-it-1922"> --namespace=beam-performancetests-mongodbio-it-1922 get svc mongo-load-balancer-service -ojsonpath='\''{.status.loadBalancer.ingress[0].ip}'\'''
++ retry 'kubectl --kubeconfig="<https://builds.apache.org/job/beam_PerformanceTests_MongoDBIO_IT/ws/config-beam-performancetests-mongodbio-it-1922"> --namespace=beam-performancetests-mongodbio-it-1922 get svc mongo-load-balancer-service -ojsonpath='\''{.status.loadBalancer.ingress[0].ip}'\''' 36 10
++ local 'command=kubectl --kubeconfig="<https://builds.apache.org/job/beam_PerformanceTests_MongoDBIO_IT/ws/config-beam-performancetests-mongodbio-it-1922"> --namespace=beam-performancetests-mongodbio-it-1922 get svc mongo-load-balancer-service -ojsonpath='\''{.status.loadBalancer.ingress[0].ip}'\'''
++ local max_retries=36
++ local sleep_time=10
++ (( i = 1 ))
++ (( i <= 36 ))
++ eval kubectl '--kubeconfig="<https://builds.apache.org/job/beam_PerformanceTests_MongoDBIO_IT/ws/config-beam-performancetests-mongodbio-it-1922"'> --namespace=beam-performancetests-mongodbio-it-1922 get svc mongo-load-balancer-service '-ojsonpath='\''{.status.loadBalancer.ingress[0].ip}'\'''
+++ kubectl --kubeconfig=<https://builds.apache.org/job/beam_PerformanceTests_MongoDBIO_IT/ws/config-beam-performancetests-mongodbio-it-1922> --namespace=beam-performancetests-mongodbio-it-1922 get svc mongo-load-balancer-service '-ojsonpath={.status.loadBalancer.ingress[0].ip}'
++ return 0
+ echo
+ echo LOAD_BALANCER_IP=
[EnvInject] - Injecting environment variables from a build step.
[EnvInject] - Injecting as environment variables the properties file path 'job.properties'
[EnvInject] - Variables injected successfully.
[Gradle] - Launching build.
[src] $ <https://builds.apache.org/job/beam_PerformanceTests_MongoDBIO_IT/ws/src/gradlew> --continue --max-workers=12 -Dorg.gradle.jvmargs=-Xms2g -Dorg.gradle.jvmargs=-Xmx4g -p sdks/java/io/mongodb -DintegrationTestPipelineOptions=[["--tempRoot=gs://temp-storage-for-perf-tests","--project=apache-beam-testing","--numberOfRecords=10000000","--bigQueryDataset=beam_performance","--bigQueryTable=mongodbioit_results","--mongoDBDatabaseName=beam","--mongoDBHostName=","--mongoDBPort=27017"]] -DintegrationTestRunner=dataflow --tests org.apache.beam.sdk.mongodb.MongoDBIOIT integrationTest

Unknown command-line option '--tests'.

USAGE: gradlew_orig [option...] [task...]

-?, -h, --help            Shows this help message.
-a, --no-rebuild          Do not rebuild project dependencies.
-b, --build-file          Specify the build file.
--build-cache             Enables the Gradle build cache. Gradle will try to reuse outputs from previous builds.
-c, --settings-file       Specify the settings file.
--configure-on-demand     Configure necessary projects only. Gradle will attempt to reduce configuration time for large multi-project builds. [incubating]
--console                 Specifies which type of console output to generate. Values are 'plain', 'auto' (default), 'rich' or 'verbose'.
--continue                Continue task execution after a task failure.
-D, --system-prop         Set system property of the JVM (e.g. -Dmyprop=myvalue).
-d, --debug               Log in debug mode (includes normal stacktrace).
--daemon                  Uses the Gradle Daemon to run the build. Starts the Daemon if not running.
--foreground              Starts the Gradle Daemon in the foreground.
-g, --gradle-user-home    Specifies the gradle user home directory.
-I, --init-script         Specify an initialization script.
-i, --info                Set log level to info.
--include-build           Include the specified build in the composite.
-m, --dry-run             Run the builds with all task actions disabled.
--max-workers             Configure the number of concurrent workers Gradle is allowed to use.
--no-build-cache          Disables the Gradle build cache.
--no-configure-on-demand  Disables the use of configuration on demand. [incubating]
--no-daemon               Do not use the Gradle daemon to run the build. Useful occasionally if you have configured Gradle to always run with the daemon by default.
--no-parallel             Disables parallel execution to build projects.
--no-scan                 Disables the creation of a build scan. For more information about build scans, please visit https://gradle.com/build-scans.
--offline                 Execute the build without accessing network resources.
-P, --project-prop        Set project property for the build script (e.g. -Pmyprop=myvalue).
-p, --project-dir         Specifies the start directory for Gradle. Defaults to current directory.
--parallel                Build projects in parallel. Gradle will attempt to determine the optimal number of executor threads to use.
--priority                Specifies the scheduling priority for the Gradle daemon and all processes launched by it. Values are 'normal' (default) or 'low' [incubating]
--profile                 Profile build execution time and generates a report in the <build_dir>/reports/profile directory.
--project-cache-dir       Specify the project-specific cache directory. Defaults to .gradle in the root project directory.
-q, --quiet               Log errors only.
--refresh-dependencies    Refresh the state of dependencies.
--rerun-tasks             Ignore previously cached task results.
-S, --full-stacktrace     Print out the full (very verbose) stacktrace for all exceptions.
-s, --stacktrace          Print out the stacktrace for all exceptions.
--scan                    Creates a build scan. Gradle will emit a warning if the build scan plugin has not been applied. (https://gradle.com/build-scans)
--status                  Shows status of running and recently stopped Gradle Daemon(s).
--stop                    Stops the Gradle Daemon if it is running.
-t, --continuous          Enables continuous build. Gradle does not exit and will re-execute tasks when task file inputs change.
--update-locks            Perform a partial update of the dependency lock, letting passed in module notations change version. [incubating]
-v, --version             Print version info.
-w, --warn                Set log level to warn.
--warning-mode            Specifies which mode of warnings to generate. Values are 'all', 'summary'(default) or 'none'
--write-locks             Persists dependency resolution for locked configurations, ignoring existing locking information if it exists [incubating]
-x, --exclude-task        Specify a task to be excluded from execution.

Build step 'Invoke Gradle script' changed build result to FAILURE
Build step 'Invoke Gradle script' marked build as failure

---------------------------------------------------------------------
To unsubscribe, e-mail: builds-unsubscribe@beam.apache.org
For additional commands, e-mail: builds-help@beam.apache.org


Build failed in Jenkins: beam_PerformanceTests_MongoDBIO_IT #1921

Posted by Apache Jenkins Server <je...@builds.apache.org>.
See <https://builds.apache.org/job/beam_PerformanceTests_MongoDBIO_IT/1921/display/redirect?page=changes>

Changes:

[robertwb] [BEAM-7060] Support translation of native type variables.

[robertwb] [BEAM-7060] Translate the typing.Iterable type hint.

[robertwb] Minor fixes discovered in migration.

[robertwb] [BEAM-7060] Automated replace of typehints with typing.

[github] Remove 4 empty spaces from PR template that mess up Python postcommit

[github] Relax pydot requirements.

[ttanay100] Replace old badges for Python PostCommit test with split ones

[robertwb] Post-rewrite lint fixes.

[robertwb] Manual fixes for over-agressive replace.

[robertwb] More conservative typing module translation.

------------------------------------------
Started by timer
[EnvInject] - Loading node environment variables.
Building remotely on apache-beam-jenkins-1 (beam) in workspace <https://builds.apache.org/job/beam_PerformanceTests_MongoDBIO_IT/ws/>
No credentials specified
 > git rev-parse --is-inside-work-tree # timeout=10
Fetching changes from the remote Git repository
 > git config remote.origin.url https://github.com/apache/beam.git # timeout=10
Fetching upstream changes from https://github.com/apache/beam.git
 > git --version # timeout=10
 > git fetch --tags --progress https://github.com/apache/beam.git +refs/heads/*:refs/remotes/origin/* +refs/pull/${ghprbPullId}/*:refs/remotes/origin/pr/${ghprbPullId}/*
 > git rev-parse origin/master^{commit} # timeout=10
Checking out Revision f6367cc1a4565060e5f1bf652ad5725ac5b43aa6 (origin/master)
 > git config core.sparsecheckout # timeout=10
 > git checkout -f f6367cc1a4565060e5f1bf652ad5725ac5b43aa6
Commit message: "Merge pull request #9112 Fix PR template."
 > git rev-list --no-walk 94a3c8542d61de52aca112d2373c399bc8826611 # timeout=10
Cleaning workspace
 > git rev-parse --verify HEAD # timeout=10
Resetting working tree
 > git reset --hard # timeout=10
 > git clean -fdx # timeout=10
[EnvInject] - Executing scripts and injecting environment variables after the SCM step.
[EnvInject] - Injecting as environment variables the properties content 
SPARK_LOCAL_IP=127.0.0.1

[EnvInject] - Variables injected successfully.
[beam_PerformanceTests_MongoDBIO_IT] $ /bin/bash -xe /tmp/jenkins6379435730139186605.sh
+ cp /home/jenkins/.kube/config <https://builds.apache.org/job/beam_PerformanceTests_MongoDBIO_IT/ws/config-beam-performancetests-mongodbio-it-1921>
[EnvInject] - Injecting environment variables from a build step.
[EnvInject] - Injecting as environment variables the properties content 
KUBERNETES_NAMESPACE=beam-performancetests-mongodbio-it-1921
KUBECONFIG="<https://builds.apache.org/job/beam_PerformanceTests_MongoDBIO_IT/ws/config-beam-performancetests-mongodbio-it-1921">

[EnvInject] - Variables injected successfully.
[beam_PerformanceTests_MongoDBIO_IT] $ /bin/bash -xe /tmp/jenkins358847015511210953.sh
+ <https://builds.apache.org/job/beam_PerformanceTests_MongoDBIO_IT/ws/src/.test-infra/kubernetes/> create beam-performancetests-mongodbio-it-1921
/tmp/jenkins358847015511210953.sh: line 2: <https://builds.apache.org/job/beam_PerformanceTests_MongoDBIO_IT/ws/src/.test-infra/kubernetes/>: Is a directory
Build step 'Execute shell' marked build as failure

---------------------------------------------------------------------
To unsubscribe, e-mail: builds-unsubscribe@beam.apache.org
For additional commands, e-mail: builds-help@beam.apache.org