You are viewing a plain text version of this content. The canonical link for it is here.
Posted to builds@cassandra.apache.org by Apache Jenkins Server <je...@builds.apache.org> on 2026/03/18 09:13:47 UTC

Build complete: Cassandra-4.1 #641 [UNSTABLE] 1cbdef6272fe18fcd711d93c999b20b544a6b29a

-------------------------------------------------------------------------------
Build Cassandra-4.1 #641 Still Unstable
URL: https://ci-cassandra.apache.org/job/Cassandra-4.1/641/
-------------------------------------------------------------------------------
Changes:
[Michael Semb Wever] Rate limit password changes


-------------------------------------------------------------------------------
Failed Tests:
14 tests failed.
FAILED:  dtest-large-novnode.replication_test.TestSnitchConfigurationUpdate.test_rf_collapse_gossiping_property_file_snitch_multi_dc
FAILED:  dtest-novnode.cql_tracing_test.TestCqlTracing.test_tracing_unknown_impl
FAILED:  dtest-novnode.cql_tracing_test.TestCqlTracing.test_tracing_simple
FAILED:  dtest-novnode.cql_tracing_test.TestCqlTracing.test_tracing_unknown_impl
FAILED:  dtest-novnode.materialized_views_test.TestMaterializedViews.test_view_metadata_cleanup
FAILED:  dtest-novnode.materialized_views_test.TestMaterializedViews.test_drop_table
FAILED:  dtest-upgrade.upgrade_tests.cql_tests.TestCQLNodes2RF1_Upgrade_indev_4_0_x_To_indev_4_1_x.test_range_query_2ndary
FAILED:  dtest-upgrade.upgrade_tests.cql_tests.TestCQLNodes3RF3_Upgrade_indev_4_0_x_To_indev_4_1_x.test_ticket_5230
FAILED:  dtest.materialized_views_test.TestMaterializedViews.test_drop_mv
FAILED:  org.apache.cassandra.distributed.upgrade.CompactStoragePagingWithProtocolV3XTest.testPagingWithCompactStorageMultipleClusterings
FAILED:  org.apache.cassandra.distributed.upgrade.CompactStoragePagingWithProtocolV3XTest.testPagingWithCompactStorageSingleClustering
FAILED:  org.apache.cassandra.distributed.upgrade.CompactStoragePagingWithProtocolV3XTest.testPagingWithCompactStorageWithoutClustering
FAILED:  org.apache.cassandra.auth.CassandraRoleManagerTest.testPasswordUpdateRateLimitingPerRole-cdc
FAILED:  org.apache.cassandra.db.commitlog.CommitLogCQLTest.testSwitchMemtable

-------------------------------------------------------------------------------
For complete test report and logs see https://nightlies.apache.org/cassandra/Cassandra-4.1/641/