You are viewing a plain text version of this content. The canonical link for it is here.
Posted to mapreduce-issues@hadoop.apache.org by "Thomas Graves (Created) (JIRA)" <ji...@apache.org> on 2011/11/11 18:29:52 UTC

[jira] [Created] (MAPREDUCE-3393) TestMRJobs, TestMROldApiJobs, and TestUberAM failures

TestMRJobs, TestMROldApiJobs, and TestUberAM failures
-----------------------------------------------------

                 Key: MAPREDUCE-3393
                 URL: https://issues.apache.org/jira/browse/MAPREDUCE-3393
             Project: Hadoop Map/Reduce
          Issue Type: Bug
          Components: mrv2
    Affects Versions: 0.23.0
            Reporter: Thomas Graves


Check out branch 0.23 and run mvn test from hadoop-mapreduce-project directory

-------------------------------------------------------
 T E S T S
-------------------------------------------------------
Running org.apache.hadoop.mapred.TestClientServiceDelegate
Tests run: 6, Failures: 0, Errors: 0, Skipped: 0, Time elapsed: 5.717 sec
Running org.apache.hadoop.mapred.TestClientRedirect
Tests run: 1, Failures: 0, Errors: 0, Skipped: 0, Time elapsed: 15.436 sec
Running org.apache.hadoop.mapreduce.TestYarnClientProtocolProvider
Tests run: 2, Failures: 0, Errors: 0, Skipped: 0, Time elapsed: 0.975 sec
Running org.apache.hadoop.mapreduce.v2.TestMRJobs
Tests run: 4, Failures: 3, Errors: 1, Skipped: 0, Time elapsed: 67.999 sec <<< FAILURE!
Running org.apache.hadoop.mapreduce.v2.TestYARNRunner
Tests run: 3, Failures: 0, Errors: 0, Skipped: 0, Time elapsed: 11.976 sec
Running org.apache.hadoop.mapreduce.v2.TestMROldApiJobs
Tests run: 2, Failures: 2, Errors: 0, Skipped: 0, Time elapsed: 31.879 sec <<< FAILURE!
Running org.apache.hadoop.mapreduce.v2.TestMRJobsWithHistoryService
^NRunning org.apache.hadoop.mapreduce.v2.TestUberAM
Tests run: 1, Failures: 0, Errors: 1, Skipped: 0, Time elapsed: 101.096 sec <<< FAILURE!

Results :

Failed tests:   testSleepJob(org.apache.hadoop.mapreduce.v2.TestMRJobs)
  testRandomWriter(org.apache.hadoop.mapreduce.v2.TestMRJobs)
  testDistributedCache(org.apache.hadoop.mapreduce.v2.TestMRJobs)
  testJobSucceed(org.apache.hadoop.mapreduce.v2.TestMROldApiJobs): Job expected to succeed failed
  testJobFail(org.apache.hadoop.mapreduce.v2.TestMROldApiJobs)

Tests in error: 
  testFailingMapper(org.apache.hadoop.mapreduce.v2.TestMRJobs): 0
  org.apache.hadoop.mapreduce.v2.TestUberAM: Failed to Start org.apache.hadoop.mapreduce.v2.TestMRJobs

Tests run: 19, Failures: 5, Errors: 2, Skipped: 0

--
This message is automatically generated by JIRA.
If you think it was sent incorrectly, please contact your JIRA administrators: https://issues.apache.org/jira/secure/ContactAdministrators!default.jspa
For more information on JIRA, see: http://www.atlassian.com/software/jira

        

[jira] [Commented] (MAPREDUCE-3393) TestMRJobs, TestMROldApiJobs, and TestUberAM failures

Posted by "Hitesh Shah (Commented) (JIRA)" <ji...@apache.org>.
    [ https://issues.apache.org/jira/browse/MAPREDUCE-3393?page=com.atlassian.jira.plugin.system.issuetabpanels:comment-tabpanel&focusedCommentId=13150868#comment-13150868 ] 

Hitesh Shah commented on MAPREDUCE-3393:
----------------------------------------

@Eric, could you update the test and print out the value of MiniMRYarnCluster.APPJAR and see what is that set to? If it is not set to hadoop-mapreduce-client-app.jar, the patch attached above should help. 
                
> TestMRJobs, TestMROldApiJobs, and TestUberAM failures
> -----------------------------------------------------
>
>                 Key: MAPREDUCE-3393
>                 URL: https://issues.apache.org/jira/browse/MAPREDUCE-3393
>             Project: Hadoop Map/Reduce
>          Issue Type: Bug
>          Components: mrv2
>    Affects Versions: 0.23.0
>            Reporter: Thomas Graves
>            Assignee: Thomas Graves
>         Attachments: MR-3393.1.patch, MR-3393.2.patch, org.apache.hadoop.mapreduce.v2.TestMRJobs-output.txt
>
>
> Check out branch 0.23 and run mvn test from hadoop-mapreduce-project directory
> -------------------------------------------------------
>  T E S T S
> -------------------------------------------------------
> Running org.apache.hadoop.mapred.TestClientServiceDelegate
> Tests run: 6, Failures: 0, Errors: 0, Skipped: 0, Time elapsed: 5.717 sec
> Running org.apache.hadoop.mapred.TestClientRedirect
> Tests run: 1, Failures: 0, Errors: 0, Skipped: 0, Time elapsed: 15.436 sec
> Running org.apache.hadoop.mapreduce.TestYarnClientProtocolProvider
> Tests run: 2, Failures: 0, Errors: 0, Skipped: 0, Time elapsed: 0.975 sec
> Running org.apache.hadoop.mapreduce.v2.TestMRJobs
> Tests run: 4, Failures: 3, Errors: 1, Skipped: 0, Time elapsed: 67.999 sec <<< FAILURE!
> Running org.apache.hadoop.mapreduce.v2.TestYARNRunner
> Tests run: 3, Failures: 0, Errors: 0, Skipped: 0, Time elapsed: 11.976 sec
> Running org.apache.hadoop.mapreduce.v2.TestMROldApiJobs
> Tests run: 2, Failures: 2, Errors: 0, Skipped: 0, Time elapsed: 31.879 sec <<< FAILURE!
> Running org.apache.hadoop.mapreduce.v2.TestMRJobsWithHistoryService
> ^NRunning org.apache.hadoop.mapreduce.v2.TestUberAM
> Tests run: 1, Failures: 0, Errors: 1, Skipped: 0, Time elapsed: 101.096 sec <<< FAILURE!
> Results :
> Failed tests:   testSleepJob(org.apache.hadoop.mapreduce.v2.TestMRJobs)
>   testRandomWriter(org.apache.hadoop.mapreduce.v2.TestMRJobs)
>   testDistributedCache(org.apache.hadoop.mapreduce.v2.TestMRJobs)
>   testJobSucceed(org.apache.hadoop.mapreduce.v2.TestMROldApiJobs): Job expected to succeed failed
>   testJobFail(org.apache.hadoop.mapreduce.v2.TestMROldApiJobs)
> Tests in error: 
>   testFailingMapper(org.apache.hadoop.mapreduce.v2.TestMRJobs): 0
>   org.apache.hadoop.mapreduce.v2.TestUberAM: Failed to Start org.apache.hadoop.mapreduce.v2.TestMRJobs
> Tests run: 19, Failures: 5, Errors: 2, Skipped: 0

--
This message is automatically generated by JIRA.
If you think it was sent incorrectly, please contact your JIRA administrators: https://issues.apache.org/jira/secure/ContactAdministrators!default.jspa
For more information on JIRA, see: http://www.atlassian.com/software/jira

        

[jira] [Updated] (MAPREDUCE-3393) TestMRJobs, TestMROldApiJobs, and TestUberAM failures

Posted by "Thomas Graves (Updated) (JIRA)" <ji...@apache.org>.
     [ https://issues.apache.org/jira/browse/MAPREDUCE-3393?page=com.atlassian.jira.plugin.system.issuetabpanels:all-tabpanel ]

Thomas Graves updated MAPREDUCE-3393:
-------------------------------------

    Attachment: org.apache.hadoop.mapreduce.v2.TestMRJobs-output.txt
    
> TestMRJobs, TestMROldApiJobs, and TestUberAM failures
> -----------------------------------------------------
>
>                 Key: MAPREDUCE-3393
>                 URL: https://issues.apache.org/jira/browse/MAPREDUCE-3393
>             Project: Hadoop Map/Reduce
>          Issue Type: Bug
>          Components: mrv2
>    Affects Versions: 0.23.0
>            Reporter: Thomas Graves
>            Assignee: Hitesh Shah
>         Attachments: MR-3393.1.patch, MR-3393.2.patch, org.apache.hadoop.mapreduce.v2.TestMRJobs-output.txt
>
>
> Check out branch 0.23 and run mvn test from hadoop-mapreduce-project directory
> -------------------------------------------------------
>  T E S T S
> -------------------------------------------------------
> Running org.apache.hadoop.mapred.TestClientServiceDelegate
> Tests run: 6, Failures: 0, Errors: 0, Skipped: 0, Time elapsed: 5.717 sec
> Running org.apache.hadoop.mapred.TestClientRedirect
> Tests run: 1, Failures: 0, Errors: 0, Skipped: 0, Time elapsed: 15.436 sec
> Running org.apache.hadoop.mapreduce.TestYarnClientProtocolProvider
> Tests run: 2, Failures: 0, Errors: 0, Skipped: 0, Time elapsed: 0.975 sec
> Running org.apache.hadoop.mapreduce.v2.TestMRJobs
> Tests run: 4, Failures: 3, Errors: 1, Skipped: 0, Time elapsed: 67.999 sec <<< FAILURE!
> Running org.apache.hadoop.mapreduce.v2.TestYARNRunner
> Tests run: 3, Failures: 0, Errors: 0, Skipped: 0, Time elapsed: 11.976 sec
> Running org.apache.hadoop.mapreduce.v2.TestMROldApiJobs
> Tests run: 2, Failures: 2, Errors: 0, Skipped: 0, Time elapsed: 31.879 sec <<< FAILURE!
> Running org.apache.hadoop.mapreduce.v2.TestMRJobsWithHistoryService
> ^NRunning org.apache.hadoop.mapreduce.v2.TestUberAM
> Tests run: 1, Failures: 0, Errors: 1, Skipped: 0, Time elapsed: 101.096 sec <<< FAILURE!
> Results :
> Failed tests:   testSleepJob(org.apache.hadoop.mapreduce.v2.TestMRJobs)
>   testRandomWriter(org.apache.hadoop.mapreduce.v2.TestMRJobs)
>   testDistributedCache(org.apache.hadoop.mapreduce.v2.TestMRJobs)
>   testJobSucceed(org.apache.hadoop.mapreduce.v2.TestMROldApiJobs): Job expected to succeed failed
>   testJobFail(org.apache.hadoop.mapreduce.v2.TestMROldApiJobs)
> Tests in error: 
>   testFailingMapper(org.apache.hadoop.mapreduce.v2.TestMRJobs): 0
>   org.apache.hadoop.mapreduce.v2.TestUberAM: Failed to Start org.apache.hadoop.mapreduce.v2.TestMRJobs
> Tests run: 19, Failures: 5, Errors: 2, Skipped: 0

--
This message is automatically generated by JIRA.
If you think it was sent incorrectly, please contact your JIRA administrators: https://issues.apache.org/jira/secure/ContactAdministrators!default.jspa
For more information on JIRA, see: http://www.atlassian.com/software/jira

        

[jira] [Commented] (MAPREDUCE-3393) TestMRJobs, TestMROldApiJobs, and TestUberAM failures

Posted by "Thomas Graves (Commented) (JIRA)" <ji...@apache.org>.
    [ https://issues.apache.org/jira/browse/MAPREDUCE-3393?page=com.atlassian.jira.plugin.system.issuetabpanels:comment-tabpanel&focusedCommentId=13148600#comment-13148600 ] 

Thomas Graves commented on MAPREDUCE-3393:
------------------------------------------

Note, these fail on trunk as well as 0.23
                
> TestMRJobs, TestMROldApiJobs, and TestUberAM failures
> -----------------------------------------------------
>
>                 Key: MAPREDUCE-3393
>                 URL: https://issues.apache.org/jira/browse/MAPREDUCE-3393
>             Project: Hadoop Map/Reduce
>          Issue Type: Bug
>          Components: mrv2
>    Affects Versions: 0.23.0
>            Reporter: Thomas Graves
>
> Check out branch 0.23 and run mvn test from hadoop-mapreduce-project directory
> -------------------------------------------------------
>  T E S T S
> -------------------------------------------------------
> Running org.apache.hadoop.mapred.TestClientServiceDelegate
> Tests run: 6, Failures: 0, Errors: 0, Skipped: 0, Time elapsed: 5.717 sec
> Running org.apache.hadoop.mapred.TestClientRedirect
> Tests run: 1, Failures: 0, Errors: 0, Skipped: 0, Time elapsed: 15.436 sec
> Running org.apache.hadoop.mapreduce.TestYarnClientProtocolProvider
> Tests run: 2, Failures: 0, Errors: 0, Skipped: 0, Time elapsed: 0.975 sec
> Running org.apache.hadoop.mapreduce.v2.TestMRJobs
> Tests run: 4, Failures: 3, Errors: 1, Skipped: 0, Time elapsed: 67.999 sec <<< FAILURE!
> Running org.apache.hadoop.mapreduce.v2.TestYARNRunner
> Tests run: 3, Failures: 0, Errors: 0, Skipped: 0, Time elapsed: 11.976 sec
> Running org.apache.hadoop.mapreduce.v2.TestMROldApiJobs
> Tests run: 2, Failures: 2, Errors: 0, Skipped: 0, Time elapsed: 31.879 sec <<< FAILURE!
> Running org.apache.hadoop.mapreduce.v2.TestMRJobsWithHistoryService
> ^NRunning org.apache.hadoop.mapreduce.v2.TestUberAM
> Tests run: 1, Failures: 0, Errors: 1, Skipped: 0, Time elapsed: 101.096 sec <<< FAILURE!
> Results :
> Failed tests:   testSleepJob(org.apache.hadoop.mapreduce.v2.TestMRJobs)
>   testRandomWriter(org.apache.hadoop.mapreduce.v2.TestMRJobs)
>   testDistributedCache(org.apache.hadoop.mapreduce.v2.TestMRJobs)
>   testJobSucceed(org.apache.hadoop.mapreduce.v2.TestMROldApiJobs): Job expected to succeed failed
>   testJobFail(org.apache.hadoop.mapreduce.v2.TestMROldApiJobs)
> Tests in error: 
>   testFailingMapper(org.apache.hadoop.mapreduce.v2.TestMRJobs): 0
>   org.apache.hadoop.mapreduce.v2.TestUberAM: Failed to Start org.apache.hadoop.mapreduce.v2.TestMRJobs
> Tests run: 19, Failures: 5, Errors: 2, Skipped: 0

--
This message is automatically generated by JIRA.
If you think it was sent incorrectly, please contact your JIRA administrators: https://issues.apache.org/jira/secure/ContactAdministrators!default.jspa
For more information on JIRA, see: http://www.atlassian.com/software/jira

        

[jira] [Assigned] (MAPREDUCE-3393) TestMRJobs, TestMROldApiJobs, and TestUberAM failures

Posted by "Hitesh Shah (Assigned) (JIRA)" <ji...@apache.org>.
     [ https://issues.apache.org/jira/browse/MAPREDUCE-3393?page=com.atlassian.jira.plugin.system.issuetabpanels:all-tabpanel ]

Hitesh Shah reassigned MAPREDUCE-3393:
--------------------------------------

    Assignee: Thomas Graves  (was: Hitesh Shah)

Re-assigning back to Thomas to investigate more as not reproducible.
                
> TestMRJobs, TestMROldApiJobs, and TestUberAM failures
> -----------------------------------------------------
>
>                 Key: MAPREDUCE-3393
>                 URL: https://issues.apache.org/jira/browse/MAPREDUCE-3393
>             Project: Hadoop Map/Reduce
>          Issue Type: Bug
>          Components: mrv2
>    Affects Versions: 0.23.0
>            Reporter: Thomas Graves
>            Assignee: Thomas Graves
>         Attachments: MR-3393.1.patch, MR-3393.2.patch, org.apache.hadoop.mapreduce.v2.TestMRJobs-output.txt
>
>
> Check out branch 0.23 and run mvn test from hadoop-mapreduce-project directory
> -------------------------------------------------------
>  T E S T S
> -------------------------------------------------------
> Running org.apache.hadoop.mapred.TestClientServiceDelegate
> Tests run: 6, Failures: 0, Errors: 0, Skipped: 0, Time elapsed: 5.717 sec
> Running org.apache.hadoop.mapred.TestClientRedirect
> Tests run: 1, Failures: 0, Errors: 0, Skipped: 0, Time elapsed: 15.436 sec
> Running org.apache.hadoop.mapreduce.TestYarnClientProtocolProvider
> Tests run: 2, Failures: 0, Errors: 0, Skipped: 0, Time elapsed: 0.975 sec
> Running org.apache.hadoop.mapreduce.v2.TestMRJobs
> Tests run: 4, Failures: 3, Errors: 1, Skipped: 0, Time elapsed: 67.999 sec <<< FAILURE!
> Running org.apache.hadoop.mapreduce.v2.TestYARNRunner
> Tests run: 3, Failures: 0, Errors: 0, Skipped: 0, Time elapsed: 11.976 sec
> Running org.apache.hadoop.mapreduce.v2.TestMROldApiJobs
> Tests run: 2, Failures: 2, Errors: 0, Skipped: 0, Time elapsed: 31.879 sec <<< FAILURE!
> Running org.apache.hadoop.mapreduce.v2.TestMRJobsWithHistoryService
> ^NRunning org.apache.hadoop.mapreduce.v2.TestUberAM
> Tests run: 1, Failures: 0, Errors: 1, Skipped: 0, Time elapsed: 101.096 sec <<< FAILURE!
> Results :
> Failed tests:   testSleepJob(org.apache.hadoop.mapreduce.v2.TestMRJobs)
>   testRandomWriter(org.apache.hadoop.mapreduce.v2.TestMRJobs)
>   testDistributedCache(org.apache.hadoop.mapreduce.v2.TestMRJobs)
>   testJobSucceed(org.apache.hadoop.mapreduce.v2.TestMROldApiJobs): Job expected to succeed failed
>   testJobFail(org.apache.hadoop.mapreduce.v2.TestMROldApiJobs)
> Tests in error: 
>   testFailingMapper(org.apache.hadoop.mapreduce.v2.TestMRJobs): 0
>   org.apache.hadoop.mapreduce.v2.TestUberAM: Failed to Start org.apache.hadoop.mapreduce.v2.TestMRJobs
> Tests run: 19, Failures: 5, Errors: 2, Skipped: 0

--
This message is automatically generated by JIRA.
If you think it was sent incorrectly, please contact your JIRA administrators: https://issues.apache.org/jira/secure/ContactAdministrators!default.jspa
For more information on JIRA, see: http://www.atlassian.com/software/jira

        

[jira] [Commented] (MAPREDUCE-3393) TestMRJobs, TestMROldApiJobs, and TestUberAM failures

Posted by "Hitesh Shah (Commented) (JIRA)" <ji...@apache.org>.
    [ https://issues.apache.org/jira/browse/MAPREDUCE-3393?page=com.atlassian.jira.plugin.system.issuetabpanels:comment-tabpanel&focusedCommentId=13148963#comment-13148963 ] 

Hitesh Shah commented on MAPREDUCE-3393:
----------------------------------------

@Thomas, could you attach the logs from the failed testcase to the jira as I am still not being able to reproduce the issue. 

( If you see the tests failing with the container exiting with 127, you can verify if java_home is indeed the issue by looking at the nm-logs under <dir>/target/<test>/<test>-logDir-nm*/application*/container*/<log file> )
                
> TestMRJobs, TestMROldApiJobs, and TestUberAM failures
> -----------------------------------------------------
>
>                 Key: MAPREDUCE-3393
>                 URL: https://issues.apache.org/jira/browse/MAPREDUCE-3393
>             Project: Hadoop Map/Reduce
>          Issue Type: Bug
>          Components: mrv2
>    Affects Versions: 0.23.0
>            Reporter: Thomas Graves
>            Assignee: Hitesh Shah
>         Attachments: MR-3393.1.patch, MR-3393.2.patch
>
>
> Check out branch 0.23 and run mvn test from hadoop-mapreduce-project directory
> -------------------------------------------------------
>  T E S T S
> -------------------------------------------------------
> Running org.apache.hadoop.mapred.TestClientServiceDelegate
> Tests run: 6, Failures: 0, Errors: 0, Skipped: 0, Time elapsed: 5.717 sec
> Running org.apache.hadoop.mapred.TestClientRedirect
> Tests run: 1, Failures: 0, Errors: 0, Skipped: 0, Time elapsed: 15.436 sec
> Running org.apache.hadoop.mapreduce.TestYarnClientProtocolProvider
> Tests run: 2, Failures: 0, Errors: 0, Skipped: 0, Time elapsed: 0.975 sec
> Running org.apache.hadoop.mapreduce.v2.TestMRJobs
> Tests run: 4, Failures: 3, Errors: 1, Skipped: 0, Time elapsed: 67.999 sec <<< FAILURE!
> Running org.apache.hadoop.mapreduce.v2.TestYARNRunner
> Tests run: 3, Failures: 0, Errors: 0, Skipped: 0, Time elapsed: 11.976 sec
> Running org.apache.hadoop.mapreduce.v2.TestMROldApiJobs
> Tests run: 2, Failures: 2, Errors: 0, Skipped: 0, Time elapsed: 31.879 sec <<< FAILURE!
> Running org.apache.hadoop.mapreduce.v2.TestMRJobsWithHistoryService
> ^NRunning org.apache.hadoop.mapreduce.v2.TestUberAM
> Tests run: 1, Failures: 0, Errors: 1, Skipped: 0, Time elapsed: 101.096 sec <<< FAILURE!
> Results :
> Failed tests:   testSleepJob(org.apache.hadoop.mapreduce.v2.TestMRJobs)
>   testRandomWriter(org.apache.hadoop.mapreduce.v2.TestMRJobs)
>   testDistributedCache(org.apache.hadoop.mapreduce.v2.TestMRJobs)
>   testJobSucceed(org.apache.hadoop.mapreduce.v2.TestMROldApiJobs): Job expected to succeed failed
>   testJobFail(org.apache.hadoop.mapreduce.v2.TestMROldApiJobs)
> Tests in error: 
>   testFailingMapper(org.apache.hadoop.mapreduce.v2.TestMRJobs): 0
>   org.apache.hadoop.mapreduce.v2.TestUberAM: Failed to Start org.apache.hadoop.mapreduce.v2.TestMRJobs
> Tests run: 19, Failures: 5, Errors: 2, Skipped: 0

--
This message is automatically generated by JIRA.
If you think it was sent incorrectly, please contact your JIRA administrators: https://issues.apache.org/jira/secure/ContactAdministrators!default.jspa
For more information on JIRA, see: http://www.atlassian.com/software/jira

        

[jira] [Commented] (MAPREDUCE-3393) TestMRJobs, TestMROldApiJobs, and TestUberAM failures

Posted by "Hitesh Shah (Commented) (JIRA)" <ji...@apache.org>.
    [ https://issues.apache.org/jira/browse/MAPREDUCE-3393?page=com.atlassian.jira.plugin.system.issuetabpanels:comment-tabpanel&focusedCommentId=13151553#comment-13151553 ] 

Hitesh Shah commented on MAPREDUCE-3393:
----------------------------------------

It would be good if we could get to the bottom of the 'address already in use' issue. It is likely getting hidden in successful runs. 
                
> TestMRJobs, TestMROldApiJobs, and TestUberAM failures
> -----------------------------------------------------
>
>                 Key: MAPREDUCE-3393
>                 URL: https://issues.apache.org/jira/browse/MAPREDUCE-3393
>             Project: Hadoop Map/Reduce
>          Issue Type: Bug
>          Components: mrv2
>    Affects Versions: 0.23.0
>            Reporter: Thomas Graves
>            Assignee: Thomas Graves
>         Attachments: MR-3393.1.patch, MR-3393.2.patch, org.apache.hadoop.mapreduce.v2.TestMRJobs-output.txt
>
>
> Check out branch 0.23 and run mvn test from hadoop-mapreduce-project directory
> -------------------------------------------------------
>  T E S T S
> -------------------------------------------------------
> Running org.apache.hadoop.mapred.TestClientServiceDelegate
> Tests run: 6, Failures: 0, Errors: 0, Skipped: 0, Time elapsed: 5.717 sec
> Running org.apache.hadoop.mapred.TestClientRedirect
> Tests run: 1, Failures: 0, Errors: 0, Skipped: 0, Time elapsed: 15.436 sec
> Running org.apache.hadoop.mapreduce.TestYarnClientProtocolProvider
> Tests run: 2, Failures: 0, Errors: 0, Skipped: 0, Time elapsed: 0.975 sec
> Running org.apache.hadoop.mapreduce.v2.TestMRJobs
> Tests run: 4, Failures: 3, Errors: 1, Skipped: 0, Time elapsed: 67.999 sec <<< FAILURE!
> Running org.apache.hadoop.mapreduce.v2.TestYARNRunner
> Tests run: 3, Failures: 0, Errors: 0, Skipped: 0, Time elapsed: 11.976 sec
> Running org.apache.hadoop.mapreduce.v2.TestMROldApiJobs
> Tests run: 2, Failures: 2, Errors: 0, Skipped: 0, Time elapsed: 31.879 sec <<< FAILURE!
> Running org.apache.hadoop.mapreduce.v2.TestMRJobsWithHistoryService
> ^NRunning org.apache.hadoop.mapreduce.v2.TestUberAM
> Tests run: 1, Failures: 0, Errors: 1, Skipped: 0, Time elapsed: 101.096 sec <<< FAILURE!
> Results :
> Failed tests:   testSleepJob(org.apache.hadoop.mapreduce.v2.TestMRJobs)
>   testRandomWriter(org.apache.hadoop.mapreduce.v2.TestMRJobs)
>   testDistributedCache(org.apache.hadoop.mapreduce.v2.TestMRJobs)
>   testJobSucceed(org.apache.hadoop.mapreduce.v2.TestMROldApiJobs): Job expected to succeed failed
>   testJobFail(org.apache.hadoop.mapreduce.v2.TestMROldApiJobs)
> Tests in error: 
>   testFailingMapper(org.apache.hadoop.mapreduce.v2.TestMRJobs): 0
>   org.apache.hadoop.mapreduce.v2.TestUberAM: Failed to Start org.apache.hadoop.mapreduce.v2.TestMRJobs
> Tests run: 19, Failures: 5, Errors: 2, Skipped: 0

--
This message is automatically generated by JIRA.
If you think it was sent incorrectly, please contact your JIRA administrators: https://issues.apache.org/jira/secure/ContactAdministrators!default.jspa
For more information on JIRA, see: http://www.atlassian.com/software/jira

        

[jira] [Updated] (MAPREDUCE-3393) TestMRJobs, TestMROldApiJobs, and TestUberAM failures

Posted by "Hitesh Shah (Updated) (JIRA)" <ji...@apache.org>.
     [ https://issues.apache.org/jira/browse/MAPREDUCE-3393?page=com.atlassian.jira.plugin.system.issuetabpanels:all-tabpanel ]

Hitesh Shah updated MAPREDUCE-3393:
-----------------------------------

    Attachment: MR-3393.2.patch

adding java_home into env settings. 
                
> TestMRJobs, TestMROldApiJobs, and TestUberAM failures
> -----------------------------------------------------
>
>                 Key: MAPREDUCE-3393
>                 URL: https://issues.apache.org/jira/browse/MAPREDUCE-3393
>             Project: Hadoop Map/Reduce
>          Issue Type: Bug
>          Components: mrv2
>    Affects Versions: 0.23.0
>            Reporter: Thomas Graves
>            Assignee: Hitesh Shah
>         Attachments: MR-3393.1.patch, MR-3393.2.patch
>
>
> Check out branch 0.23 and run mvn test from hadoop-mapreduce-project directory
> -------------------------------------------------------
>  T E S T S
> -------------------------------------------------------
> Running org.apache.hadoop.mapred.TestClientServiceDelegate
> Tests run: 6, Failures: 0, Errors: 0, Skipped: 0, Time elapsed: 5.717 sec
> Running org.apache.hadoop.mapred.TestClientRedirect
> Tests run: 1, Failures: 0, Errors: 0, Skipped: 0, Time elapsed: 15.436 sec
> Running org.apache.hadoop.mapreduce.TestYarnClientProtocolProvider
> Tests run: 2, Failures: 0, Errors: 0, Skipped: 0, Time elapsed: 0.975 sec
> Running org.apache.hadoop.mapreduce.v2.TestMRJobs
> Tests run: 4, Failures: 3, Errors: 1, Skipped: 0, Time elapsed: 67.999 sec <<< FAILURE!
> Running org.apache.hadoop.mapreduce.v2.TestYARNRunner
> Tests run: 3, Failures: 0, Errors: 0, Skipped: 0, Time elapsed: 11.976 sec
> Running org.apache.hadoop.mapreduce.v2.TestMROldApiJobs
> Tests run: 2, Failures: 2, Errors: 0, Skipped: 0, Time elapsed: 31.879 sec <<< FAILURE!
> Running org.apache.hadoop.mapreduce.v2.TestMRJobsWithHistoryService
> ^NRunning org.apache.hadoop.mapreduce.v2.TestUberAM
> Tests run: 1, Failures: 0, Errors: 1, Skipped: 0, Time elapsed: 101.096 sec <<< FAILURE!
> Results :
> Failed tests:   testSleepJob(org.apache.hadoop.mapreduce.v2.TestMRJobs)
>   testRandomWriter(org.apache.hadoop.mapreduce.v2.TestMRJobs)
>   testDistributedCache(org.apache.hadoop.mapreduce.v2.TestMRJobs)
>   testJobSucceed(org.apache.hadoop.mapreduce.v2.TestMROldApiJobs): Job expected to succeed failed
>   testJobFail(org.apache.hadoop.mapreduce.v2.TestMROldApiJobs)
> Tests in error: 
>   testFailingMapper(org.apache.hadoop.mapreduce.v2.TestMRJobs): 0
>   org.apache.hadoop.mapreduce.v2.TestUberAM: Failed to Start org.apache.hadoop.mapreduce.v2.TestMRJobs
> Tests run: 19, Failures: 5, Errors: 2, Skipped: 0

--
This message is automatically generated by JIRA.
If you think it was sent incorrectly, please contact your JIRA administrators: https://issues.apache.org/jira/secure/ContactAdministrators!default.jspa
For more information on JIRA, see: http://www.atlassian.com/software/jira

        

[jira] [Resolved] (MAPREDUCE-3393) TestMRJobs, TestMROldApiJobs, and TestUberAM failures

Posted by "Mahadev konar (Resolved) (JIRA)" <ji...@apache.org>.
     [ https://issues.apache.org/jira/browse/MAPREDUCE-3393?page=com.atlassian.jira.plugin.system.issuetabpanels:all-tabpanel ]

Mahadev konar resolved MAPREDUCE-3393.
--------------------------------------

    Resolution: Duplicate
    
> TestMRJobs, TestMROldApiJobs, and TestUberAM failures
> -----------------------------------------------------
>
>                 Key: MAPREDUCE-3393
>                 URL: https://issues.apache.org/jira/browse/MAPREDUCE-3393
>             Project: Hadoop Map/Reduce
>          Issue Type: Bug
>          Components: mrv2
>    Affects Versions: 0.23.0
>            Reporter: Thomas Graves
>            Assignee: Thomas Graves
>         Attachments: MR-3393.1.patch, MR-3393.2.patch, org.apache.hadoop.mapreduce.v2.TestMRJobs-output.txt
>
>
> Check out branch 0.23 and run mvn test from hadoop-mapreduce-project directory
> -------------------------------------------------------
>  T E S T S
> -------------------------------------------------------
> Running org.apache.hadoop.mapred.TestClientServiceDelegate
> Tests run: 6, Failures: 0, Errors: 0, Skipped: 0, Time elapsed: 5.717 sec
> Running org.apache.hadoop.mapred.TestClientRedirect
> Tests run: 1, Failures: 0, Errors: 0, Skipped: 0, Time elapsed: 15.436 sec
> Running org.apache.hadoop.mapreduce.TestYarnClientProtocolProvider
> Tests run: 2, Failures: 0, Errors: 0, Skipped: 0, Time elapsed: 0.975 sec
> Running org.apache.hadoop.mapreduce.v2.TestMRJobs
> Tests run: 4, Failures: 3, Errors: 1, Skipped: 0, Time elapsed: 67.999 sec <<< FAILURE!
> Running org.apache.hadoop.mapreduce.v2.TestYARNRunner
> Tests run: 3, Failures: 0, Errors: 0, Skipped: 0, Time elapsed: 11.976 sec
> Running org.apache.hadoop.mapreduce.v2.TestMROldApiJobs
> Tests run: 2, Failures: 2, Errors: 0, Skipped: 0, Time elapsed: 31.879 sec <<< FAILURE!
> Running org.apache.hadoop.mapreduce.v2.TestMRJobsWithHistoryService
> ^NRunning org.apache.hadoop.mapreduce.v2.TestUberAM
> Tests run: 1, Failures: 0, Errors: 1, Skipped: 0, Time elapsed: 101.096 sec <<< FAILURE!
> Results :
> Failed tests:   testSleepJob(org.apache.hadoop.mapreduce.v2.TestMRJobs)
>   testRandomWriter(org.apache.hadoop.mapreduce.v2.TestMRJobs)
>   testDistributedCache(org.apache.hadoop.mapreduce.v2.TestMRJobs)
>   testJobSucceed(org.apache.hadoop.mapreduce.v2.TestMROldApiJobs): Job expected to succeed failed
>   testJobFail(org.apache.hadoop.mapreduce.v2.TestMROldApiJobs)
> Tests in error: 
>   testFailingMapper(org.apache.hadoop.mapreduce.v2.TestMRJobs): 0
>   org.apache.hadoop.mapreduce.v2.TestUberAM: Failed to Start org.apache.hadoop.mapreduce.v2.TestMRJobs
> Tests run: 19, Failures: 5, Errors: 2, Skipped: 0

--
This message is automatically generated by JIRA.
If you think it was sent incorrectly, please contact your JIRA administrators: https://issues.apache.org/jira/secure/ContactAdministrators!default.jspa
For more information on JIRA, see: http://www.atlassian.com/software/jira

        

[jira] [Commented] (MAPREDUCE-3393) TestMRJobs, TestMROldApiJobs, and TestUberAM failures

Posted by "Eric Payne (Commented) (JIRA)" <ji...@apache.org>.
    [ https://issues.apache.org/jira/browse/MAPREDUCE-3393?page=com.atlassian.jira.plugin.system.issuetabpanels:comment-tabpanel&focusedCommentId=13150880#comment-13150880 ] 

Eric Payne commented on MAPREDUCE-3393:
---------------------------------------

@Hitesh,
MiniMRYarnCluster.APPJAR has the value of $HADOOP_SOURCE_ROOT/hadoop-mapreduce-project/hadoop-mapreduce-client/hadoop-mapreduce-client-jobclient/target/hadoop-mapreduce-client-jobclient-0.23.0-SNAPSHOT.jar
                
> TestMRJobs, TestMROldApiJobs, and TestUberAM failures
> -----------------------------------------------------
>
>                 Key: MAPREDUCE-3393
>                 URL: https://issues.apache.org/jira/browse/MAPREDUCE-3393
>             Project: Hadoop Map/Reduce
>          Issue Type: Bug
>          Components: mrv2
>    Affects Versions: 0.23.0
>            Reporter: Thomas Graves
>            Assignee: Thomas Graves
>         Attachments: MR-3393.1.patch, MR-3393.2.patch, org.apache.hadoop.mapreduce.v2.TestMRJobs-output.txt
>
>
> Check out branch 0.23 and run mvn test from hadoop-mapreduce-project directory
> -------------------------------------------------------
>  T E S T S
> -------------------------------------------------------
> Running org.apache.hadoop.mapred.TestClientServiceDelegate
> Tests run: 6, Failures: 0, Errors: 0, Skipped: 0, Time elapsed: 5.717 sec
> Running org.apache.hadoop.mapred.TestClientRedirect
> Tests run: 1, Failures: 0, Errors: 0, Skipped: 0, Time elapsed: 15.436 sec
> Running org.apache.hadoop.mapreduce.TestYarnClientProtocolProvider
> Tests run: 2, Failures: 0, Errors: 0, Skipped: 0, Time elapsed: 0.975 sec
> Running org.apache.hadoop.mapreduce.v2.TestMRJobs
> Tests run: 4, Failures: 3, Errors: 1, Skipped: 0, Time elapsed: 67.999 sec <<< FAILURE!
> Running org.apache.hadoop.mapreduce.v2.TestYARNRunner
> Tests run: 3, Failures: 0, Errors: 0, Skipped: 0, Time elapsed: 11.976 sec
> Running org.apache.hadoop.mapreduce.v2.TestMROldApiJobs
> Tests run: 2, Failures: 2, Errors: 0, Skipped: 0, Time elapsed: 31.879 sec <<< FAILURE!
> Running org.apache.hadoop.mapreduce.v2.TestMRJobsWithHistoryService
> ^NRunning org.apache.hadoop.mapreduce.v2.TestUberAM
> Tests run: 1, Failures: 0, Errors: 1, Skipped: 0, Time elapsed: 101.096 sec <<< FAILURE!
> Results :
> Failed tests:   testSleepJob(org.apache.hadoop.mapreduce.v2.TestMRJobs)
>   testRandomWriter(org.apache.hadoop.mapreduce.v2.TestMRJobs)
>   testDistributedCache(org.apache.hadoop.mapreduce.v2.TestMRJobs)
>   testJobSucceed(org.apache.hadoop.mapreduce.v2.TestMROldApiJobs): Job expected to succeed failed
>   testJobFail(org.apache.hadoop.mapreduce.v2.TestMROldApiJobs)
> Tests in error: 
>   testFailingMapper(org.apache.hadoop.mapreduce.v2.TestMRJobs): 0
>   org.apache.hadoop.mapreduce.v2.TestUberAM: Failed to Start org.apache.hadoop.mapreduce.v2.TestMRJobs
> Tests run: 19, Failures: 5, Errors: 2, Skipped: 0

--
This message is automatically generated by JIRA.
If you think it was sent incorrectly, please contact your JIRA administrators: https://issues.apache.org/jira/secure/ContactAdministrators!default.jspa
For more information on JIRA, see: http://www.atlassian.com/software/jira

        

[jira] [Updated] (MAPREDUCE-3393) TestMRJobs, TestMROldApiJobs, and TestUberAM failures

Posted by "Hitesh Shah (Updated) (JIRA)" <ji...@apache.org>.
     [ https://issues.apache.org/jira/browse/MAPREDUCE-3393?page=com.atlassian.jira.plugin.system.issuetabpanels:all-tabpanel ]

Hitesh Shah updated MAPREDUCE-3393:
-----------------------------------

    Attachment: MR-3393.1.patch

Part 1 of the final patch: 
  - the system property setting for path to app jar is being set incorrect to jobclient.jar instead of mr-client-app.jar. 

Builds currently are effectively broken as the tests are silently failing as the appropriate jar cannot be found. 
                
> TestMRJobs, TestMROldApiJobs, and TestUberAM failures
> -----------------------------------------------------
>
>                 Key: MAPREDUCE-3393
>                 URL: https://issues.apache.org/jira/browse/MAPREDUCE-3393
>             Project: Hadoop Map/Reduce
>          Issue Type: Bug
>          Components: mrv2
>    Affects Versions: 0.23.0
>            Reporter: Thomas Graves
>         Attachments: MR-3393.1.patch
>
>
> Check out branch 0.23 and run mvn test from hadoop-mapreduce-project directory
> -------------------------------------------------------
>  T E S T S
> -------------------------------------------------------
> Running org.apache.hadoop.mapred.TestClientServiceDelegate
> Tests run: 6, Failures: 0, Errors: 0, Skipped: 0, Time elapsed: 5.717 sec
> Running org.apache.hadoop.mapred.TestClientRedirect
> Tests run: 1, Failures: 0, Errors: 0, Skipped: 0, Time elapsed: 15.436 sec
> Running org.apache.hadoop.mapreduce.TestYarnClientProtocolProvider
> Tests run: 2, Failures: 0, Errors: 0, Skipped: 0, Time elapsed: 0.975 sec
> Running org.apache.hadoop.mapreduce.v2.TestMRJobs
> Tests run: 4, Failures: 3, Errors: 1, Skipped: 0, Time elapsed: 67.999 sec <<< FAILURE!
> Running org.apache.hadoop.mapreduce.v2.TestYARNRunner
> Tests run: 3, Failures: 0, Errors: 0, Skipped: 0, Time elapsed: 11.976 sec
> Running org.apache.hadoop.mapreduce.v2.TestMROldApiJobs
> Tests run: 2, Failures: 2, Errors: 0, Skipped: 0, Time elapsed: 31.879 sec <<< FAILURE!
> Running org.apache.hadoop.mapreduce.v2.TestMRJobsWithHistoryService
> ^NRunning org.apache.hadoop.mapreduce.v2.TestUberAM
> Tests run: 1, Failures: 0, Errors: 1, Skipped: 0, Time elapsed: 101.096 sec <<< FAILURE!
> Results :
> Failed tests:   testSleepJob(org.apache.hadoop.mapreduce.v2.TestMRJobs)
>   testRandomWriter(org.apache.hadoop.mapreduce.v2.TestMRJobs)
>   testDistributedCache(org.apache.hadoop.mapreduce.v2.TestMRJobs)
>   testJobSucceed(org.apache.hadoop.mapreduce.v2.TestMROldApiJobs): Job expected to succeed failed
>   testJobFail(org.apache.hadoop.mapreduce.v2.TestMROldApiJobs)
> Tests in error: 
>   testFailingMapper(org.apache.hadoop.mapreduce.v2.TestMRJobs): 0
>   org.apache.hadoop.mapreduce.v2.TestUberAM: Failed to Start org.apache.hadoop.mapreduce.v2.TestMRJobs
> Tests run: 19, Failures: 5, Errors: 2, Skipped: 0

--
This message is automatically generated by JIRA.
If you think it was sent incorrectly, please contact your JIRA administrators: https://issues.apache.org/jira/secure/ContactAdministrators!default.jspa
For more information on JIRA, see: http://www.atlassian.com/software/jira

        

[jira] [Commented] (MAPREDUCE-3393) TestMRJobs, TestMROldApiJobs, and TestUberAM failures

Posted by "Eric Payne (Commented) (JIRA)" <ji...@apache.org>.
    [ https://issues.apache.org/jira/browse/MAPREDUCE-3393?page=com.atlassian.jira.plugin.system.issuetabpanels:comment-tabpanel&focusedCommentId=13151364#comment-13151364 ] 

Eric Payne commented on MAPREDUCE-3393:
---------------------------------------

With the attached patch, I no longer see any failures in the hadoop-mapreduce-project project.
                
> TestMRJobs, TestMROldApiJobs, and TestUberAM failures
> -----------------------------------------------------
>
>                 Key: MAPREDUCE-3393
>                 URL: https://issues.apache.org/jira/browse/MAPREDUCE-3393
>             Project: Hadoop Map/Reduce
>          Issue Type: Bug
>          Components: mrv2
>    Affects Versions: 0.23.0
>            Reporter: Thomas Graves
>            Assignee: Thomas Graves
>         Attachments: MR-3393.1.patch, MR-3393.2.patch, org.apache.hadoop.mapreduce.v2.TestMRJobs-output.txt
>
>
> Check out branch 0.23 and run mvn test from hadoop-mapreduce-project directory
> -------------------------------------------------------
>  T E S T S
> -------------------------------------------------------
> Running org.apache.hadoop.mapred.TestClientServiceDelegate
> Tests run: 6, Failures: 0, Errors: 0, Skipped: 0, Time elapsed: 5.717 sec
> Running org.apache.hadoop.mapred.TestClientRedirect
> Tests run: 1, Failures: 0, Errors: 0, Skipped: 0, Time elapsed: 15.436 sec
> Running org.apache.hadoop.mapreduce.TestYarnClientProtocolProvider
> Tests run: 2, Failures: 0, Errors: 0, Skipped: 0, Time elapsed: 0.975 sec
> Running org.apache.hadoop.mapreduce.v2.TestMRJobs
> Tests run: 4, Failures: 3, Errors: 1, Skipped: 0, Time elapsed: 67.999 sec <<< FAILURE!
> Running org.apache.hadoop.mapreduce.v2.TestYARNRunner
> Tests run: 3, Failures: 0, Errors: 0, Skipped: 0, Time elapsed: 11.976 sec
> Running org.apache.hadoop.mapreduce.v2.TestMROldApiJobs
> Tests run: 2, Failures: 2, Errors: 0, Skipped: 0, Time elapsed: 31.879 sec <<< FAILURE!
> Running org.apache.hadoop.mapreduce.v2.TestMRJobsWithHistoryService
> ^NRunning org.apache.hadoop.mapreduce.v2.TestUberAM
> Tests run: 1, Failures: 0, Errors: 1, Skipped: 0, Time elapsed: 101.096 sec <<< FAILURE!
> Results :
> Failed tests:   testSleepJob(org.apache.hadoop.mapreduce.v2.TestMRJobs)
>   testRandomWriter(org.apache.hadoop.mapreduce.v2.TestMRJobs)
>   testDistributedCache(org.apache.hadoop.mapreduce.v2.TestMRJobs)
>   testJobSucceed(org.apache.hadoop.mapreduce.v2.TestMROldApiJobs): Job expected to succeed failed
>   testJobFail(org.apache.hadoop.mapreduce.v2.TestMROldApiJobs)
> Tests in error: 
>   testFailingMapper(org.apache.hadoop.mapreduce.v2.TestMRJobs): 0
>   org.apache.hadoop.mapreduce.v2.TestUberAM: Failed to Start org.apache.hadoop.mapreduce.v2.TestMRJobs
> Tests run: 19, Failures: 5, Errors: 2, Skipped: 0

--
This message is automatically generated by JIRA.
If you think it was sent incorrectly, please contact your JIRA administrators: https://issues.apache.org/jira/secure/ContactAdministrators!default.jspa
For more information on JIRA, see: http://www.atlassian.com/software/jira

        

[jira] [Updated] (MAPREDUCE-3393) TestMRJobs, TestMROldApiJobs, and TestUberAM failures

Posted by "Thomas Graves (Updated) (JIRA)" <ji...@apache.org>.
     [ https://issues.apache.org/jira/browse/MAPREDUCE-3393?page=com.atlassian.jira.plugin.system.issuetabpanels:all-tabpanel ]

Thomas Graves updated MAPREDUCE-3393:
-------------------------------------

    Target Version/s: 0.23.1
    
> TestMRJobs, TestMROldApiJobs, and TestUberAM failures
> -----------------------------------------------------
>
>                 Key: MAPREDUCE-3393
>                 URL: https://issues.apache.org/jira/browse/MAPREDUCE-3393
>             Project: Hadoop Map/Reduce
>          Issue Type: Bug
>          Components: mrv2
>    Affects Versions: 0.23.0
>            Reporter: Thomas Graves
>
> Check out branch 0.23 and run mvn test from hadoop-mapreduce-project directory
> -------------------------------------------------------
>  T E S T S
> -------------------------------------------------------
> Running org.apache.hadoop.mapred.TestClientServiceDelegate
> Tests run: 6, Failures: 0, Errors: 0, Skipped: 0, Time elapsed: 5.717 sec
> Running org.apache.hadoop.mapred.TestClientRedirect
> Tests run: 1, Failures: 0, Errors: 0, Skipped: 0, Time elapsed: 15.436 sec
> Running org.apache.hadoop.mapreduce.TestYarnClientProtocolProvider
> Tests run: 2, Failures: 0, Errors: 0, Skipped: 0, Time elapsed: 0.975 sec
> Running org.apache.hadoop.mapreduce.v2.TestMRJobs
> Tests run: 4, Failures: 3, Errors: 1, Skipped: 0, Time elapsed: 67.999 sec <<< FAILURE!
> Running org.apache.hadoop.mapreduce.v2.TestYARNRunner
> Tests run: 3, Failures: 0, Errors: 0, Skipped: 0, Time elapsed: 11.976 sec
> Running org.apache.hadoop.mapreduce.v2.TestMROldApiJobs
> Tests run: 2, Failures: 2, Errors: 0, Skipped: 0, Time elapsed: 31.879 sec <<< FAILURE!
> Running org.apache.hadoop.mapreduce.v2.TestMRJobsWithHistoryService
> ^NRunning org.apache.hadoop.mapreduce.v2.TestUberAM
> Tests run: 1, Failures: 0, Errors: 1, Skipped: 0, Time elapsed: 101.096 sec <<< FAILURE!
> Results :
> Failed tests:   testSleepJob(org.apache.hadoop.mapreduce.v2.TestMRJobs)
>   testRandomWriter(org.apache.hadoop.mapreduce.v2.TestMRJobs)
>   testDistributedCache(org.apache.hadoop.mapreduce.v2.TestMRJobs)
>   testJobSucceed(org.apache.hadoop.mapreduce.v2.TestMROldApiJobs): Job expected to succeed failed
>   testJobFail(org.apache.hadoop.mapreduce.v2.TestMROldApiJobs)
> Tests in error: 
>   testFailingMapper(org.apache.hadoop.mapreduce.v2.TestMRJobs): 0
>   org.apache.hadoop.mapreduce.v2.TestUberAM: Failed to Start org.apache.hadoop.mapreduce.v2.TestMRJobs
> Tests run: 19, Failures: 5, Errors: 2, Skipped: 0

--
This message is automatically generated by JIRA.
If you think it was sent incorrectly, please contact your JIRA administrators: https://issues.apache.org/jira/secure/ContactAdministrators!default.jspa
For more information on JIRA, see: http://www.atlassian.com/software/jira

        

[jira] [Commented] (MAPREDUCE-3393) TestMRJobs, TestMROldApiJobs, and TestUberAM failures

Posted by "Eric Payne (Commented) (JIRA)" <ji...@apache.org>.
    [ https://issues.apache.org/jira/browse/MAPREDUCE-3393?page=com.atlassian.jira.plugin.system.issuetabpanels:comment-tabpanel&focusedCommentId=13150865#comment-13150865 ] 

Eric Payne commented on MAPREDUCE-3393:
---------------------------------------

Just a few updates:

# For the error: 'Problem binding to [0.0.0.0:8025] java.net.BindException: Address already in use; For more details see'
One of the tests in hadoop-mapreduce-client-jobclient seems to be hanging around after it is done. It hangs on to port 8025 so later tests can't bind to that port.
# For the TestMROldApiJobs failure ({{mvn -Dtest=TestMROldApiJobs test}}):
I can consistently reproduce this one, even if I run only that test. It is getting a ClassNotFoundException:
{noformat}
Exception in thread "main" java.lang.NoClassDefFoundError: org/apache/hadoop/mapreduce/v2/app/MRAppMaster
Caused by: java.lang.ClassNotFoundException: org.apache.hadoop.mapreduce.v2.app.MRAppMaster
        at java.net.URLClassLoader$1.run(URLClassLoader.java:200)
        at java.security.AccessController.doPrivileged(Native Method)
        at java.net.URLClassLoader.findClass(URLClassLoader.java:188)
        at java.lang.ClassLoader.loadClass(ClassLoader.java:307)
        at sun.misc.Launcher$AppClassLoader.loadClass(Launcher.java:301)
        at java.lang.ClassLoader.loadClass(ClassLoader.java:252)
        at java.lang.ClassLoader.loadClassInternal(ClassLoader.java:320)
Could not find the main class: org.apache.hadoop.mapreduce.v2.app.MRAppMaster.  Program will exit.
{noformat}
In order to view the above output, I had to find the {{stderr}} file for the application container that failed during the unit test.

                
> TestMRJobs, TestMROldApiJobs, and TestUberAM failures
> -----------------------------------------------------
>
>                 Key: MAPREDUCE-3393
>                 URL: https://issues.apache.org/jira/browse/MAPREDUCE-3393
>             Project: Hadoop Map/Reduce
>          Issue Type: Bug
>          Components: mrv2
>    Affects Versions: 0.23.0
>            Reporter: Thomas Graves
>            Assignee: Thomas Graves
>         Attachments: MR-3393.1.patch, MR-3393.2.patch, org.apache.hadoop.mapreduce.v2.TestMRJobs-output.txt
>
>
> Check out branch 0.23 and run mvn test from hadoop-mapreduce-project directory
> -------------------------------------------------------
>  T E S T S
> -------------------------------------------------------
> Running org.apache.hadoop.mapred.TestClientServiceDelegate
> Tests run: 6, Failures: 0, Errors: 0, Skipped: 0, Time elapsed: 5.717 sec
> Running org.apache.hadoop.mapred.TestClientRedirect
> Tests run: 1, Failures: 0, Errors: 0, Skipped: 0, Time elapsed: 15.436 sec
> Running org.apache.hadoop.mapreduce.TestYarnClientProtocolProvider
> Tests run: 2, Failures: 0, Errors: 0, Skipped: 0, Time elapsed: 0.975 sec
> Running org.apache.hadoop.mapreduce.v2.TestMRJobs
> Tests run: 4, Failures: 3, Errors: 1, Skipped: 0, Time elapsed: 67.999 sec <<< FAILURE!
> Running org.apache.hadoop.mapreduce.v2.TestYARNRunner
> Tests run: 3, Failures: 0, Errors: 0, Skipped: 0, Time elapsed: 11.976 sec
> Running org.apache.hadoop.mapreduce.v2.TestMROldApiJobs
> Tests run: 2, Failures: 2, Errors: 0, Skipped: 0, Time elapsed: 31.879 sec <<< FAILURE!
> Running org.apache.hadoop.mapreduce.v2.TestMRJobsWithHistoryService
> ^NRunning org.apache.hadoop.mapreduce.v2.TestUberAM
> Tests run: 1, Failures: 0, Errors: 1, Skipped: 0, Time elapsed: 101.096 sec <<< FAILURE!
> Results :
> Failed tests:   testSleepJob(org.apache.hadoop.mapreduce.v2.TestMRJobs)
>   testRandomWriter(org.apache.hadoop.mapreduce.v2.TestMRJobs)
>   testDistributedCache(org.apache.hadoop.mapreduce.v2.TestMRJobs)
>   testJobSucceed(org.apache.hadoop.mapreduce.v2.TestMROldApiJobs): Job expected to succeed failed
>   testJobFail(org.apache.hadoop.mapreduce.v2.TestMROldApiJobs)
> Tests in error: 
>   testFailingMapper(org.apache.hadoop.mapreduce.v2.TestMRJobs): 0
>   org.apache.hadoop.mapreduce.v2.TestUberAM: Failed to Start org.apache.hadoop.mapreduce.v2.TestMRJobs
> Tests run: 19, Failures: 5, Errors: 2, Skipped: 0

--
This message is automatically generated by JIRA.
If you think it was sent incorrectly, please contact your JIRA administrators: https://issues.apache.org/jira/secure/ContactAdministrators!default.jspa
For more information on JIRA, see: http://www.atlassian.com/software/jira

        

[jira] [Commented] (MAPREDUCE-3393) TestMRJobs, TestMROldApiJobs, and TestUberAM failures

Posted by "Hitesh Shah (Commented) (JIRA)" <ji...@apache.org>.
    [ https://issues.apache.org/jira/browse/MAPREDUCE-3393?page=com.atlassian.jira.plugin.system.issuetabpanels:comment-tabpanel&focusedCommentId=13149844#comment-13149844 ] 

Hitesh Shah commented on MAPREDUCE-3393:
----------------------------------------

@Thomas, sorry for the delay in getting back to you. Re-ran multiple times both on local mac laptop as well as a linux host ( as order of tests sometimes differ). All tests are simply mvn test install from the top of hadoop-mapreduce-project and go through across multiple runs. 
                
> TestMRJobs, TestMROldApiJobs, and TestUberAM failures
> -----------------------------------------------------
>
>                 Key: MAPREDUCE-3393
>                 URL: https://issues.apache.org/jira/browse/MAPREDUCE-3393
>             Project: Hadoop Map/Reduce
>          Issue Type: Bug
>          Components: mrv2
>    Affects Versions: 0.23.0
>            Reporter: Thomas Graves
>            Assignee: Hitesh Shah
>         Attachments: MR-3393.1.patch, MR-3393.2.patch, org.apache.hadoop.mapreduce.v2.TestMRJobs-output.txt
>
>
> Check out branch 0.23 and run mvn test from hadoop-mapreduce-project directory
> -------------------------------------------------------
>  T E S T S
> -------------------------------------------------------
> Running org.apache.hadoop.mapred.TestClientServiceDelegate
> Tests run: 6, Failures: 0, Errors: 0, Skipped: 0, Time elapsed: 5.717 sec
> Running org.apache.hadoop.mapred.TestClientRedirect
> Tests run: 1, Failures: 0, Errors: 0, Skipped: 0, Time elapsed: 15.436 sec
> Running org.apache.hadoop.mapreduce.TestYarnClientProtocolProvider
> Tests run: 2, Failures: 0, Errors: 0, Skipped: 0, Time elapsed: 0.975 sec
> Running org.apache.hadoop.mapreduce.v2.TestMRJobs
> Tests run: 4, Failures: 3, Errors: 1, Skipped: 0, Time elapsed: 67.999 sec <<< FAILURE!
> Running org.apache.hadoop.mapreduce.v2.TestYARNRunner
> Tests run: 3, Failures: 0, Errors: 0, Skipped: 0, Time elapsed: 11.976 sec
> Running org.apache.hadoop.mapreduce.v2.TestMROldApiJobs
> Tests run: 2, Failures: 2, Errors: 0, Skipped: 0, Time elapsed: 31.879 sec <<< FAILURE!
> Running org.apache.hadoop.mapreduce.v2.TestMRJobsWithHistoryService
> ^NRunning org.apache.hadoop.mapreduce.v2.TestUberAM
> Tests run: 1, Failures: 0, Errors: 1, Skipped: 0, Time elapsed: 101.096 sec <<< FAILURE!
> Results :
> Failed tests:   testSleepJob(org.apache.hadoop.mapreduce.v2.TestMRJobs)
>   testRandomWriter(org.apache.hadoop.mapreduce.v2.TestMRJobs)
>   testDistributedCache(org.apache.hadoop.mapreduce.v2.TestMRJobs)
>   testJobSucceed(org.apache.hadoop.mapreduce.v2.TestMROldApiJobs): Job expected to succeed failed
>   testJobFail(org.apache.hadoop.mapreduce.v2.TestMROldApiJobs)
> Tests in error: 
>   testFailingMapper(org.apache.hadoop.mapreduce.v2.TestMRJobs): 0
>   org.apache.hadoop.mapreduce.v2.TestUberAM: Failed to Start org.apache.hadoop.mapreduce.v2.TestMRJobs
> Tests run: 19, Failures: 5, Errors: 2, Skipped: 0

--
This message is automatically generated by JIRA.
If you think it was sent incorrectly, please contact your JIRA administrators: https://issues.apache.org/jira/secure/ContactAdministrators!default.jspa
For more information on JIRA, see: http://www.atlassian.com/software/jira

        

[jira] [Commented] (MAPREDUCE-3393) TestMRJobs, TestMROldApiJobs, and TestUberAM failures

Posted by "Hitesh Shah (Commented) (JIRA)" <ji...@apache.org>.
    [ https://issues.apache.org/jira/browse/MAPREDUCE-3393?page=com.atlassian.jira.plugin.system.issuetabpanels:comment-tabpanel&focusedCommentId=13150900#comment-13150900 ] 

Hitesh Shah commented on MAPREDUCE-3393:
----------------------------------------

Created MAPREDUCE-3407 to address the pom issue for the wrong jar value. Leaving this jar open to address the underlying test cleanup issues. 
                
> TestMRJobs, TestMROldApiJobs, and TestUberAM failures
> -----------------------------------------------------
>
>                 Key: MAPREDUCE-3393
>                 URL: https://issues.apache.org/jira/browse/MAPREDUCE-3393
>             Project: Hadoop Map/Reduce
>          Issue Type: Bug
>          Components: mrv2
>    Affects Versions: 0.23.0
>            Reporter: Thomas Graves
>            Assignee: Thomas Graves
>         Attachments: MR-3393.1.patch, MR-3393.2.patch, org.apache.hadoop.mapreduce.v2.TestMRJobs-output.txt
>
>
> Check out branch 0.23 and run mvn test from hadoop-mapreduce-project directory
> -------------------------------------------------------
>  T E S T S
> -------------------------------------------------------
> Running org.apache.hadoop.mapred.TestClientServiceDelegate
> Tests run: 6, Failures: 0, Errors: 0, Skipped: 0, Time elapsed: 5.717 sec
> Running org.apache.hadoop.mapred.TestClientRedirect
> Tests run: 1, Failures: 0, Errors: 0, Skipped: 0, Time elapsed: 15.436 sec
> Running org.apache.hadoop.mapreduce.TestYarnClientProtocolProvider
> Tests run: 2, Failures: 0, Errors: 0, Skipped: 0, Time elapsed: 0.975 sec
> Running org.apache.hadoop.mapreduce.v2.TestMRJobs
> Tests run: 4, Failures: 3, Errors: 1, Skipped: 0, Time elapsed: 67.999 sec <<< FAILURE!
> Running org.apache.hadoop.mapreduce.v2.TestYARNRunner
> Tests run: 3, Failures: 0, Errors: 0, Skipped: 0, Time elapsed: 11.976 sec
> Running org.apache.hadoop.mapreduce.v2.TestMROldApiJobs
> Tests run: 2, Failures: 2, Errors: 0, Skipped: 0, Time elapsed: 31.879 sec <<< FAILURE!
> Running org.apache.hadoop.mapreduce.v2.TestMRJobsWithHistoryService
> ^NRunning org.apache.hadoop.mapreduce.v2.TestUberAM
> Tests run: 1, Failures: 0, Errors: 1, Skipped: 0, Time elapsed: 101.096 sec <<< FAILURE!
> Results :
> Failed tests:   testSleepJob(org.apache.hadoop.mapreduce.v2.TestMRJobs)
>   testRandomWriter(org.apache.hadoop.mapreduce.v2.TestMRJobs)
>   testDistributedCache(org.apache.hadoop.mapreduce.v2.TestMRJobs)
>   testJobSucceed(org.apache.hadoop.mapreduce.v2.TestMROldApiJobs): Job expected to succeed failed
>   testJobFail(org.apache.hadoop.mapreduce.v2.TestMROldApiJobs)
> Tests in error: 
>   testFailingMapper(org.apache.hadoop.mapreduce.v2.TestMRJobs): 0
>   org.apache.hadoop.mapreduce.v2.TestUberAM: Failed to Start org.apache.hadoop.mapreduce.v2.TestMRJobs
> Tests run: 19, Failures: 5, Errors: 2, Skipped: 0

--
This message is automatically generated by JIRA.
If you think it was sent incorrectly, please contact your JIRA administrators: https://issues.apache.org/jira/secure/ContactAdministrators!default.jspa
For more information on JIRA, see: http://www.atlassian.com/software/jira

        

[jira] [Commented] (MAPREDUCE-3393) TestMRJobs, TestMROldApiJobs, and TestUberAM failures

Posted by "Thomas Graves (Commented) (JIRA)" <ji...@apache.org>.
    [ https://issues.apache.org/jira/browse/MAPREDUCE-3393?page=com.atlassian.jira.plugin.system.issuetabpanels:comment-tabpanel&focusedCommentId=13149072#comment-13149072 ] 

Thomas Graves commented on MAPREDUCE-3393:
------------------------------------------

yes JAVA_HOME is set.  Did you run them individually or all the tests?  Sorry I should have said this originally - they only fail when run them all together. I could not get them to fail when run individually. I'll attach logs.
                
> TestMRJobs, TestMROldApiJobs, and TestUberAM failures
> -----------------------------------------------------
>
>                 Key: MAPREDUCE-3393
>                 URL: https://issues.apache.org/jira/browse/MAPREDUCE-3393
>             Project: Hadoop Map/Reduce
>          Issue Type: Bug
>          Components: mrv2
>    Affects Versions: 0.23.0
>            Reporter: Thomas Graves
>            Assignee: Hitesh Shah
>         Attachments: MR-3393.1.patch, MR-3393.2.patch
>
>
> Check out branch 0.23 and run mvn test from hadoop-mapreduce-project directory
> -------------------------------------------------------
>  T E S T S
> -------------------------------------------------------
> Running org.apache.hadoop.mapred.TestClientServiceDelegate
> Tests run: 6, Failures: 0, Errors: 0, Skipped: 0, Time elapsed: 5.717 sec
> Running org.apache.hadoop.mapred.TestClientRedirect
> Tests run: 1, Failures: 0, Errors: 0, Skipped: 0, Time elapsed: 15.436 sec
> Running org.apache.hadoop.mapreduce.TestYarnClientProtocolProvider
> Tests run: 2, Failures: 0, Errors: 0, Skipped: 0, Time elapsed: 0.975 sec
> Running org.apache.hadoop.mapreduce.v2.TestMRJobs
> Tests run: 4, Failures: 3, Errors: 1, Skipped: 0, Time elapsed: 67.999 sec <<< FAILURE!
> Running org.apache.hadoop.mapreduce.v2.TestYARNRunner
> Tests run: 3, Failures: 0, Errors: 0, Skipped: 0, Time elapsed: 11.976 sec
> Running org.apache.hadoop.mapreduce.v2.TestMROldApiJobs
> Tests run: 2, Failures: 2, Errors: 0, Skipped: 0, Time elapsed: 31.879 sec <<< FAILURE!
> Running org.apache.hadoop.mapreduce.v2.TestMRJobsWithHistoryService
> ^NRunning org.apache.hadoop.mapreduce.v2.TestUberAM
> Tests run: 1, Failures: 0, Errors: 1, Skipped: 0, Time elapsed: 101.096 sec <<< FAILURE!
> Results :
> Failed tests:   testSleepJob(org.apache.hadoop.mapreduce.v2.TestMRJobs)
>   testRandomWriter(org.apache.hadoop.mapreduce.v2.TestMRJobs)
>   testDistributedCache(org.apache.hadoop.mapreduce.v2.TestMRJobs)
>   testJobSucceed(org.apache.hadoop.mapreduce.v2.TestMROldApiJobs): Job expected to succeed failed
>   testJobFail(org.apache.hadoop.mapreduce.v2.TestMROldApiJobs)
> Tests in error: 
>   testFailingMapper(org.apache.hadoop.mapreduce.v2.TestMRJobs): 0
>   org.apache.hadoop.mapreduce.v2.TestUberAM: Failed to Start org.apache.hadoop.mapreduce.v2.TestMRJobs
> Tests run: 19, Failures: 5, Errors: 2, Skipped: 0

--
This message is automatically generated by JIRA.
If you think it was sent incorrectly, please contact your JIRA administrators: https://issues.apache.org/jira/secure/ContactAdministrators!default.jspa
For more information on JIRA, see: http://www.atlassian.com/software/jira

        

[jira] [Assigned] (MAPREDUCE-3393) TestMRJobs, TestMROldApiJobs, and TestUberAM failures

Posted by "Mahadev konar (Assigned) (JIRA)" <ji...@apache.org>.
     [ https://issues.apache.org/jira/browse/MAPREDUCE-3393?page=com.atlassian.jira.plugin.system.issuetabpanels:all-tabpanel ]

Mahadev konar reassigned MAPREDUCE-3393:
----------------------------------------

    Assignee: Hitesh Shah
    
> TestMRJobs, TestMROldApiJobs, and TestUberAM failures
> -----------------------------------------------------
>
>                 Key: MAPREDUCE-3393
>                 URL: https://issues.apache.org/jira/browse/MAPREDUCE-3393
>             Project: Hadoop Map/Reduce
>          Issue Type: Bug
>          Components: mrv2
>    Affects Versions: 0.23.0
>            Reporter: Thomas Graves
>            Assignee: Hitesh Shah
>         Attachments: MR-3393.1.patch
>
>
> Check out branch 0.23 and run mvn test from hadoop-mapreduce-project directory
> -------------------------------------------------------
>  T E S T S
> -------------------------------------------------------
> Running org.apache.hadoop.mapred.TestClientServiceDelegate
> Tests run: 6, Failures: 0, Errors: 0, Skipped: 0, Time elapsed: 5.717 sec
> Running org.apache.hadoop.mapred.TestClientRedirect
> Tests run: 1, Failures: 0, Errors: 0, Skipped: 0, Time elapsed: 15.436 sec
> Running org.apache.hadoop.mapreduce.TestYarnClientProtocolProvider
> Tests run: 2, Failures: 0, Errors: 0, Skipped: 0, Time elapsed: 0.975 sec
> Running org.apache.hadoop.mapreduce.v2.TestMRJobs
> Tests run: 4, Failures: 3, Errors: 1, Skipped: 0, Time elapsed: 67.999 sec <<< FAILURE!
> Running org.apache.hadoop.mapreduce.v2.TestYARNRunner
> Tests run: 3, Failures: 0, Errors: 0, Skipped: 0, Time elapsed: 11.976 sec
> Running org.apache.hadoop.mapreduce.v2.TestMROldApiJobs
> Tests run: 2, Failures: 2, Errors: 0, Skipped: 0, Time elapsed: 31.879 sec <<< FAILURE!
> Running org.apache.hadoop.mapreduce.v2.TestMRJobsWithHistoryService
> ^NRunning org.apache.hadoop.mapreduce.v2.TestUberAM
> Tests run: 1, Failures: 0, Errors: 1, Skipped: 0, Time elapsed: 101.096 sec <<< FAILURE!
> Results :
> Failed tests:   testSleepJob(org.apache.hadoop.mapreduce.v2.TestMRJobs)
>   testRandomWriter(org.apache.hadoop.mapreduce.v2.TestMRJobs)
>   testDistributedCache(org.apache.hadoop.mapreduce.v2.TestMRJobs)
>   testJobSucceed(org.apache.hadoop.mapreduce.v2.TestMROldApiJobs): Job expected to succeed failed
>   testJobFail(org.apache.hadoop.mapreduce.v2.TestMROldApiJobs)
> Tests in error: 
>   testFailingMapper(org.apache.hadoop.mapreduce.v2.TestMRJobs): 0
>   org.apache.hadoop.mapreduce.v2.TestUberAM: Failed to Start org.apache.hadoop.mapreduce.v2.TestMRJobs
> Tests run: 19, Failures: 5, Errors: 2, Skipped: 0

--
This message is automatically generated by JIRA.
If you think it was sent incorrectly, please contact your JIRA administrators: https://issues.apache.org/jira/secure/ContactAdministrators!default.jspa
For more information on JIRA, see: http://www.atlassian.com/software/jira

        

[jira] [Commented] (MAPREDUCE-3393) TestMRJobs, TestMROldApiJobs, and TestUberAM failures

Posted by "Hitesh Shah (Commented) (JIRA)" <ji...@apache.org>.
    [ https://issues.apache.org/jira/browse/MAPREDUCE-3393?page=com.atlassian.jira.plugin.system.issuetabpanels:comment-tabpanel&focusedCommentId=13148862#comment-13148862 ] 

Hitesh Shah commented on MAPREDUCE-3393:
----------------------------------------

Still looking at the actual failures as not able to reproduce on both trunk/branch-0.23.

@Thomas, can you confirm that you have JAVA_HOME set in your environment? The regression tests have a tendency to fail if this var is not set in your environment.  
                
> TestMRJobs, TestMROldApiJobs, and TestUberAM failures
> -----------------------------------------------------
>
>                 Key: MAPREDUCE-3393
>                 URL: https://issues.apache.org/jira/browse/MAPREDUCE-3393
>             Project: Hadoop Map/Reduce
>          Issue Type: Bug
>          Components: mrv2
>    Affects Versions: 0.23.0
>            Reporter: Thomas Graves
>         Attachments: MR-3393.1.patch
>
>
> Check out branch 0.23 and run mvn test from hadoop-mapreduce-project directory
> -------------------------------------------------------
>  T E S T S
> -------------------------------------------------------
> Running org.apache.hadoop.mapred.TestClientServiceDelegate
> Tests run: 6, Failures: 0, Errors: 0, Skipped: 0, Time elapsed: 5.717 sec
> Running org.apache.hadoop.mapred.TestClientRedirect
> Tests run: 1, Failures: 0, Errors: 0, Skipped: 0, Time elapsed: 15.436 sec
> Running org.apache.hadoop.mapreduce.TestYarnClientProtocolProvider
> Tests run: 2, Failures: 0, Errors: 0, Skipped: 0, Time elapsed: 0.975 sec
> Running org.apache.hadoop.mapreduce.v2.TestMRJobs
> Tests run: 4, Failures: 3, Errors: 1, Skipped: 0, Time elapsed: 67.999 sec <<< FAILURE!
> Running org.apache.hadoop.mapreduce.v2.TestYARNRunner
> Tests run: 3, Failures: 0, Errors: 0, Skipped: 0, Time elapsed: 11.976 sec
> Running org.apache.hadoop.mapreduce.v2.TestMROldApiJobs
> Tests run: 2, Failures: 2, Errors: 0, Skipped: 0, Time elapsed: 31.879 sec <<< FAILURE!
> Running org.apache.hadoop.mapreduce.v2.TestMRJobsWithHistoryService
> ^NRunning org.apache.hadoop.mapreduce.v2.TestUberAM
> Tests run: 1, Failures: 0, Errors: 1, Skipped: 0, Time elapsed: 101.096 sec <<< FAILURE!
> Results :
> Failed tests:   testSleepJob(org.apache.hadoop.mapreduce.v2.TestMRJobs)
>   testRandomWriter(org.apache.hadoop.mapreduce.v2.TestMRJobs)
>   testDistributedCache(org.apache.hadoop.mapreduce.v2.TestMRJobs)
>   testJobSucceed(org.apache.hadoop.mapreduce.v2.TestMROldApiJobs): Job expected to succeed failed
>   testJobFail(org.apache.hadoop.mapreduce.v2.TestMROldApiJobs)
> Tests in error: 
>   testFailingMapper(org.apache.hadoop.mapreduce.v2.TestMRJobs): 0
>   org.apache.hadoop.mapreduce.v2.TestUberAM: Failed to Start org.apache.hadoop.mapreduce.v2.TestMRJobs
> Tests run: 19, Failures: 5, Errors: 2, Skipped: 0

--
This message is automatically generated by JIRA.
If you think it was sent incorrectly, please contact your JIRA administrators: https://issues.apache.org/jira/secure/ContactAdministrators!default.jspa
For more information on JIRA, see: http://www.atlassian.com/software/jira

        

[jira] [Commented] (MAPREDUCE-3393) TestMRJobs, TestMROldApiJobs, and TestUberAM failures

Posted by "Thomas Graves (Commented) (JIRA)" <ji...@apache.org>.
    [ https://issues.apache.org/jira/browse/MAPREDUCE-3393?page=com.atlassian.jira.plugin.system.issuetabpanels:comment-tabpanel&focusedCommentId=13149075#comment-13149075 ] 

Thomas Graves commented on MAPREDUCE-3393:
------------------------------------------

TestMROldApiJobs and TestUberAM both fail with exception below.  So perhaps something isn't being shut down cleanly in a test before it or in the failure of TestMRJobs.  If you can't reproduce it let me know and I'll look at the failures.

2011-11-11 17:20:44,452 ERROR [Thread-4] service.CompositeService (CompositeService.java:start(72)) - Error starting services ResourceManager
org.apache.hadoop.yarn.YarnException: java.net.BindException: Problem binding to [0.0.0.0:8025] java.net.BindException: Address already in use; For more details see:  http://wiki.apache.org/hadoop/BindException
    at org.apache.hadoop.yarn.factories.impl.pb.RpcServerFactoryPBImpl.getServer(RpcServerFactoryPBImpl.java:125)
    at org.apache.hadoop.yarn.ipc.HadoopYarnProtoRPC.getServer(HadoopYarnProtoRPC.java:63)
    at org.apache.hadoop.yarn.server.resourcemanager.ResourceTrackerService.start(ResourceTrackerService.java:125)
    at org.apache.hadoop.yarn.service.CompositeService.start(CompositeService.java:68)
    at org.apache.hadoop.yarn.server.resourcemanager.ResourceManager.start(ResourceManager.java:439)
    at org.apache.hadoop.yarn.server.MiniYARNCluster$ResourceManagerWrapper$2.run(MiniYARNCluster.java:126)
Caused by: java.net.BindException: Problem binding to [0.0.0.0:8025] java.net.BindException: Address already in use; For more details see:  http://wiki.apache.org/hadoop/BindException
    at org.apache.hadoop.net.NetUtils.wrapException(NetUtils.java:606)
    at org.apache.hadoop.ipc.Server.bind(Server.java:230)
    at org.apache.hadoop.ipc.Server$Listener.<init>(Server.java:310)
    at org.apache.hadoop.ipc.Server.<init>(Server.java:1591)
    at org.apache.hadoop.ipc.RPC$Server.<init>(RPC.java:576)
    at org.apache.hadoop.yarn.ipc.ProtoOverHadoopRpcEngine$Server.<init>(ProtoOverHadoopRpcEngine.java:314)
    at org.apache.hadoop.yarn.ipc.ProtoOverHadoopRpcEngine.getServer(ProtoOverHadoopRpcEngine.java:390)
    at org.apache.hadoop.ipc.RPC.getServer(RPC.java:550)
    at org.apache.hadoop.yarn.factories.impl.pb.RpcServerFactoryPBImpl.createServer(RpcServerFactoryPBImpl.java:155)
    at org.apache.hadoop.yarn.factories.impl.pb.RpcServerFactoryPBImpl.getServer(RpcServerFactoryPBImpl.java:118)
    ... 5 more
                
> TestMRJobs, TestMROldApiJobs, and TestUberAM failures
> -----------------------------------------------------
>
>                 Key: MAPREDUCE-3393
>                 URL: https://issues.apache.org/jira/browse/MAPREDUCE-3393
>             Project: Hadoop Map/Reduce
>          Issue Type: Bug
>          Components: mrv2
>    Affects Versions: 0.23.0
>            Reporter: Thomas Graves
>            Assignee: Hitesh Shah
>         Attachments: MR-3393.1.patch, MR-3393.2.patch
>
>
> Check out branch 0.23 and run mvn test from hadoop-mapreduce-project directory
> -------------------------------------------------------
>  T E S T S
> -------------------------------------------------------
> Running org.apache.hadoop.mapred.TestClientServiceDelegate
> Tests run: 6, Failures: 0, Errors: 0, Skipped: 0, Time elapsed: 5.717 sec
> Running org.apache.hadoop.mapred.TestClientRedirect
> Tests run: 1, Failures: 0, Errors: 0, Skipped: 0, Time elapsed: 15.436 sec
> Running org.apache.hadoop.mapreduce.TestYarnClientProtocolProvider
> Tests run: 2, Failures: 0, Errors: 0, Skipped: 0, Time elapsed: 0.975 sec
> Running org.apache.hadoop.mapreduce.v2.TestMRJobs
> Tests run: 4, Failures: 3, Errors: 1, Skipped: 0, Time elapsed: 67.999 sec <<< FAILURE!
> Running org.apache.hadoop.mapreduce.v2.TestYARNRunner
> Tests run: 3, Failures: 0, Errors: 0, Skipped: 0, Time elapsed: 11.976 sec
> Running org.apache.hadoop.mapreduce.v2.TestMROldApiJobs
> Tests run: 2, Failures: 2, Errors: 0, Skipped: 0, Time elapsed: 31.879 sec <<< FAILURE!
> Running org.apache.hadoop.mapreduce.v2.TestMRJobsWithHistoryService
> ^NRunning org.apache.hadoop.mapreduce.v2.TestUberAM
> Tests run: 1, Failures: 0, Errors: 1, Skipped: 0, Time elapsed: 101.096 sec <<< FAILURE!
> Results :
> Failed tests:   testSleepJob(org.apache.hadoop.mapreduce.v2.TestMRJobs)
>   testRandomWriter(org.apache.hadoop.mapreduce.v2.TestMRJobs)
>   testDistributedCache(org.apache.hadoop.mapreduce.v2.TestMRJobs)
>   testJobSucceed(org.apache.hadoop.mapreduce.v2.TestMROldApiJobs): Job expected to succeed failed
>   testJobFail(org.apache.hadoop.mapreduce.v2.TestMROldApiJobs)
> Tests in error: 
>   testFailingMapper(org.apache.hadoop.mapreduce.v2.TestMRJobs): 0
>   org.apache.hadoop.mapreduce.v2.TestUberAM: Failed to Start org.apache.hadoop.mapreduce.v2.TestMRJobs
> Tests run: 19, Failures: 5, Errors: 2, Skipped: 0

--
This message is automatically generated by JIRA.
If you think it was sent incorrectly, please contact your JIRA administrators: https://issues.apache.org/jira/secure/ContactAdministrators!default.jspa
For more information on JIRA, see: http://www.atlassian.com/software/jira

        

[jira] [Commented] (MAPREDUCE-3393) TestMRJobs, TestMROldApiJobs, and TestUberAM failures

Posted by "Eric Payne (Commented) (JIRA)" <ji...@apache.org>.
    [ https://issues.apache.org/jira/browse/MAPREDUCE-3393?page=com.atlassian.jira.plugin.system.issuetabpanels:comment-tabpanel&focusedCommentId=13151543#comment-13151543 ] 

Eric Payne commented on MAPREDUCE-3393:
---------------------------------------

I suggest we go ahead and mark this as a dup of MAPREDUCE:3407. Is that acceptable?
                
> TestMRJobs, TestMROldApiJobs, and TestUberAM failures
> -----------------------------------------------------
>
>                 Key: MAPREDUCE-3393
>                 URL: https://issues.apache.org/jira/browse/MAPREDUCE-3393
>             Project: Hadoop Map/Reduce
>          Issue Type: Bug
>          Components: mrv2
>    Affects Versions: 0.23.0
>            Reporter: Thomas Graves
>            Assignee: Thomas Graves
>         Attachments: MR-3393.1.patch, MR-3393.2.patch, org.apache.hadoop.mapreduce.v2.TestMRJobs-output.txt
>
>
> Check out branch 0.23 and run mvn test from hadoop-mapreduce-project directory
> -------------------------------------------------------
>  T E S T S
> -------------------------------------------------------
> Running org.apache.hadoop.mapred.TestClientServiceDelegate
> Tests run: 6, Failures: 0, Errors: 0, Skipped: 0, Time elapsed: 5.717 sec
> Running org.apache.hadoop.mapred.TestClientRedirect
> Tests run: 1, Failures: 0, Errors: 0, Skipped: 0, Time elapsed: 15.436 sec
> Running org.apache.hadoop.mapreduce.TestYarnClientProtocolProvider
> Tests run: 2, Failures: 0, Errors: 0, Skipped: 0, Time elapsed: 0.975 sec
> Running org.apache.hadoop.mapreduce.v2.TestMRJobs
> Tests run: 4, Failures: 3, Errors: 1, Skipped: 0, Time elapsed: 67.999 sec <<< FAILURE!
> Running org.apache.hadoop.mapreduce.v2.TestYARNRunner
> Tests run: 3, Failures: 0, Errors: 0, Skipped: 0, Time elapsed: 11.976 sec
> Running org.apache.hadoop.mapreduce.v2.TestMROldApiJobs
> Tests run: 2, Failures: 2, Errors: 0, Skipped: 0, Time elapsed: 31.879 sec <<< FAILURE!
> Running org.apache.hadoop.mapreduce.v2.TestMRJobsWithHistoryService
> ^NRunning org.apache.hadoop.mapreduce.v2.TestUberAM
> Tests run: 1, Failures: 0, Errors: 1, Skipped: 0, Time elapsed: 101.096 sec <<< FAILURE!
> Results :
> Failed tests:   testSleepJob(org.apache.hadoop.mapreduce.v2.TestMRJobs)
>   testRandomWriter(org.apache.hadoop.mapreduce.v2.TestMRJobs)
>   testDistributedCache(org.apache.hadoop.mapreduce.v2.TestMRJobs)
>   testJobSucceed(org.apache.hadoop.mapreduce.v2.TestMROldApiJobs): Job expected to succeed failed
>   testJobFail(org.apache.hadoop.mapreduce.v2.TestMROldApiJobs)
> Tests in error: 
>   testFailingMapper(org.apache.hadoop.mapreduce.v2.TestMRJobs): 0
>   org.apache.hadoop.mapreduce.v2.TestUberAM: Failed to Start org.apache.hadoop.mapreduce.v2.TestMRJobs
> Tests run: 19, Failures: 5, Errors: 2, Skipped: 0

--
This message is automatically generated by JIRA.
If you think it was sent incorrectly, please contact your JIRA administrators: https://issues.apache.org/jira/secure/ContactAdministrators!default.jspa
For more information on JIRA, see: http://www.atlassian.com/software/jira