You are viewing a plain text version of this content. The canonical link for it is here.
Posted to builds@beam.apache.org by Apache Jenkins Server <je...@builds.apache.org> on 2023/10/27 18:25:24 UTC

Build failed in Jenkins: beam_PostCommit_Java_PVR_Spark_Batch #2674

See <https://ci-beam.apache.org/job/beam_PostCommit_Java_PVR_Spark_Batch/2674/display/redirect>

Changes:


------------------------------------------
[...truncated 174.99 KB...]
  type_urn: "beam:artifact:type:file:v1"
  type_payload: "\n\272\001/tmp/beam-artifact-staging/167a525ba2b1bad5d6d598a7b6e86a35d999c378f22dc9398f4fa583f3a8750e/296-EMBEDDED-netty-transport-rxtx-4.1.87.Final-AfPW9DfjGB1-qLwOCtVe296yT8Bk-cwUR2AatljFUwg.jar"
  role_urn: "beam:artifact:role:staging_to:v1"
  role_payload: "\nQnetty-transport-rxtx-4.1.87.Final-AfPW9DfjGB1-qLwOCtVe296yT8Bk-cwUR2AatljFUwg.jar"
}
dependencies {
  type_urn: "beam:artifact:type:file:v1"
  type_payload: "\n\272\001/tmp/beam-artifact-staging/167a525ba2b1bad5d6d598a7b6e86a35d999c378f22dc9398f4fa583f3a8750e/297-EMBEDDED-netty-transport-sctp-4.1.87.Final-YAvJtwiIXdiAewmvquCoSMQZK6zh_JGAIGa_ai5kMAU.jar"
  role_urn: "beam:artifact:role:staging_to:v1"
  role_payload: "\nQnetty-transport-sctp-4.1.87.Final-YAvJtwiIXdiAewmvquCoSMQZK6zh_JGAIGa_ai5kMAU.jar"
}
dependencies {
  type_urn: "beam:artifact:type:file:v1"
  type_payload: "\n\271\001/tmp/beam-artifact-staging/167a525ba2b1bad5d6d598a7b6e86a35d999c378f22dc9398f4fa583f3a8750e/298-EMBEDDED-netty-transport-udt-4.1.87.Final-BJGUL-bB7rcOMzL7vBKdvmkPyun9OvixpGbdckkIBPE.jar"
  role_urn: "beam:artifact:role:staging_to:v1"
  role_payload: "\nPnetty-transport-udt-4.1.87.Final-BJGUL-bB7rcOMzL7vBKdvmkPyun9OvixpGbdckkIBPE.jar"
}
dependencies {
  type_urn: "beam:artifact:type:file:v1"
  type_payload: "\n\253\001/tmp/beam-artifact-staging/167a525ba2b1bad5d6d598a7b6e86a35d999c378f22dc9398f4fa583f3a8750e/299-EMBEDDED-aircompressor-0.21-6Wi9fzFkGulOpK4SlxM3vfq3lDScwLqpzNVFU8znEqw.jar"
  role_urn: "beam:artifact:role:staging_to:v1"
  role_payload: "\nBaircompressor-0.21-6Wi9fzFkGulOpK4SlxM3vfq3lDScwLqpzNVFU8znEqw.jar"
}
dependencies {
  type_urn: "beam:artifact:type:file:v1"
  type_payload: "\n\253\001/tmp/beam-artifact-staging/167a525ba2b1bad5d6d598a7b6e86a35d999c378f22dc9398f4fa583f3a8750e/300-EMBEDDED-annotations-17.0.0-GV-w2gRtVbsELpFUNITPHaaLArt6-_4DHyKeRayEs_I.jar"
  role_urn: "beam:artifact:role:staging_to:v1"
  role_payload: "\nBannotations-17.0.0-GV-w2gRtVbsELpFUNITPHaaLArt6-_4DHyKeRayEs_I.jar"
}
dependencies {
  type_urn: "beam:artifact:type:file:v1"
  type_payload: "\n\255\001/tmp/beam-artifact-staging/167a525ba2b1bad5d6d598a7b6e86a35d999c378f22dc9398f4fa583f3a8750e/301-EMBEDDED-threeten-extra-1.5.0-5971VFNhiPuviqwaCi-VawOcu7Vpbtw7gzbEQsVq5EU.jar"
  role_urn: "beam:artifact:role:staging_to:v1"
  role_payload: "\nDthreeten-extra-1.5.0-5971VFNhiPuviqwaCi-VawOcu7Vpbtw7gzbEQsVq5EU.jar"
}
dependencies {
  type_urn: "beam:artifact:type:file:v1"
  type_payload: "\n\257\001/tmp/beam-artifact-staging/167a525ba2b1bad5d6d598a7b6e86a35d999c378f22dc9398f4fa583f3a8750e/302-EMBEDDED-parquet-jackson-1.12.2-hRxrUD2dMCv2fTZ9uvKQ7i9UGxBQo9X--4O1EFpBH_c.jar"
  role_urn: "beam:artifact:role:staging_to:v1"
  role_payload: "\nFparquet-jackson-1.12.2-hRxrUD2dMCv2fTZ9uvKQ7i9UGxBQo9X--4O1EFpBH_c.jar"
}
dependencies {
  type_urn: "beam:artifact:type:file:v1"
  type_payload: "\n\253\001/tmp/beam-artifact-staging/167a525ba2b1bad5d6d598a7b6e86a35d999c378f22dc9398f4fa583f3a8750e/303-EMBEDDED-arrow-format-5.0.0-FzXW0Kc0wcM-4qPMnXkmsxGom9LbiofNT9gHF14a_l4.jar"
  role_urn: "beam:artifact:role:staging_to:v1"
  role_payload: "\nBarrow-format-5.0.0-FzXW0Kc0wcM-4qPMnXkmsxGom9LbiofNT9gHF14a_l4.jar"
}
dependencies {
  type_urn: "beam:artifact:type:file:v1"
  type_payload: "\n\260\001/tmp/beam-artifact-staging/167a525ba2b1bad5d6d598a7b6e86a35d999c378f22dc9398f4fa583f3a8750e/304-EMBEDDED-flatbuffers-java-1.12.0-P4wIi03QSphYch8uFiUIyU2w3Yb5YeMG7mPvLtqHG_c.jar"
  role_urn: "beam:artifact:role:staging_to:v1"
  role_payload: "\nGflatbuffers-java-1.12.0-P4wIi03QSphYch8uFiUIyU2w3Yb5YeMG7mPvLtqHG_c.jar"
}
dependencies {
  type_urn: "beam:artifact:type:file:v1"
  type_payload: "\n\253\001/tmp/beam-artifact-staging/167a525ba2b1bad5d6d598a7b6e86a35d999c378f22dc9398f4fa583f3a8750e/305-EMBEDDED-spring-core-5.3.27-yxKq8tF9HXivG40qpSJNks2pbNcmp64yH_tpkP53Kg4.jar"
  role_urn: "beam:artifact:role:staging_to:v1"
  role_payload: "\nBspring-core-5.3.27-yxKq8tF9HXivG40qpSJNks2pbNcmp64yH_tpkP53Kg4.jar"
}
dependencies {
  type_urn: "beam:artifact:type:file:v1"
  type_payload: "\n\255\001/tmp/beam-artifact-staging/167a525ba2b1bad5d6d598a7b6e86a35d999c378f22dc9398f4fa583f3a8750e/306-EMBEDDED-commons-digester-2.1-4LK5gKhPxlM8XOKR8ZF7MsUH9ivK1kGY__RDaMIZaj0.jar"
  role_urn: "beam:artifact:role:staging_to:v1"
  role_payload: "\nDcommons-digester-2.1-4LK5gKhPxlM8XOKR8ZF7MsUH9ivK1kGY__RDaMIZaj0.jar"
}
dependencies {
  type_urn: "beam:artifact:type:file:v1"
  type_payload: "\n\254\001/tmp/beam-artifact-staging/167a525ba2b1bad5d6d598a7b6e86a35d999c378f22dc9398f4fa583f3a8750e/307-EMBEDDED-failureaccess-1.0.1-oXHuTHNN0tqDfksWvp30Zhr6typBra8x64Tf2vk2yiY.jar"
  role_urn: "beam:artifact:role:staging_to:v1"
  role_payload: "\nCfailureaccess-1.0.1-oXHuTHNN0tqDfksWvp30Zhr6typBra8x64Tf2vk2yiY.jar"
}
dependencies {
  type_urn: "beam:artifact:type:file:v1"
  type_payload: "\n\300\001/tmp/beam-artifact-staging/167a525ba2b1bad5d6d598a7b6e86a35d999c378f22dc9398f4fa583f3a8750e/308-EMBEDDED-listenablefuture-9999.0-empty-to-avoid-conflict-with-guava-s3KgN9QjCqV_vv_e8w_WEj-cDC24"
  role_urn: "beam:artifact:role:staging_to:v1"
  role_payload: "\njlistenablefuture-9999.0-empty-to-avoid-conflict-with-guava-s3KgN9QjCqV_vv_e8w_WEj-cDC24XQrO0AyRuXTzP5k.jar"
}
dependencies {
  type_urn: "beam:artifact:type:file:v1"
  type_payload: "\n\240\001/tmp/beam-artifact-staging/167a525ba2b1bad5d6d598a7b6e86a35d999c378f22dc9398f4fa583f3a8750e/309-EMBEDDED-asm-4.0--y3ekCCke7AkxD2d4KlOc6vveTvwjwE1TMl8stLiqVc.jar"
  role_urn: "beam:artifact:role:staging_to:v1"
  role_payload: "\n7asm-4.0--y3ekCCke7AkxD2d4KlOc6vveTvwjwE1TMl8stLiqVc.jar"
}
dependencies {
  type_urn: "beam:artifact:type:file:v1"
  type_payload: "\n\242\001/tmp/beam-artifact-staging/167a525ba2b1bad5d6d598a7b6e86a35d999c378f22dc9398f4fa583f3a8750e/310-EMBEDDED-ST4-4.0.8-WMqrxAyfdLC1mT_YaOD2SlDAdZCU5qJRqq-tmO38ejs.jar"
  role_urn: "beam:artifact:role:staging_to:v1"
  role_payload: "\n9ST4-4.0.8-WMqrxAyfdLC1mT_YaOD2SlDAdZCU5qJRqq-tmO38ejs.jar"
}
dependencies {
  type_urn: "beam:artifact:type:file:v1"
  type_payload: "\n\254\001/tmp/beam-artifact-staging/167a525ba2b1bad5d6d598a7b6e86a35d999c378f22dc9398f4fa583f3a8750e/311-EMBEDDED-antlr-runtime-3.5.2-zj_I7LEPOemjzdy7LONQ0nLZzT0LHhjm_nPDuTichzQ.jar"
  role_urn: "beam:artifact:role:staging_to:v1"
  role_payload: "\nCantlr-runtime-3.5.2-zj_I7LEPOemjzdy7LONQ0nLZzT0LHhjm_nPDuTichzQ.jar"
}
dependencies {
  type_urn: "beam:artifact:type:file:v1"
  type_payload: "\n\257\001/tmp/beam-artifact-staging/167a525ba2b1bad5d6d598a7b6e86a35d999c378f22dc9398f4fa583f3a8750e/312-EMBEDDED-hadoop-apache2-3.2.0-1-utOlhQMw_MZxskVG0O3_tp_lQEfNFCpS6pyHz3TPVKA.jar"
  role_urn: "beam:artifact:role:staging_to:v1"
  role_payload: "\nFhadoop-apache2-3.2.0-1-utOlhQMw_MZxskVG0O3_tp_lQEfNFCpS6pyHz3TPVKA.jar"
}
dependencies {
  type_urn: "beam:artifact:type:file:v1"
  type_payload: "\n\262\001/tmp/beam-artifact-staging/167a525ba2b1bad5d6d598a7b6e86a35d999c378f22dc9398f4fa583f3a8750e/313-EMBEDDED-checker-compat-qual-2.5.3-12ua_qYcfAgpCAI_DLwUJ_q5q9LfkVyLij56UJvMvG0.jar"
  role_urn: "beam:artifact:role:staging_to:v1"
  role_payload: "\nIchecker-compat-qual-2.5.3-12ua_qYcfAgpCAI_DLwUJ_q5q9LfkVyLij56UJvMvG0.jar"
}
dependencies {
  type_urn: "beam:artifact:type:file:v1"
  type_payload: "\n\250\001/tmp/beam-artifact-staging/167a525ba2b1bad5d6d598a7b6e86a35d999c378f22dc9398f4fa583f3a8750e/314-EMBEDDED-disruptor-3.4.2-9BLsuyNcJGC0XmNYQQlyPeqNlLgZx4yb_Dj1DLqFRsA.jar"
  role_urn: "beam:artifact:role:staging_to:v1"
  role_payload: "\n?disruptor-3.4.2-9BLsuyNcJGC0XmNYQQlyPeqNlLgZx4yb_Dj1DLqFRsA.jar"
}
dependencies {
  type_urn: "beam:artifact:type:file:v1"
  type_payload: "\n\254\001/tmp/beam-artifact-staging/167a525ba2b1bad5d6d598a7b6e86a35d999c378f22dc9398f4fa583f3a8750e/315-EMBEDDED-annotations-4.1.1.4-unNOHoTAnWFa9qCdMwNLTwRC-Hct7BIO-zdthqVlrhU.jar"
  role_urn: "beam:artifact:role:staging_to:v1"
  role_payload: "\nCannotations-4.1.1.4-unNOHoTAnWFa9qCdMwNLTwRC-Hct7BIO-zdthqVlrhU.jar"
}
dependencies {
  type_urn: "beam:artifact:type:file:v1"
  type_payload: "\n\270\001/tmp/beam-artifact-staging/167a525ba2b1bad5d6d598a7b6e86a35d999c378f22dc9398f4fa583f3a8750e/316-EMBEDDED-animal-sniffer-annotations-1.23-n_5Sa_Q6Y0jp2LM7nNb1gKf17tDPBVkTAH7aJj3pdNA.jar"
  role_urn: "beam:artifact:role:staging_to:v1"
  role_payload: "\nOanimal-sniffer-annotations-1.23-n_5Sa_Q6Y0jp2LM7nNb1gKf17tDPBVkTAH7aJj3pdNA.jar"
}
dependencies {
  type_urn: "beam:artifact:type:file:v1"
  type_payload: "\n\254\001/tmp/beam-artifact-staging/167a525ba2b1bad5d6d598a7b6e86a35d999c378f22dc9398f4fa583f3a8750e/317-EMBEDDED-perfmark-api-0.26.0-t9I-k6NFN84zJwgmmg0UBHiKW14ZSegvVTX85Rs-qVs.jar"
  role_urn: "beam:artifact:role:staging_to:v1"
  role_payload: "\nCperfmark-api-0.26.0-t9I-k6NFN84zJwgmmg0UBHiKW14ZSegvVTX85Rs-qVs.jar"
}
dependencies {
  type_urn: "beam:artifact:type:file:v1"
  type_payload: "\n\263\001/tmp/beam-artifact-staging/167a525ba2b1bad5d6d598a7b6e86a35d999c378f22dc9398f4fa583f3a8750e/318-EMBEDDED-javax.annotation-api-1.3.2-4EulGVvNVV3JVlD3zGFNFR5LzVLSmhC4qiGX86uJq5s.jar"
  role_urn: "beam:artifact:role:staging_to:v1"
  role_payload: "\nJjavax.annotation-api-1.3.2-4EulGVvNVV3JVlD3zGFNFR5LzVLSmhC4qiGX86uJq5s.jar"
}
dependencies {
  type_urn: "beam:artifact:type:file:v1"
  type_payload: "\n\251\001/tmp/beam-artifact-staging/167a525ba2b1bad5d6d598a7b6e86a35d999c378f22dc9398f4fa583f3a8750e/319-EMBEDDED-threetenbp-1.6.8-5LHrPZDDilTH8zhP2pV-C1vwtBtAZypErosDy2yHzgY.jar"
  role_urn: "beam:artifact:role:staging_to:v1"
  role_payload: "\n@threetenbp-1.6.8-5LHrPZDDilTH8zhP2pV-C1vwtBtAZypErosDy2yHzgY.jar"
}
dependencies {
  type_urn: "beam:artifact:type:file:v1"
  type_payload: "\n\265\001/tmp/beam-artifact-staging/167a525ba2b1bad5d6d598a7b6e86a35d999c378f22dc9398f4fa583f3a8750e/320-EMBEDDED-aopalliance-repackaged-2.6.1-utd_knjXU0BjYK-eR0e9mzFhVU6pzT1iQRoK4fLBQf0.jar"
  role_urn: "beam:artifact:role:staging_to:v1"
  role_payload: "\nLaopalliance-repackaged-2.6.1-utd_knjXU0BjYK-eR0e9mzFhVU6pzT1iQRoK4fLBQf0.jar"
}
dependencies {
  type_urn: "beam:artifact:type:file:v1"
  type_payload: "\n\252\001/tmp/beam-artifact-staging/167a525ba2b1bad5d6d598a7b6e86a35d999c378f22dc9398f4fa583f3a8750e/321-EMBEDDED-spring-jcl-5.3.27-xoi_zyORt6_zzyNdXFHwZnXw99OGyOZFpllAee7z90U.jar"
  role_urn: "beam:artifact:role:staging_to:v1"
  role_payload: "\nAspring-jcl-5.3.27-xoi_zyORt6_zzyNdXFHwZnXw99OGyOZFpllAee7z90U.jar"
}
dependencies {
  type_urn: "beam:artifact:type:file:v1"
  type_payload: "\n\270\001/tmp/beam-artifact-staging/167a525ba2b1bad5d6d598a7b6e86a35d999c378f22dc9398f4fa583f3a8750e/322-EMBEDDED-org.abego.treelayout.core-1.0.3--l4xOVw5wufUasoPgfcgYJMWB7L6Qb02A46yy2-5MyY.jar"
  role_urn: "beam:artifact:role:staging_to:v1"
  role_payload: "\nOorg.abego.treelayout.core-1.0.3--l4xOVw5wufUasoPgfcgYJMWB7L6Qb02A46yy2-5MyY.jar"
}
dependencies {
  type_urn: "beam:artifact:type:file:v1"
  type_payload: "\n\251\001/tmp/beam-artifact-staging/167a525ba2b1bad5d6d598a7b6e86a35d999c378f22dc9398f4fa583f3a8750e/323-EMBEDDED-javax.json-1.0.4-Dh3sQKHt6WWUElHtqWiu7gUsxPUDeLwxbMSOgVm9vrQ.jar"
  role_urn: "beam:artifact:role:staging_to:v1"
  role_payload: "\n@javax.json-1.0.4-Dh3sQKHt6WWUElHtqWiu7gUsxPUDeLwxbMSOgVm9vrQ.jar"
}
dependencies {
  type_urn: "beam:artifact:type:file:v1"
  type_payload: "\n\243\001/tmp/beam-artifact-staging/167a525ba2b1bad5d6d598a7b6e86a35d999c378f22dc9398f4fa583f3a8750e/324-EMBEDDED-icu4j-58.2-lT4eg7K-fD6i-I2obBNhT0fp5x01eMhSHX8Yd1a2OWI.jar"
  role_urn: "beam:artifact:role:staging_to:v1"
  role_payload: "\n:icu4j-58.2-lT4eg7K-fD6i-I2obBNhT0fp5x01eMhSHX8Yd1a2OWI.jar"
}

[ScheduledExecutor-thread] INFO org.apache.beam.runners.fnexecution.logging.GrpcLoggingService - 1 Beam Fn Logging clients still connected during shutdown.
[ScheduledExecutor-thread] WARN org.apache.beam.sdk.fn.data.BeamFnDataGrpcMultiplexer - Hanged up for unknown endpoint.
[grpc-default-executor-118] ERROR org.apache.beam.sdk.fn.data.BeamFnDataGrpcMultiplexer - Failed to handle for url: "InProcessServer_586"

org.apache.beam.vendor.grpc.v1p54p0.io.grpc.StatusRuntimeException: CANCELLED: Multiplexer hanging up
	at org.apache.beam.vendor.grpc.v1p54p0.io.grpc.Status.asRuntimeException(Status.java:539)
	at org.apache.beam.vendor.grpc.v1p54p0.io.grpc.stub.ClientCalls$StreamObserverToCallListenerAdapter.onClose(ClientCalls.java:487)
	at org.apache.beam.vendor.grpc.v1p54p0.io.grpc.internal.ClientCallImpl.closeObserver(ClientCallImpl.java:576)
	at org.apache.beam.vendor.grpc.v1p54p0.io.grpc.internal.ClientCallImpl.access$300(ClientCallImpl.java:70)
	at org.apache.beam.vendor.grpc.v1p54p0.io.grpc.internal.ClientCallImpl$ClientStreamListenerImpl$1StreamClosed.runInternal(ClientCallImpl.java:757)
	at org.apache.beam.vendor.grpc.v1p54p0.io.grpc.internal.ClientCallImpl$ClientStreamListenerImpl$1StreamClosed.runInContext(ClientCallImpl.java:736)
	at org.apache.beam.vendor.grpc.v1p54p0.io.grpc.internal.ContextRunnable.run(ContextRunnable.java:37)
	at org.apache.beam.vendor.grpc.v1p54p0.io.grpc.internal.SerializingExecutor.run(SerializingExecutor.java:133)
	at java.util.concurrent.ThreadPoolExecutor.runWorker(ThreadPoolExecutor.java:1149)
	at java.util.concurrent.ThreadPoolExecutor$Worker.run(ThreadPoolExecutor.java:624)
	at java.lang.Thread.run(Thread.java:750)
[CreateEnvironment-thread] ERROR org.apache.beam.fn.harness.FnHarness - Shutting down harness due to exception
java.lang.RuntimeException: java.lang.IllegalStateException: Logging stream terminated unexpectedly with success before it was closed by the client.
	at org.apache.beam.fn.harness.logging.BeamFnLoggingClient$StreamWriter.drainQueueToStream(BeamFnLoggingClient.java:270)
	at org.apache.beam.fn.harness.logging.BeamFnLoggingClient.lambda$new$0(BeamFnLoggingClient.java:160)
	at java.util.concurrent.CompletableFuture$AsyncSupply.run(CompletableFuture.java:1604)
	at java.util.concurrent.Executors$RunnableAdapter.call(Executors.java:511)
	at java.util.concurrent.FutureTask.run(FutureTask.java:266)
	at org.apache.beam.sdk.util.UnboundedScheduledExecutorService$ScheduledFutureTask.run(UnboundedScheduledExecutorService.java:163)
	at java.util.concurrent.ThreadPoolExecutor.runWorker(ThreadPoolExecutor.java:1149)
	at java.util.concurrent.ThreadPoolExecutor$Worker.run(ThreadPoolExecutor.java:624)
	at java.lang.Thread.run(Thread.java:750)
Caused by: java.lang.IllegalStateException: Logging stream terminated unexpectedly with success before it was closed by the client.
	at org.apache.beam.fn.harness.logging.BeamFnLoggingClient$StreamWriter.drainQueueToStream(BeamFnLoggingClient.java:256)
	... 8 more
java.lang.RuntimeException: java.lang.IllegalStateException: Logging stream terminated unexpectedly with success before it was closed by the client.
	at org.apache.beam.fn.harness.logging.BeamFnLoggingClient$StreamWriter.drainQueueToStream(BeamFnLoggingClient.java:270)
	at org.apache.beam.fn.harness.logging.BeamFnLoggingClient.lambda$new$0(BeamFnLoggingClient.java:160)
	at java.util.concurrent.CompletableFuture$AsyncSupply.run(CompletableFuture.java:1604)
	at java.util.concurrent.Executors$RunnableAdapter.call(Executors.java:511)
	at java.util.concurrent.FutureTask.run(FutureTask.java:266)
	at org.apache.beam.sdk.util.UnboundedScheduledExecutorService$ScheduledFutureTask.run(UnboundedScheduledExecutorService.java:163)
	at java.util.concurrent.ThreadPoolExecutor.runWorker(ThreadPoolExecutor.java:1149)
	at java.util.concurrent.ThreadPoolExecutor$Worker.run(ThreadPoolExecutor.java:624)
	at java.lang.Thread.run(Thread.java:750)
Caused by: java.lang.IllegalStateException: Logging stream terminated unexpectedly with success before it was closed by the client.
	at org.apache.beam.fn.harness.logging.BeamFnLoggingClient$StreamWriter.drainQueueToStream(BeamFnLoggingClient.java:256)
	... 8 more
[CreateEnvironment-thread] INFO org.apache.beam.fn.harness.FnHarness - Shutting SDK harness down.

> Task :runners:spark:3:job-server:validatesPortableRunnerBatch

233 tests completed, 1 failed, 1 skipped

> Task :runners:spark:3:job-server:validatesPortableRunnerBatch FAILED
> Task :runners:spark:3:job-server:validatesPortableRunnerDocker

[shutdown-hook-0] INFO org.apache.spark.util.ShutdownHookManager - Shutdown hook called
[shutdown-hook-0] INFO org.apache.spark.util.ShutdownHookManager - Deleting directory /tmp/spark-c7117172-b9d1-4e91-a6bc-cf53ea1374c5

FAILURE: Build failed with an exception.

* What went wrong:
Execution failed for task ':runners:spark:3:job-server:validatesPortableRunnerBatch'.
> There were failing tests. See the report at: file://<https://ci-beam.apache.org/job/beam_PostCommit_Java_PVR_Spark_Batch/ws/src/runners/spark/3/job-server/build/reports/tests/validatesPortableRunnerBatch/index.html>

Deprecated Gradle features were used in this build, making it incompatible with Gradle 9.0.

You can use '--warning-mode all' to show the individual deprecation warnings and determine if they come from your own scripts or plugins.

For more on this, please refer to https://docs.gradle.org/8.4/userguide/command_line_interface.html#sec:command_line_warnings in the Gradle documentation.

BUILD FAILED in 2h 4m 59s
116 actionable tasks: 75 executed, 39 from cache, 2 up-to-date

Publishing build scan...
https://ge.apache.org/s/mcoizgk2mqeyg

Build step 'Invoke Gradle script' changed build result to FAILURE
Build step 'Invoke Gradle script' marked build as failure

---------------------------------------------------------------------
To unsubscribe, e-mail: builds-unsubscribe@beam.apache.org
For additional commands, e-mail: builds-help@beam.apache.org


Jenkins build is back to normal : beam_PostCommit_Java_PVR_Spark_Batch #2683

Posted by Apache Jenkins Server <je...@builds.apache.org>.
See <https://ci-beam.apache.org/job/beam_PostCommit_Java_PVR_Spark_Batch/2683/display/redirect>


---------------------------------------------------------------------
To unsubscribe, e-mail: builds-unsubscribe@beam.apache.org
For additional commands, e-mail: builds-help@beam.apache.org


Build failed in Jenkins: beam_PostCommit_Java_PVR_Spark_Batch #2682

Posted by Apache Jenkins Server <je...@builds.apache.org>.
See <https://ci-beam.apache.org/job/beam_PostCommit_Java_PVR_Spark_Batch/2682/display/redirect>

Changes:


------------------------------------------
[...truncated 41.52 KB...]
#4 [1/5] FROM docker.io/library/golang:1.20-bullseye@sha256:082569b3303b164cc4a7c88ac59b19b69c1a5d662041ac0dca046ac239632442
#4 resolve docker.io/library/golang:1.20-bullseye@sha256:082569b3303b164cc4a7c88ac59b19b69c1a5d662041ac0dca046ac239632442 0.0s done
#4 DONE 0.0s

#5 [internal] load build context
#5 transferring context: 1.96kB 0.0s done
#5 DONE 0.0s

#6 [4/5] RUN go install github.com/google/go-licenses@latest
#6 CACHED

#7 [2/5] WORKDIR /usr/src/app
#7 CACHED

#8 [3/5] COPY go.mod ./
#8 CACHED

#9 [5/5] COPY get-licenses.sh /opt/apache/beam/
#9 CACHED

#10 exporting to image
#10 exporting layers done
#10 writing image sha256:6da5749ca4d996017cb613d5dd6fd97b13df3f15aca078bfcde5caaf7666674a done
#10 naming to docker.io/library/golicenses-java done
#10 DONE 0.0s

> Task :sdks:java:container:pullLicenses
Collecting setuptools
  Using cached setuptools-68.2.2-py3-none-any.whl (807 kB)
Collecting wheel
  Using cached wheel-0.41.2-py3-none-any.whl (64 kB)
Installing collected packages: pip, setuptools, wheel
  Attempting uninstall: pip
    Found existing installation: pip 20.0.2
    Uninstalling pip-20.0.2:
      Successfully uninstalled pip-20.0.2
  Attempting uninstall: setuptools
    Found existing installation: setuptools 44.0.0
    Uninstalling setuptools-44.0.0:
      Successfully uninstalled setuptools-44.0.0
Successfully installed pip-23.3.1 setuptools-68.2.2 wheel-0.41.2
Collecting beautifulsoup4<5.0,>=4.9.0 (from -r <https://ci-beam.apache.org/job/beam_PostCommit_Java_PVR_Spark_Batch/ws/src/sdks/java/container/license_scripts/requirement.txt> (line 19))
  Using cached beautifulsoup4-4.12.2-py3-none-any.whl (142 kB)
Collecting pyyaml<7,>=6.0.1 (from -r <https://ci-beam.apache.org/job/beam_PostCommit_Java_PVR_Spark_Batch/ws/src/sdks/java/container/license_scripts/requirement.txt> (line 20))
  Using cached PyYAML-6.0.1-cp38-cp38-manylinux_2_17_x86_64.manylinux2014_x86_64.whl.metadata (2.1 kB)
Collecting tenacity<9.0,>=6.1.0 (from -r <https://ci-beam.apache.org/job/beam_PostCommit_Java_PVR_Spark_Batch/ws/src/sdks/java/container/license_scripts/requirement.txt> (line 21))
  Using cached tenacity-8.2.3-py3-none-any.whl.metadata (1.0 kB)
Collecting soupsieve>1.2 (from beautifulsoup4<5.0,>=4.9.0->-r <https://ci-beam.apache.org/job/beam_PostCommit_Java_PVR_Spark_Batch/ws/src/sdks/java/container/license_scripts/requirement.txt> (line 19))
  Using cached soupsieve-2.5-py3-none-any.whl.metadata (4.7 kB)
Using cached PyYAML-6.0.1-cp38-cp38-manylinux_2_17_x86_64.manylinux2014_x86_64.whl (736 kB)
Using cached tenacity-8.2.3-py3-none-any.whl (24 kB)
Using cached soupsieve-2.5-py3-none-any.whl (36 kB)
Installing collected packages: tenacity, soupsieve, pyyaml, beautifulsoup4
Successfully installed beautifulsoup4-4.12.2 pyyaml-6.0.1 soupsieve-2.5 tenacity-8.2.3
Executing python <https://ci-beam.apache.org/job/beam_PostCommit_Java_PVR_Spark_Batch/ws/src/sdks/java/container/license_scripts/pull_licenses_java.py> --license_index=<https://ci-beam.apache.org/job/beam_PostCommit_Java_PVR_Spark_Batch/ws/src/sdks/java/container/build/reports/dependency-license/index.json>        --output_dir=<https://ci-beam.apache.org/job/beam_PostCommit_Java_PVR_Spark_Batch/ws/src/sdks/java/container/build/target/java_third_party_licenses>        --dep_url_yaml=<https://ci-beam.apache.org/job/beam_PostCommit_Java_PVR_Spark_Batch/ws/src/sdks/java/container/license_scripts/dep_urls_java.yaml>        --manual_license_path=<https://ci-beam.apache.org/job/beam_PostCommit_Java_PVR_Spark_Batch/ws/src/sdks/java/container/license_scripts/manual_licenses>
INFO:root:Pulling license for 125 dependencies using 16 threads.
INFO:root:Replaced local file URL with file://<https://ci-beam.apache.org/job/beam_PostCommit_Java_PVR_Spark_Batch/ws/src/sdks/java/container/license_scripts/manual_licenses/xz/COPYING> for xz-1.5
INFO:root:pull_licenses_java.py succeed. It took 1.480216 seconds with 16 threads.
Copying licenses from <https://ci-beam.apache.org/job/beam_PostCommit_Java_PVR_Spark_Batch/ws/src/sdks/java/container/build/target/java_third_party_licenses> to <https://ci-beam.apache.org/job/beam_PostCommit_Java_PVR_Spark_Batch/ws/src/sdks/java/container/build/target/third_party_licenses.>
Finished license_scripts.sh

> Task :release:go-licenses:java:dockerRun
+ rm -rf '/output/*'
+ go get github.com/apache/beam/sdks/v2/java/container
go: downloading github.com/apache/beam/sdks/v2 v2.51.0
go: downloading github.com/apache/beam v2.51.0+incompatible

> Task :sdks:java:container:java8:copyJavaThirdPartyLicenses

> Task :sdks:java:container:downloadCloudProfilerAgent
  % Total    % Received % Xferd  Average Speed   Time    Time     Time  Current
                                 Dload  Upload   Total   Spent    Left  Speed
  0     0    0     0    0     0      0      0 --:--:-- --:--:-- --:--:--     0version.txt
NOTICES
profiler_java_agent.so
100 4183k  100 4183k    0     0  20.5M      0 --:--:-- --:--:-- --:--:-- 20.5M

> Task :sdks:java:container:goPrepare UP-TO-DATE

> Task :sdks:java:container:goBuild
/home/jenkins/go/bin/go1.21.3 build -o ./build/target/linux_amd64/boot boot.go boot_test.go pathingjar.go pathingjar_test.go

> Task :release:go-licenses:java:dockerRun
go: downloading github.com/golang/protobuf v1.5.3
go: downloading google.golang.org/grpc v1.58.1
go: downloading google.golang.org/protobuf v1.31.0
go: downloading golang.org/x/sys v0.12.0

> Task :sdks:java:container:java8:copySdkHarnessLauncher

> Task :release:go-licenses:java:dockerRun
go: downloading golang.org/x/net v0.15.0
go: downloading google.golang.org/genproto/googleapis/rpc v0.0.0-20230913181813-007df8e322eb
go: downloading google.golang.org/genproto v0.0.0-20230821184602-ccc8af3d0e93
go: downloading golang.org/x/text v0.13.0
go: added github.com/apache/beam/sdks/v2 v2.51.0
go: added github.com/golang/protobuf v1.5.3
go: added golang.org/x/net v0.15.0
go: added golang.org/x/sys v0.12.0
go: added golang.org/x/text v0.13.0
go: added google.golang.org/genproto/googleapis/rpc v0.0.0-20230913181813-007df8e322eb
go: added google.golang.org/grpc v1.58.1
go: added google.golang.org/protobuf v1.31.0
+ go-licenses save github.com/apache/beam/sdks/v2/java/container --save_path=/output/licenses
W1029 16:21:14.995885      32 library.go:101] "golang.org/x/sys/unix" contains non-Go code that can't be inspected for further dependencies:
/go/pkg/mod/golang.org/x/sys@v0.12.0/unix/asm_linux_amd64.s
+ go-licenses csv github.com/apache/beam/sdks/v2/java/container
+ tee /output/licenses/list.csv
W1029 16:21:23.226787      68 library.go:101] "golang.org/x/sys/unix" contains non-Go code that can't be inspected for further dependencies:
/go/pkg/mod/golang.org/x/sys@v0.12.0/unix/asm_linux_amd64.s

> Task :runners:spark:3:job-server:validatesPortableRunnerBatch

> Task :release:go-licenses:java:dockerRun
github.com/apache/beam/sdks/v2/go,https://github.com/apache/beam/blob/sdks/v2.51.0/sdks/go/README.md,Apache-2.0
github.com/apache/beam/sdks/v2/java/container,https://github.com/apache/beam/blob/sdks/v2.51.0/sdks/LICENSE,Apache-2.0
github.com/golang/protobuf,https://github.com/golang/protobuf/blob/v1.5.3/LICENSE,BSD-3-Clause
golang.org/x/net,https://cs.opensource.google/go/x/net/+/v0.15.0:LICENSE,BSD-3-Clause
golang.org/x/sys/unix,https://cs.opensource.google/go/x/sys/+/v0.12.0:LICENSE,BSD-3-Clause
golang.org/x/text,https://cs.opensource.google/go/x/text/+/v0.13.0:LICENSE,BSD-3-Clause
google.golang.org/genproto/googleapis/rpc/status,https://github.com/googleapis/go-genproto/blob/007df8e322eb/googleapis/rpc/LICENSE,Apache-2.0
google.golang.org/grpc,https://github.com/grpc/grpc-go/blob/v1.58.1/LICENSE,Apache-2.0
google.golang.org/protobuf,https://github.com/protocolbuffers/protobuf-go/blob/v1.31.0/LICENSE,BSD-3-Clause
+ chmod -R a+w /output/licenses

> Task :release:go-licenses:java:createLicenses
> Task :sdks:java:container:java8:copyGolangLicenses
> Task :sdks:java:container:java8:dockerPrepare

> Task :sdks:java:container:java8:docker
#1 [internal] load .dockerignore
#1 transferring context: 2B done
#1 ...

#2 [internal] load build definition from Dockerfile
#2 transferring dockerfile: 2.59kB done
#2 DONE 2.3s

#1 [internal] load .dockerignore
#1 DONE 3.2s

#3 [internal] load metadata for docker.io/library/eclipse-temurin:8
#3 DONE 0.8s

#4 [internal] load build context
#4 transferring context: 32.76MB 0.4s
#4 transferring context: 51.03MB 0.6s done
#4 DONE 1.5s

#5 [ 1/16] FROM docker.io/library/eclipse-temurin:8@sha256:5840452260db162c2dd31033cb55575745861634b1be75a1d8cff559b6c8b942
#5 resolve docker.io/library/eclipse-temurin:8@sha256:5840452260db162c2dd31033cb55575745861634b1be75a1d8cff559b6c8b942 1.5s done
#5 CACHED

#6 [ 2/16] ADD target/slf4j-api.jar /opt/apache/beam/jars/
#6 DONE 2.1s

#7 [ 3/16] ADD target/slf4j-jdk14.jar /opt/apache/beam/jars/
#7 DONE 0.1s

#8 [ 4/16] ADD target/jcl-over-slf4j.jar /opt/apache/beam/jars/
#8 DONE 0.1s

#9 [ 5/16] ADD target/log4j-over-slf4j.jar /opt/apache/beam/jars/
#9 DONE 0.1s

#10 [ 6/16] ADD target/log4j-to-slf4j.jar /opt/apache/beam/jars/
#10 DONE 0.1s

#11 [ 7/16] ADD target/beam-sdks-java-harness.jar /opt/apache/beam/jars/
#11 DONE 0.1s

#12 [ 8/16] COPY target/jamm.jar target/open-module-agent*.jar /opt/apache/beam/jars/
#12 DONE 0.1s

#13 [ 9/16] COPY target/linux_amd64/boot /opt/apache/beam/
#13 DONE 0.2s

#14 [10/16] COPY target/LICENSE /opt/apache/beam/
#14 DONE 0.1s

#15 [11/16] COPY target/NOTICE /opt/apache/beam/
#15 DONE 0.1s

#16 [12/16] ADD target/third_party_licenses /opt/apache/beam/third_party_licenses/
#16 DONE 0.2s

#17 [13/16] COPY target/LICENSE target/options/* /opt/apache/beam/options/
#17 DONE 0.1s

#18 [14/16] COPY target/go-licenses/* /opt/apache/beam/third_party_licenses/golang/
#18 DONE 0.1s

#19 [15/16] RUN if [ "true" = "false" ] ; then     rm -rf /opt/apache/beam/third_party_licenses ;    fi
#19 DONE 0.7s

#20 [16/16] COPY target/profiler/* /opt/google_cloud_profiler/
#20 DONE 0.1s

#21 exporting to image
#21 exporting layers
#21 exporting layers 0.4s done
#21 writing image sha256:6b4d2d4fecd7f425777aff93cad64806d197e8a00bc697e7f414beae6d8587b9 done
#21 naming to docker.io/apache/beam_java8_sdk:2.52.0.dev done
#21 DONE 0.4s

> Task :runners:spark:3:job-server:validatesPortableRunnerBatch

org.apache.beam.sdk.transforms.CombineTest$WindowingTests > testCombineGloballyAsSingletonView FAILED
    java.lang.RuntimeException at CombineTest.java:1359

org.apache.beam.sdk.transforms.ParDoTest$LifecycleTests > testWindowingInStartAndFinishBundle FAILED
    java.lang.RuntimeException at ParDoTest.java:1800

[shutdown-hook-0] INFO org.apache.spark.util.ShutdownHookManager - Shutdown hook called
[shutdown-hook-0] INFO org.apache.spark.util.ShutdownHookManager - Deleting directory /tmp/spark-6ef4150a-ee58-4d99-b18f-cc3481e23915
[shutdown-hook-0] INFO org.apache.spark.util.ShutdownHookManager - Shutdown hook called
[shutdown-hook-0] INFO org.apache.spark.util.ShutdownHookManager - Deleting directory /tmp/spark-fafb9788-c9f8-443e-b121-9ca888b4d25c
[shutdown-hook-0] INFO org.apache.spark.util.ShutdownHookManager - Shutdown hook called
[shutdown-hook-0] INFO org.apache.spark.util.ShutdownHookManager - Deleting directory /tmp/spark-e4758bed-c18b-4538-9780-5f95d011c970
[shutdown-hook-0] INFO org.apache.spark.util.ShutdownHookManager - Shutdown hook called
[shutdown-hook-0] INFO org.apache.spark.util.ShutdownHookManager - Deleting directory /tmp/spark-81bd4b71-e7f4-4291-a851-371c211ae626

> Task :runners:spark:3:job-server:validatesPortableRunnerBatch

233 tests completed, 2 failed, 1 skipped

> Task :runners:spark:3:job-server:validatesPortableRunnerBatch FAILED
> Task :runners:spark:3:job-server:validatesPortableRunnerDocker FROM-CACHE

FAILURE: Build failed with an exception.

* What went wrong:
Execution failed for task ':runners:spark:3:job-server:validatesPortableRunnerBatch'.
> There were failing tests. See the report at: file://<https://ci-beam.apache.org/job/beam_PostCommit_Java_PVR_Spark_Batch/ws/src/runners/spark/3/job-server/build/reports/tests/validatesPortableRunnerBatch/index.html>

Deprecated Gradle features were used in this build, making it incompatible with Gradle 9.0.

You can use '--warning-mode all' to show the individual deprecation warnings and determine if they come from your own scripts or plugins.

For more on this, please refer to https://docs.gradle.org/8.4/userguide/command_line_interface.html#sec:command_line_warnings in the Gradle documentation.

BUILD FAILED in 1h 32m 54s
116 actionable tasks: 74 executed, 40 from cache, 2 up-to-date

Publishing build scan...
https://ge.apache.org/s/4zog3sz7muvay

Build step 'Invoke Gradle script' changed build result to FAILURE
Build step 'Invoke Gradle script' marked build as failure

---------------------------------------------------------------------
To unsubscribe, e-mail: builds-unsubscribe@beam.apache.org
For additional commands, e-mail: builds-help@beam.apache.org


Build failed in Jenkins: beam_PostCommit_Java_PVR_Spark_Batch #2681

Posted by Apache Jenkins Server <je...@builds.apache.org>.
See <https://ci-beam.apache.org/job/beam_PostCommit_Java_PVR_Spark_Batch/2681/display/redirect>

Changes:


------------------------------------------
[...truncated 54.91 KB...]

org.apache.beam.sdk.transforms.ParDoTest$MultipleInputsAndOutputTests > testSideInputAnnotationWithMultipleSideInputs FAILED
    java.lang.RuntimeException at ParDoTest.java:1179

org.apache.beam.sdk.transforms.ParDoTest$MultipleInputsAndOutputTests > testParDoWithEmptyTaggedOutput FAILED
    java.lang.RuntimeException at ParDoTest.java:789

[shutdown-hook-0] INFO org.apache.spark.util.ShutdownHookManager - Shutdown hook called
[shutdown-hook-0] INFO org.apache.spark.util.ShutdownHookManager - Deleting directory /tmp/spark-6de97263-4143-4ed3-bac7-63e06cb256ab

> Task :runners:spark:3:job-server:validatesPortableRunnerBatch

org.apache.beam.sdk.transforms.ParDoTest$StateTests > testCombiningState FAILED
    java.lang.RuntimeException at ParDoTest.java:3497

org.apache.beam.sdk.transforms.ParDoTest$StateTests > testValueStateSameId FAILED
    java.lang.RuntimeException at ParDoTest.java:2528

org.apache.beam.sdk.transforms.ParDoTest$StateTests > testValueStateSimple FAILED
    java.lang.RuntimeException at ParDoTest.java:2292

org.apache.beam.sdk.transforms.ParDoTest$StateTests > testValueStateTaggedOutput FAILED
    java.lang.RuntimeException at ParDoTest.java:2579

org.apache.beam.sdk.transforms.ParDoTest$StateTests > testBagStateSideInput FAILED
    java.lang.RuntimeException at ParDoTest.java:3583

org.apache.beam.sdk.transforms.ParDoTest$StateTests > testCombiningStateParameterSuperclass FAILED
    java.lang.RuntimeException at ParDoTest.java:3533

org.apache.beam.sdk.transforms.ParDoTest$StateTests > testCoderInferenceOfList FAILED
    java.lang.RuntimeException at ParDoTest.java:2429

org.apache.beam.sdk.transforms.ParDoTest$StateTests > testValueStateDedup FAILED
    java.lang.RuntimeException at ParDoTest.java:2342

org.apache.beam.sdk.transforms.ParDoTest$StateTests > testValueStateFixedWindows FAILED
    java.lang.RuntimeException at ParDoTest.java:2473

org.apache.beam.sdk.transforms.ParDoTest$TimestampTests > testParDoTaggedOutputWithTimestamp FAILED
    java.lang.RuntimeException at ParDoTest.java:2030

org.apache.beam.sdk.transforms.ParDoTest$TimestampTests > testParDoShiftTimestampUnlimited FAILED
    java.lang.RuntimeException at ParDoTest.java:2142

[shutdown-hook-0] INFO org.apache.spark.util.ShutdownHookManager - Shutdown hook called
[shutdown-hook-0] INFO org.apache.spark.util.ShutdownHookManager - Deleting directory /tmp/spark-a542a2f4-92b3-4208-b1e9-bc7e0ddb3819
[shutdown-hook-0] INFO org.apache.spark.util.ShutdownHookManager - Shutdown hook called
[shutdown-hook-0] INFO org.apache.spark.util.ShutdownHookManager - Deleting directory /tmp/spark-92175932-52e9-4dc6-bda2-1b6ffa585fd9
[shutdown-hook-0] INFO org.apache.spark.util.ShutdownHookManager - Shutdown hook called
[shutdown-hook-0] INFO org.apache.spark.util.ShutdownHookManager - Deleting directory /tmp/spark-2562e284-0460-4642-bba3-0159a3aa00b9
[pool-1002-thread-2] WARN org.apache.beam.fn.harness.control.ExecutionStateSampler - Operation ongoing in bundle 4 for at least 01h14m46s without outputting or completing:
  at sun.misc.Unsafe.park(Native Method)
  at java.util.concurrent.locks.LockSupport.park(LockSupport.java:175)
  at java.util.concurrent.locks.AbstractQueuedSynchronizer$ConditionObject.await(AbstractQueuedSynchronizer.java:2039)
  at org.apache.beam.sdk.fn.CancellableQueue.take(CancellableQueue.java:95)
  at org.apache.beam.sdk.fn.data.BeamFnDataInboundObserver.awaitCompletion(BeamFnDataInboundObserver.java:122)
  at org.apache.beam.fn.harness.control.ProcessBundleHandler.processBundle(ProcessBundleHandler.java:550)
  at org.apache.beam.fn.harness.FnHarness$$Lambda$1641/186305700.apply(Unknown Source)
  at org.apache.beam.fn.harness.control.BeamFnControlClient.delegateOnInstructionRequestType(BeamFnControlClient.java:150)
  at org.apache.beam.fn.harness.control.BeamFnControlClient$InboundObserver.lambda$onNext$0(BeamFnControlClient.java:115)
  at org.apache.beam.fn.harness.control.BeamFnControlClient$InboundObserver$$Lambda$1665/2030947185.run(Unknown Source)
  at java.util.concurrent.Executors$RunnableAdapter.call(Executors.java:511)
  at java.util.concurrent.FutureTask.run(FutureTask.java:266)
  at org.apache.beam.sdk.util.UnboundedScheduledExecutorService$ScheduledFutureTask.run(UnboundedScheduledExecutorService.java:163)
  at java.util.concurrent.ThreadPoolExecutor.runWorker(ThreadPoolExecutor.java:1149)
  at java.util.concurrent.ThreadPoolExecutor$Worker.run(ThreadPoolExecutor.java:624)
  at java.lang.Thread.run(Thread.java:750)
[pool-840-thread-2] WARN org.apache.beam.fn.harness.control.ExecutionStateSampler - Operation ongoing in bundle 4 for at least 01h18m50s without outputting or completing:
  at sun.misc.Unsafe.park(Native Method)
  at java.util.concurrent.locks.LockSupport.park(LockSupport.java:175)
  at java.util.concurrent.locks.AbstractQueuedSynchronizer$ConditionObject.await(AbstractQueuedSynchronizer.java:2039)
  at org.apache.beam.sdk.fn.CancellableQueue.take(CancellableQueue.java:95)
  at org.apache.beam.sdk.fn.data.BeamFnDataInboundObserver.awaitCompletion(BeamFnDataInboundObserver.java:122)
  at org.apache.beam.fn.harness.control.ProcessBundleHandler.processBundle(ProcessBundleHandler.java:550)
  at org.apache.beam.fn.harness.FnHarness$$Lambda$1641/186305700.apply(Unknown Source)
  at org.apache.beam.fn.harness.control.BeamFnControlClient.delegateOnInstructionRequestType(BeamFnControlClient.java:150)
  at org.apache.beam.fn.harness.control.BeamFnControlClient$InboundObserver.lambda$onNext$0(BeamFnControlClient.java:115)
  at org.apache.beam.fn.harness.control.BeamFnControlClient$InboundObserver$$Lambda$1665/2030947185.run(Unknown Source)
  at java.util.concurrent.Executors$RunnableAdapter.call(Executors.java:511)
  at java.util.concurrent.FutureTask.run(FutureTask.java:266)
  at org.apache.beam.sdk.util.UnboundedScheduledExecutorService$ScheduledFutureTask.run(UnboundedScheduledExecutorService.java:163)
  at java.util.concurrent.ThreadPoolExecutor.runWorker(ThreadPoolExecutor.java:1149)
  at java.util.concurrent.ThreadPoolExecutor$Worker.run(ThreadPoolExecutor.java:624)
  at java.lang.Thread.run(Thread.java:750)
[pool-975-thread-2] WARN org.apache.beam.fn.harness.control.ExecutionStateSampler - Operation ongoing in bundle 6 for at least 01h15m30s without outputting or completing:
  at sun.misc.Unsafe.park(Native Method)
  at java.util.concurrent.locks.LockSupport.park(LockSupport.java:175)
  at java.util.concurrent.locks.AbstractQueuedSynchronizer$ConditionObject.await(AbstractQueuedSynchronizer.java:2039)
  at org.apache.beam.sdk.fn.CancellableQueue.take(CancellableQueue.java:95)
  at org.apache.beam.sdk.fn.data.BeamFnDataInboundObserver.awaitCompletion(BeamFnDataInboundObserver.java:122)
  at org.apache.beam.fn.harness.control.ProcessBundleHandler.processBundle(ProcessBundleHandler.java:550)
  at org.apache.beam.fn.harness.FnHarness$$Lambda$1641/186305700.apply(Unknown Source)
  at org.apache.beam.fn.harness.control.BeamFnControlClient.delegateOnInstructionRequestType(BeamFnControlClient.java:150)
  at org.apache.beam.fn.harness.control.BeamFnControlClient$InboundObserver.lambda$onNext$0(BeamFnControlClient.java:115)
  at org.apache.beam.fn.harness.control.BeamFnControlClient$InboundObserver$$Lambda$1665/2030947185.run(Unknown Source)
  at java.util.concurrent.Executors$RunnableAdapter.call(Executors.java:511)
  at java.util.concurrent.FutureTask.run(FutureTask.java:266)
  at org.apache.beam.sdk.util.UnboundedScheduledExecutorService$ScheduledFutureTask.run(UnboundedScheduledExecutorService.java:163)
  at java.util.concurrent.ThreadPoolExecutor.runWorker(ThreadPoolExecutor.java:1149)
  at java.util.concurrent.ThreadPoolExecutor$Worker.run(ThreadPoolExecutor.java:624)
  at java.lang.Thread.run(Thread.java:750)
[pool-921-thread-2] WARN org.apache.beam.fn.harness.control.ExecutionStateSampler - Operation ongoing in bundle 5 for at least 01h17m01s without outputting or completing:
  at sun.misc.Unsafe.park(Native Method)
  at java.util.concurrent.locks.LockSupport.park(LockSupport.java:175)
  at java.util.concurrent.locks.AbstractQueuedSynchronizer$ConditionObject.await(AbstractQueuedSynchronizer.java:2039)
  at org.apache.beam.sdk.fn.CancellableQueue.take(CancellableQueue.java:95)
  at org.apache.beam.sdk.fn.data.BeamFnDataInboundObserver.awaitCompletion(BeamFnDataInboundObserver.java:122)
  at org.apache.beam.fn.harness.control.ProcessBundleHandler.processBundle(ProcessBundleHandler.java:550)
  at org.apache.beam.fn.harness.FnHarness$$Lambda$1641/186305700.apply(Unknown Source)
  at org.apache.beam.fn.harness.control.BeamFnControlClient.delegateOnInstructionRequestType(BeamFnControlClient.java:150)
  at org.apache.beam.fn.harness.control.BeamFnControlClient$InboundObserver.lambda$onNext$0(BeamFnControlClient.java:115)
  at org.apache.beam.fn.harness.control.BeamFnControlClient$InboundObserver$$Lambda$1665/2030947185.run(Unknown Source)
  at java.util.concurrent.Executors$RunnableAdapter.call(Executors.java:511)
  at java.util.concurrent.FutureTask.run(FutureTask.java:266)
  at org.apache.beam.sdk.util.UnboundedScheduledExecutorService$ScheduledFutureTask.run(UnboundedScheduledExecutorService.java:163)
  at java.util.concurrent.ThreadPoolExecutor.runWorker(ThreadPoolExecutor.java:1149)
  at java.util.concurrent.ThreadPoolExecutor$Worker.run(ThreadPoolExecutor.java:624)
  at java.lang.Thread.run(Thread.java:750)
[pool-894-thread-2] WARN org.apache.beam.fn.harness.control.ExecutionStateSampler - Operation ongoing in bundle 4 for at least 01h17m38s without outputting or completing:
  at sun.misc.Unsafe.park(Native Method)
  at java.util.concurrent.locks.LockSupport.park(LockSupport.java:175)
  at java.util.concurrent.locks.AbstractQueuedSynchronizer$ConditionObject.await(AbstractQueuedSynchronizer.java:2039)
  at org.apache.beam.sdk.fn.CancellableQueue.take(CancellableQueue.java:95)
  at org.apache.beam.sdk.fn.data.BeamFnDataInboundObserver.awaitCompletion(BeamFnDataInboundObserver.java:122)
  at org.apache.beam.fn.harness.control.ProcessBundleHandler.processBundle(ProcessBundleHandler.java:550)
  at org.apache.beam.fn.harness.FnHarness$$Lambda$1641/186305700.apply(Unknown Source)
  at org.apache.beam.fn.harness.control.BeamFnControlClient.delegateOnInstructionRequestType(BeamFnControlClient.java:150)
  at org.apache.beam.fn.harness.control.BeamFnControlClient$InboundObserver.lambda$onNext$0(BeamFnControlClient.java:115)
  at org.apache.beam.fn.harness.control.BeamFnControlClient$InboundObserver$$Lambda$1665/2030947185.run(Unknown Source)
  at java.util.concurrent.Executors$RunnableAdapter.call(Executors.java:511)
  at java.util.concurrent.FutureTask.run(FutureTask.java:266)
  at org.apache.beam.sdk.util.UnboundedScheduledExecutorService$ScheduledFutureTask.run(UnboundedScheduledExecutorService.java:163)
  at java.util.concurrent.ThreadPoolExecutor.runWorker(ThreadPoolExecutor.java:1149)
  at java.util.concurrent.ThreadPoolExecutor$Worker.run(ThreadPoolExecutor.java:624)
  at java.lang.Thread.run(Thread.java:750)
[pool-732-thread-2] WARN org.apache.beam.fn.harness.control.ExecutionStateSampler - Operation ongoing in bundle 2 for at least 01h21m22s without outputting or completing:
  at sun.misc.Unsafe.park(Native Method)
  at java.util.concurrent.locks.LockSupport.park(LockSupport.java:175)
  at java.util.concurrent.locks.AbstractQueuedSynchronizer$ConditionObject.await(AbstractQueuedSynchronizer.java:2039)
  at org.apache.beam.sdk.fn.CancellableQueue.take(CancellableQueue.java:95)
  at org.apache.beam.sdk.fn.data.BeamFnDataInboundObserver.awaitCompletion(BeamFnDataInboundObserver.java:122)
  at org.apache.beam.fn.harness.control.ProcessBundleHandler.processBundle(ProcessBundleHandler.java:550)
  at org.apache.beam.fn.harness.FnHarness$$Lambda$1641/186305700.apply(Unknown Source)
  at org.apache.beam.fn.harness.control.BeamFnControlClient.delegateOnInstructionRequestType(BeamFnControlClient.java:150)
  at org.apache.beam.fn.harness.control.BeamFnControlClient$InboundObserver.lambda$onNext$0(BeamFnControlClient.java:115)
  at org.apache.beam.fn.harness.control.BeamFnControlClient$InboundObserver$$Lambda$1665/2030947185.run(Unknown Source)
  at java.util.concurrent.Executors$RunnableAdapter.call(Executors.java:511)
  at java.util.concurrent.FutureTask.run(FutureTask.java:266)
  at org.apache.beam.sdk.util.UnboundedScheduledExecutorService$ScheduledFutureTask.run(UnboundedScheduledExecutorService.java:163)
  at java.util.concurrent.ThreadPoolExecutor.runWorker(ThreadPoolExecutor.java:1149)
  at java.util.concurrent.ThreadPoolExecutor$Worker.run(ThreadPoolExecutor.java:624)
  at java.lang.Thread.run(Thread.java:750)
[pool-1002-thread-2] WARN org.apache.beam.fn.harness.control.ExecutionStateSampler - Operation ongoing in bundle 4 for at least 01h14m46s without outputting or completing:
  at sun.misc.Unsafe.park(Native Method)
  at java.util.concurrent.locks.LockSupport.park(LockSupport.java:175)
  at java.util.concurrent.locks.AbstractQueuedSynchronizer$ConditionObject.await(AbstractQueuedSynchronizer.java:2039)
  at org.apache.beam.sdk.fn.CancellableQueue.take(CancellableQueue.java:95)
  at org.apache.beam.sdk.fn.data.BeamFnDataInboundObserver.awaitCompletion(BeamFnDataInboundObserver.java:122)
  at org.apache.beam.fn.harness.control.ProcessBundleHandler.processBundle(ProcessBundleHandler.java:550)
  at org.apache.beam.fn.harness.FnHarness$$Lambda$1641/186305700.apply(Unknown Source)
  at org.apache.beam.fn.harness.control.BeamFnControlClient.delegateOnInstructionRequestType(BeamFnControlClient.java:150)
  at org.apache.beam.fn.harness.control.BeamFnControlClient$InboundObserver.lambda$onNext$0(BeamFnControlClient.java:115)
  at org.apache.beam.fn.harness.control.BeamFnControlClient$InboundObserver$$Lambda$1665/2030947185.run(Unknown Source)
  at java.util.concurrent.Executors$RunnableAdapter.call(Executors.java:511)
  at java.util.concurrent.FutureTask.run(FutureTask.java:266)
  at org.apache.beam.sdk.util.UnboundedScheduledExecutorService$ScheduledFutureTask.run(UnboundedScheduledExecutorService.java:163)
  at java.util.concurrent.ThreadPoolExecutor.runWorker(ThreadPoolExecutor.java:1149)
  at java.util.concurrent.ThreadPoolExecutor$Worker.run(ThreadPoolExecutor.java:624)
  at java.lang.Thread.run(Thread.java:750)
[pool-840-thread-2] WARN org.apache.beam.fn.harness.control.ExecutionStateSampler - Operation ongoing in bundle 4 for at least 01h18m51s without outputting or completing:
  at sun.misc.Unsafe.park(Native Method)
  at java.util.concurrent.locks.LockSupport.park(LockSupport.java:175)
  at java.util.concurrent.locks.AbstractQueuedSynchronizer$ConditionObject.await(AbstractQueuedSynchronizer.java:2039)
  at org.apache.beam.sdk.fn.CancellableQueue.take(CancellableQueue.java:95)
  at org.apache.beam.sdk.fn.data.BeamFnDataInboundObserver.awaitCompletion(BeamFnDataInboundObserver.java:122)
  at org.apache.beam.fn.harness.control.ProcessBundleHandler.processBundle(ProcessBundleHandler.java:550)
  at org.apache.beam.fn.harness.FnHarness$$Lambda$1641/186305700.apply(Unknown Source)
  at org.apache.beam.fn.harness.control.BeamFnControlClient.delegateOnInstructionRequestType(BeamFnControlClient.java:150)
  at org.apache.beam.fn.harness.control.BeamFnControlClient$InboundObserver.lambda$onNext$0(BeamFnControlClient.java:115)
  at org.apache.beam.fn.harness.control.BeamFnControlClient$InboundObserver$$Lambda$1665/2030947185.run(Unknown Source)
  at java.util.concurrent.Executors$RunnableAdapter.call(Executors.java:511)
  at java.util.concurrent.FutureTask.run(FutureTask.java:266)
  at org.apache.beam.sdk.util.UnboundedScheduledExecutorService$ScheduledFutureTask.run(UnboundedScheduledExecutorService.java:163)
  at java.util.concurrent.ThreadPoolExecutor.runWorker(ThreadPoolExecutor.java:1149)
  at java.util.concurrent.ThreadPoolExecutor$Worker.run(ThreadPoolExecutor.java:624)
  at java.lang.Thread.run(Thread.java:750)
[pool-975-thread-2] WARN org.apache.beam.fn.harness.control.ExecutionStateSampler - Operation ongoing in bundle 6 for at least 01h15m31s without outputting or completing:
  at sun.misc.Unsafe.park(Native Method)
  at java.util.concurrent.locks.LockSupport.park(LockSupport.java:175)
  at java.util.concurrent.locks.AbstractQueuedSynchronizer$ConditionObject.await(AbstractQueuedSynchronizer.java:2039)
  at org.apache.beam.sdk.fn.CancellableQueue.take(CancellableQueue.java:95)
  at org.apache.beam.sdk.fn.data.BeamFnDataInboundObserver.awaitCompletion(BeamFnDataInboundObserver.java:122)
  at org.apache.beam.fn.harness.control.ProcessBundleHandler.processBundle(ProcessBundleHandler.java:550)
  at org.apache.beam.fn.harness.FnHarness$$Lambda$1641/186305700.apply(Unknown Source)
  at org.apache.beam.fn.harness.control.BeamFnControlClient.delegateOnInstructionRequestType(BeamFnControlClient.java:150)
  at org.apache.beam.fn.harness.control.BeamFnControlClient$InboundObserver.lambda$onNext$0(BeamFnControlClient.java:115)
  at org.apache.beam.fn.harness.control.BeamFnControlClient$InboundObserver$$Lambda$1665/2030947185.run(Unknown Source)
  at java.util.concurrent.Executors$RunnableAdapter.call(Executors.java:511)
  at java.util.concurrent.FutureTask.run(FutureTask.java:266)
  at org.apache.beam.sdk.util.UnboundedScheduledExecutorService$ScheduledFutureTask.run(UnboundedScheduledExecutorService.java:163)
  at java.util.concurrent.ThreadPoolExecutor.runWorker(ThreadPoolExecutor.java:1149)
  at java.util.concurrent.ThreadPoolExecutor$Worker.run(ThreadPoolExecutor.java:624)
  at java.lang.Thread.run(Thread.java:750)
[pool-921-thread-2] WARN org.apache.beam.fn.harness.control.ExecutionStateSampler - Operation ongoing in bundle 5 for at least 01h17m01s without outputting or completing:
  at sun.misc.Unsafe.park(Native Method)
  at java.util.concurrent.locks.LockSupport.park(LockSupport.java:175)
  at java.util.concurrent.locks.AbstractQueuedSynchronizer$ConditionObject.await(AbstractQueuedSynchronizer.java:2039)
  at org.apache.beam.sdk.fn.CancellableQueue.take(CancellableQueue.java:95)
  at org.apache.beam.sdk.fn.data.BeamFnDataInboundObserver.awaitCompletion(BeamFnDataInboundObserver.java:122)
  at org.apache.beam.fn.harness.control.ProcessBundleHandler.processBundle(ProcessBundleHandler.java:550)
  at org.apache.beam.fn.harness.FnHarness$$Lambda$1641/186305700.apply(Unknown Source)
  at org.apache.beam.fn.harness.control.BeamFnControlClient.delegateOnInstructionRequestType(BeamFnControlClient.java:150)
  at org.apache.beam.fn.harness.control.BeamFnControlClient$InboundObserver.lambda$onNext$0(BeamFnControlClient.java:115)
  at org.apache.beam.fn.harness.control.BeamFnControlClient$InboundObserver$$Lambda$1665/2030947185.run(Unknown Source)
  at java.util.concurrent.Executors$RunnableAdapter.call(Executors.java:511)
  at java.util.concurrent.FutureTask.run(FutureTask.java:266)
  at org.apache.beam.sdk.util.UnboundedScheduledExecutorService$ScheduledFutureTask.run(UnboundedScheduledExecutorService.java:163)
  at java.util.concurrent.ThreadPoolExecutor.runWorker(ThreadPoolExecutor.java:1149)
  at java.util.concurrent.ThreadPoolExecutor$Worker.run(ThreadPoolExecutor.java:624)
  at java.lang.Thread.run(Thread.java:750)

> Task :runners:spark:3:job-server:validatesPortableRunnerBatch

233 tests completed, 19 failed, 1 skipped

> Task :runners:spark:3:job-server:validatesPortableRunnerBatch FAILED
> Task :runners:spark:3:job-server:validatesPortableRunnerDocker FROM-CACHE

FAILURE: Build failed with an exception.

* What went wrong:
Execution failed for task ':runners:spark:3:job-server:validatesPortableRunnerBatch'.
> There were failing tests. See the report at: file://<https://ci-beam.apache.org/job/beam_PostCommit_Java_PVR_Spark_Batch/ws/src/runners/spark/3/job-server/build/reports/tests/validatesPortableRunnerBatch/index.html>

Deprecated Gradle features were used in this build, making it incompatible with Gradle 9.0.

You can use '--warning-mode all' to show the individual deprecation warnings and determine if they come from your own scripts or plugins.

For more on this, please refer to https://docs.gradle.org/8.4/userguide/command_line_interface.html#sec:command_line_warnings in the Gradle documentation.

BUILD FAILED in 1h 33m 34s
116 actionable tasks: 74 executed, 40 from cache, 2 up-to-date

Publishing build scan...
https://ge.apache.org/s/tgiqetf66eqwm

Build step 'Invoke Gradle script' changed build result to FAILURE
Build step 'Invoke Gradle script' marked build as failure

---------------------------------------------------------------------
To unsubscribe, e-mail: builds-unsubscribe@beam.apache.org
For additional commands, e-mail: builds-help@beam.apache.org


Build failed in Jenkins: beam_PostCommit_Java_PVR_Spark_Batch #2680

Posted by Apache Jenkins Server <je...@builds.apache.org>.
See <https://ci-beam.apache.org/job/beam_PostCommit_Java_PVR_Spark_Batch/2680/display/redirect>

Changes:


------------------------------------------
[...truncated 48.21 KB...]
go: downloading github.com/golang/protobuf v1.5.3
go: downloading google.golang.org/protobuf v1.31.0
go: downloading golang.org/x/sys v0.12.0
go: downloading google.golang.org/genproto/googleapis/rpc v0.0.0-20230913181813-007df8e322eb
go: downloading golang.org/x/net v0.15.0
go: downloading google.golang.org/genproto v0.0.0-20230821184602-ccc8af3d0e93
go: downloading golang.org/x/text v0.13.0
go: added github.com/apache/beam/sdks/v2 v2.51.0
go: added github.com/golang/protobuf v1.5.3
go: added golang.org/x/net v0.15.0
go: added golang.org/x/sys v0.12.0
go: added golang.org/x/text v0.13.0
go: added google.golang.org/genproto/googleapis/rpc v0.0.0-20230913181813-007df8e322eb
go: added google.golang.org/grpc v1.58.1
go: added google.golang.org/protobuf v1.31.0
+ go-licenses save github.com/apache/beam/sdks/v2/java/container --save_path=/output/licenses
W1029 04:21:14.165339      33 library.go:101] "golang.org/x/sys/unix" contains non-Go code that can't be inspected for further dependencies:
/go/pkg/mod/golang.org/x/sys@v0.12.0/unix/asm_linux_amd64.s
+ go-licenses csv github.com/apache/beam/sdks/v2/java/container
+ tee /output/licenses/list.csv
W1029 04:21:21.982399      70 library.go:101] "golang.org/x/sys/unix" contains non-Go code that can't be inspected for further dependencies:
/go/pkg/mod/golang.org/x/sys@v0.12.0/unix/asm_linux_amd64.s

> Task :runners:spark:3:job-server:validatesPortableRunnerBatch

> Task :release:go-licenses:java:dockerRun
github.com/apache/beam/sdks/v2/go,https://github.com/apache/beam/blob/sdks/v2.51.0/sdks/go/README.md,Apache-2.0
github.com/apache/beam/sdks/v2/java/container,https://github.com/apache/beam/blob/sdks/v2.51.0/sdks/LICENSE,Apache-2.0
github.com/golang/protobuf,https://github.com/golang/protobuf/blob/v1.5.3/LICENSE,BSD-3-Clause
golang.org/x/net,https://cs.opensource.google/go/x/net/+/v0.15.0:LICENSE,BSD-3-Clause
golang.org/x/sys/unix,https://cs.opensource.google/go/x/sys/+/v0.12.0:LICENSE,BSD-3-Clause
golang.org/x/text,https://cs.opensource.google/go/x/text/+/v0.13.0:LICENSE,BSD-3-Clause
google.golang.org/genproto/googleapis/rpc/status,https://github.com/googleapis/go-genproto/blob/007df8e322eb/googleapis/rpc/LICENSE,Apache-2.0
google.golang.org/grpc,https://github.com/grpc/grpc-go/blob/v1.58.1/LICENSE,Apache-2.0
google.golang.org/protobuf,https://github.com/protocolbuffers/protobuf-go/blob/v1.31.0/LICENSE,BSD-3-Clause
+ chmod -R a+w /output/licenses

> Task :release:go-licenses:java:createLicenses
> Task :sdks:java:container:java8:copyGolangLicenses
> Task :sdks:java:container:java8:dockerPrepare

> Task :sdks:java:container:java8:docker
#1 [internal] load .dockerignore
#1 transferring context: 2B done
#1 ...

#2 [internal] load build definition from Dockerfile
#2 transferring dockerfile: 2.59kB done
#2 DONE 1.1s

#1 [internal] load .dockerignore
#1 DONE 1.1s

#3 [internal] load metadata for docker.io/library/eclipse-temurin:8
#3 DONE 0.5s

#4 [ 1/16] FROM docker.io/library/eclipse-temurin:8@sha256:5840452260db162c2dd31033cb55575745861634b1be75a1d8cff559b6c8b942
#4 resolve docker.io/library/eclipse-temurin:8@sha256:5840452260db162c2dd31033cb55575745861634b1be75a1d8cff559b6c8b942 0.0s done
#4 CACHED

#5 [internal] load build context
#5 transferring context: 51.03MB 0.6s done
#5 DONE 1.2s

#6 [ 2/16] ADD target/slf4j-api.jar /opt/apache/beam/jars/
#6 DONE 4.8s

#7 [ 3/16] ADD target/slf4j-jdk14.jar /opt/apache/beam/jars/
#7 DONE 2.6s

#8 [ 4/16] ADD target/jcl-over-slf4j.jar /opt/apache/beam/jars/
#8 DONE 0.1s

#9 [ 5/16] ADD target/log4j-over-slf4j.jar /opt/apache/beam/jars/
#9 DONE 0.1s

#10 [ 6/16] ADD target/log4j-to-slf4j.jar /opt/apache/beam/jars/
#10 DONE 0.1s

#11 [ 7/16] ADD target/beam-sdks-java-harness.jar /opt/apache/beam/jars/
#11 DONE 0.1s

#12 [ 8/16] COPY target/jamm.jar target/open-module-agent*.jar /opt/apache/beam/jars/
#12 DONE 0.1s

#13 [ 9/16] COPY target/linux_amd64/boot /opt/apache/beam/
#13 DONE 0.2s

#14 [10/16] COPY target/LICENSE /opt/apache/beam/
#14 DONE 0.1s

#15 [11/16] COPY target/NOTICE /opt/apache/beam/
#15 DONE 0.1s

#16 [12/16] ADD target/third_party_licenses /opt/apache/beam/third_party_licenses/
#16 DONE 0.2s

#17 [13/16] COPY target/LICENSE target/options/* /opt/apache/beam/options/
#17 DONE 0.1s

#18 [14/16] COPY target/go-licenses/* /opt/apache/beam/third_party_licenses/golang/
#18 DONE 0.1s

#19 [15/16] RUN if [ "true" = "false" ] ; then     rm -rf /opt/apache/beam/third_party_licenses ;    fi
#19 DONE 1.2s

#20 [16/16] COPY target/profiler/* /opt/google_cloud_profiler/
#20 DONE 0.2s

#21 exporting to image
#21 exporting layers
#21 exporting layers 0.3s done
#21 writing image sha256:e0c114aacee1f2d7af936c4381f48620956e74f80d2e94ce4bea20c999213b36 done
#21 naming to docker.io/apache/beam_java8_sdk:2.52.0.dev done
#21 DONE 0.3s

> Task :runners:spark:3:job-server:validatesPortableRunnerBatch

org.apache.beam.sdk.transforms.ParDoTest$TimerCoderInferenceTests > testValueStateCoderInferenceFromInputCoder FAILED
    java.lang.RuntimeException at ParDoTest.java:6375

[shutdown-hook-0] INFO org.apache.spark.util.ShutdownHookManager - Shutdown hook called
[shutdown-hook-0] INFO org.apache.spark.util.ShutdownHookManager - Deleting directory /tmp/spark-c2be78a3-50dd-40be-9142-7828a3347d90

> Task :runners:spark:3:job-server:validatesPortableRunnerBatch

org.apache.beam.sdk.transforms.ParDoTest$StateCoderInferenceTests > testBagStateCoderInference FAILED
    java.lang.RuntimeException at ParDoTest.java:3915

org.apache.beam.sdk.transforms.ParDoTest$TimerTests > testOutputTimestampDefaultBounded FAILED
    java.lang.RuntimeException at ParDoTest.java:4862

org.apache.beam.sdk.transforms.ParDoTest$TimerTests > testEventTimeTimerAbsolute FAILED
    java.lang.RuntimeException at ParDoTest.java:4643

org.apache.beam.sdk.transforms.ParDoTest$TimerTests > testTimerReceivedInOriginalWindow FAILED
    java.lang.RuntimeException at ParDoTest.java:4609

org.apache.beam.sdk.transforms.ParDoTest$TimerTests > testNoOutputTimestampDefaultStreaming FAILED
    java.lang.RuntimeException at ParDoTest.java:4912

org.apache.beam.sdk.transforms.ParDoTest$TimerTests > testEventTimeTimerMultipleKeys FAILED
    java.lang.RuntimeException at ParDoTest.java:4778

org.apache.beam.sdk.transforms.ParDoTest$TimerTests > testPipelineOptionsParameterOnTimer FAILED
    java.lang.RuntimeException at ParDoTest.java:5491

[shutdown-hook-0] INFO org.apache.spark.util.ShutdownHookManager - Shutdown hook called
[shutdown-hook-0] INFO org.apache.spark.util.ShutdownHookManager - Deleting directory /tmp/spark-cc38e157-7432-41d2-a88e-12d72b00e46b
[shutdown-hook-0] INFO org.apache.spark.util.ShutdownHookManager - Shutdown hook called
[shutdown-hook-0] INFO org.apache.spark.util.ShutdownHookManager - Deleting directory /tmp/spark-a964f4c8-8df7-4849-9274-f5313909223d
[pool-1164-thread-2] WARN org.apache.beam.fn.harness.control.ExecutionStateSampler - Operation ongoing in bundle 3 for at least 07m38s without outputting or completing:
  at sun.misc.Unsafe.park(Native Method)
  at java.util.concurrent.locks.LockSupport.park(LockSupport.java:175)
  at java.util.concurrent.locks.AbstractQueuedSynchronizer$ConditionObject.await(AbstractQueuedSynchronizer.java:2039)
  at org.apache.beam.sdk.fn.CancellableQueue.take(CancellableQueue.java:95)
  at org.apache.beam.sdk.fn.data.BeamFnDataInboundObserver.awaitCompletion(BeamFnDataInboundObserver.java:122)
  at org.apache.beam.fn.harness.control.ProcessBundleHandler.processBundle(ProcessBundleHandler.java:550)
  at org.apache.beam.fn.harness.FnHarness$$Lambda$1492/1533164728.apply(Unknown Source)
  at org.apache.beam.fn.harness.control.BeamFnControlClient.delegateOnInstructionRequestType(BeamFnControlClient.java:150)
  at org.apache.beam.fn.harness.control.BeamFnControlClient$InboundObserver.lambda$onNext$0(BeamFnControlClient.java:115)
  at org.apache.beam.fn.harness.control.BeamFnControlClient$InboundObserver$$Lambda$1516/1389289241.run(Unknown Source)
  at java.util.concurrent.Executors$RunnableAdapter.call(Executors.java:511)
  at java.util.concurrent.FutureTask.run(FutureTask.java:266)
  at org.apache.beam.sdk.util.UnboundedScheduledExecutorService$ScheduledFutureTask.run(UnboundedScheduledExecutorService.java:163)
  at java.util.concurrent.ThreadPoolExecutor.runWorker(ThreadPoolExecutor.java:1149)
  at java.util.concurrent.ThreadPoolExecutor$Worker.run(ThreadPoolExecutor.java:624)
  at java.lang.Thread.run(Thread.java:750)
[pool-867-thread-2] WARN org.apache.beam.fn.harness.control.ExecutionStateSampler - Operation ongoing in bundle 3 for at least 15m59s without outputting or completing:
  at sun.misc.Unsafe.park(Native Method)
  at java.util.concurrent.locks.LockSupport.park(LockSupport.java:175)
  at java.util.concurrent.locks.AbstractQueuedSynchronizer$ConditionObject.await(AbstractQueuedSynchronizer.java:2039)
  at org.apache.beam.sdk.fn.CancellableQueue.take(CancellableQueue.java:95)
  at org.apache.beam.sdk.fn.data.BeamFnDataInboundObserver.awaitCompletion(BeamFnDataInboundObserver.java:122)
  at org.apache.beam.fn.harness.control.ProcessBundleHandler.processBundle(ProcessBundleHandler.java:550)
  at org.apache.beam.fn.harness.FnHarness$$Lambda$1492/1533164728.apply(Unknown Source)
  at org.apache.beam.fn.harness.control.BeamFnControlClient.delegateOnInstructionRequestType(BeamFnControlClient.java:150)
  at org.apache.beam.fn.harness.control.BeamFnControlClient$InboundObserver.lambda$onNext$0(BeamFnControlClient.java:115)
  at org.apache.beam.fn.harness.control.BeamFnControlClient$InboundObserver$$Lambda$1516/1389289241.run(Unknown Source)
  at java.util.concurrent.Executors$RunnableAdapter.call(Executors.java:511)
  at java.util.concurrent.FutureTask.run(FutureTask.java:266)
  at org.apache.beam.sdk.util.UnboundedScheduledExecutorService$ScheduledFutureTask.run(UnboundedScheduledExecutorService.java:163)
  at java.util.concurrent.ThreadPoolExecutor.runWorker(ThreadPoolExecutor.java:1149)
  at java.util.concurrent.ThreadPoolExecutor$Worker.run(ThreadPoolExecutor.java:624)
  at java.lang.Thread.run(Thread.java:750)
[pool-840-thread-2] WARN org.apache.beam.fn.harness.control.ExecutionStateSampler - Operation ongoing in bundle 3 for at least 16m36s without outputting or completing:
  at sun.misc.Unsafe.park(Native Method)
  at java.util.concurrent.locks.LockSupport.park(LockSupport.java:175)
  at java.util.concurrent.locks.AbstractQueuedSynchronizer$ConditionObject.await(AbstractQueuedSynchronizer.java:2039)
  at org.apache.beam.sdk.fn.CancellableQueue.take(CancellableQueue.java:95)
  at org.apache.beam.sdk.fn.data.BeamFnDataInboundObserver.awaitCompletion(BeamFnDataInboundObserver.java:122)
  at org.apache.beam.fn.harness.control.ProcessBundleHandler.processBundle(ProcessBundleHandler.java:550)
  at org.apache.beam.fn.harness.FnHarness$$Lambda$1492/1533164728.apply(Unknown Source)
  at org.apache.beam.fn.harness.control.BeamFnControlClient.delegateOnInstructionRequestType(BeamFnControlClient.java:150)
  at org.apache.beam.fn.harness.control.BeamFnControlClient$InboundObserver.lambda$onNext$0(BeamFnControlClient.java:115)
  at org.apache.beam.fn.harness.control.BeamFnControlClient$InboundObserver$$Lambda$1516/1389289241.run(Unknown Source)
  at java.util.concurrent.Executors$RunnableAdapter.call(Executors.java:511)
  at java.util.concurrent.FutureTask.run(FutureTask.java:266)
  at org.apache.beam.sdk.util.UnboundedScheduledExecutorService$ScheduledFutureTask.run(UnboundedScheduledExecutorService.java:163)
  at java.util.concurrent.ThreadPoolExecutor.runWorker(ThreadPoolExecutor.java:1149)
  at java.util.concurrent.ThreadPoolExecutor$Worker.run(ThreadPoolExecutor.java:624)
  at java.lang.Thread.run(Thread.java:750)
[pool-1164-thread-2] WARN org.apache.beam.fn.harness.control.ExecutionStateSampler - Operation ongoing in bundle 3 for at least 07m38s without outputting or completing:
  at sun.misc.Unsafe.park(Native Method)
  at java.util.concurrent.locks.LockSupport.park(LockSupport.java:175)
  at java.util.concurrent.locks.AbstractQueuedSynchronizer$ConditionObject.await(AbstractQueuedSynchronizer.java:2039)
  at org.apache.beam.sdk.fn.CancellableQueue.take(CancellableQueue.java:95)
  at org.apache.beam.sdk.fn.data.BeamFnDataInboundObserver.awaitCompletion(BeamFnDataInboundObserver.java:122)
  at org.apache.beam.fn.harness.control.ProcessBundleHandler.processBundle(ProcessBundleHandler.java:550)
  at org.apache.beam.fn.harness.FnHarness$$Lambda$1492/1533164728.apply(Unknown Source)
  at org.apache.beam.fn.harness.control.BeamFnControlClient.delegateOnInstructionRequestType(BeamFnControlClient.java:150)
  at org.apache.beam.fn.harness.control.BeamFnControlClient$InboundObserver.lambda$onNext$0(BeamFnControlClient.java:115)
  at org.apache.beam.fn.harness.control.BeamFnControlClient$InboundObserver$$Lambda$1516/1389289241.run(Unknown Source)
  at java.util.concurrent.Executors$RunnableAdapter.call(Executors.java:511)
  at java.util.concurrent.FutureTask.run(FutureTask.java:266)
  at org.apache.beam.sdk.util.UnboundedScheduledExecutorService$ScheduledFutureTask.run(UnboundedScheduledExecutorService.java:163)
  at java.util.concurrent.ThreadPoolExecutor.runWorker(ThreadPoolExecutor.java:1149)
  at java.util.concurrent.ThreadPoolExecutor$Worker.run(ThreadPoolExecutor.java:624)
  at java.lang.Thread.run(Thread.java:750)
[shutdown-hook-0] INFO org.apache.spark.util.ShutdownHookManager - Shutdown hook called
[shutdown-hook-0] INFO org.apache.spark.util.ShutdownHookManager - Deleting directory /tmp/spark-e67702ad-8288-4797-9af8-ceadc5b1b5b5

> Task :runners:spark:3:job-server:validatesPortableRunnerBatch

233 tests completed, 8 failed, 1 skipped

> Task :runners:spark:3:job-server:validatesPortableRunnerBatch FAILED
> Task :runners:spark:3:job-server:validatesPortableRunnerDocker FROM-CACHE

FAILURE: Build failed with an exception.

* What went wrong:
Execution failed for task ':runners:spark:3:job-server:validatesPortableRunnerBatch'.
> There were failing tests. See the report at: file://<https://ci-beam.apache.org/job/beam_PostCommit_Java_PVR_Spark_Batch/ws/src/runners/spark/3/job-server/build/reports/tests/validatesPortableRunnerBatch/index.html>

Deprecated Gradle features were used in this build, making it incompatible with Gradle 9.0.

You can use '--warning-mode all' to show the individual deprecation warnings and determine if they come from your own scripts or plugins.

For more on this, please refer to https://docs.gradle.org/8.4/userguide/command_line_interface.html#sec:command_line_warnings in the Gradle documentation.

BUILD FAILED in 1h 34m 20s
116 actionable tasks: 74 executed, 40 from cache, 2 up-to-date

Publishing build scan...
https://ge.apache.org/s/iwmnfb7qkk4ss

Build step 'Invoke Gradle script' changed build result to FAILURE
Build step 'Invoke Gradle script' marked build as failure

---------------------------------------------------------------------
To unsubscribe, e-mail: builds-unsubscribe@beam.apache.org
For additional commands, e-mail: builds-help@beam.apache.org


Build failed in Jenkins: beam_PostCommit_Java_PVR_Spark_Batch #2679

Posted by Apache Jenkins Server <je...@builds.apache.org>.
See <https://ci-beam.apache.org/job/beam_PostCommit_Java_PVR_Spark_Batch/2679/display/redirect>

Changes:


------------------------------------------
[...truncated 40.37 KB...]
> Task :sdks:java:container:java8:dockerClean UP-TO-DATE
> Task :release:go-licenses:java:dockerClean UP-TO-DATE
> Task :release:go-licenses:java:dockerPrepare

> Task :release:go-licenses:java:docker
#1 [internal] load build definition from Dockerfile
#1 transferring dockerfile: 1.24kB done
#1 DONE 0.0s

#2 [internal] load .dockerignore
#2 transferring context: 2B done
#2 DONE 0.0s

#3 [internal] load metadata for docker.io/library/golang:1.20-bullseye
#3 DONE 0.3s

#4 [1/5] FROM docker.io/library/golang:1.20-bullseye@sha256:082569b3303b164cc4a7c88ac59b19b69c1a5d662041ac0dca046ac239632442
#4 resolve docker.io/library/golang:1.20-bullseye@sha256:082569b3303b164cc4a7c88ac59b19b69c1a5d662041ac0dca046ac239632442 0.0s done
#4 DONE 0.0s

#5 [internal] load build context
#5 transferring context: 1.96kB 0.0s done
#5 DONE 0.0s

#6 [2/5] WORKDIR /usr/src/app
#6 CACHED

#7 [3/5] COPY go.mod ./
#7 CACHED

#8 [4/5] RUN go install github.com/google/go-licenses@latest
#8 CACHED

#9 [5/5] COPY get-licenses.sh /opt/apache/beam/
#9 CACHED

#10 exporting to image
#10 exporting layers done
#10 writing image sha256:6da5749ca4d996017cb613d5dd6fd97b13df3f15aca078bfcde5caaf7666674a done
#10 naming to docker.io/library/golicenses-java done
#10 DONE 0.0s

> Task :sdks:java:container:pullLicenses
  Attempting uninstall: setuptools
    Found existing installation: setuptools 44.0.0
    Uninstalling setuptools-44.0.0:
      Successfully uninstalled setuptools-44.0.0
Successfully installed pip-23.3.1 setuptools-68.2.2 wheel-0.41.2
Collecting beautifulsoup4<5.0,>=4.9.0 (from -r <https://ci-beam.apache.org/job/beam_PostCommit_Java_PVR_Spark_Batch/ws/src/sdks/java/container/license_scripts/requirement.txt> (line 19))
  Using cached beautifulsoup4-4.12.2-py3-none-any.whl (142 kB)
Collecting pyyaml<7,>=6.0.1 (from -r <https://ci-beam.apache.org/job/beam_PostCommit_Java_PVR_Spark_Batch/ws/src/sdks/java/container/license_scripts/requirement.txt> (line 20))
  Using cached PyYAML-6.0.1-cp38-cp38-manylinux_2_17_x86_64.manylinux2014_x86_64.whl.metadata (2.1 kB)
Collecting tenacity<9.0,>=6.1.0 (from -r <https://ci-beam.apache.org/job/beam_PostCommit_Java_PVR_Spark_Batch/ws/src/sdks/java/container/license_scripts/requirement.txt> (line 21))
  Using cached tenacity-8.2.3-py3-none-any.whl.metadata (1.0 kB)
Collecting soupsieve>1.2 (from beautifulsoup4<5.0,>=4.9.0->-r <https://ci-beam.apache.org/job/beam_PostCommit_Java_PVR_Spark_Batch/ws/src/sdks/java/container/license_scripts/requirement.txt> (line 19))
  Using cached soupsieve-2.5-py3-none-any.whl.metadata (4.7 kB)
Using cached PyYAML-6.0.1-cp38-cp38-manylinux_2_17_x86_64.manylinux2014_x86_64.whl (736 kB)
Using cached tenacity-8.2.3-py3-none-any.whl (24 kB)
Using cached soupsieve-2.5-py3-none-any.whl (36 kB)
Installing collected packages: tenacity, soupsieve, pyyaml, beautifulsoup4
Successfully installed beautifulsoup4-4.12.2 pyyaml-6.0.1 soupsieve-2.5 tenacity-8.2.3
Executing python <https://ci-beam.apache.org/job/beam_PostCommit_Java_PVR_Spark_Batch/ws/src/sdks/java/container/license_scripts/pull_licenses_java.py> --license_index=<https://ci-beam.apache.org/job/beam_PostCommit_Java_PVR_Spark_Batch/ws/src/sdks/java/container/build/reports/dependency-license/index.json>        --output_dir=<https://ci-beam.apache.org/job/beam_PostCommit_Java_PVR_Spark_Batch/ws/src/sdks/java/container/build/target/java_third_party_licenses>        --dep_url_yaml=<https://ci-beam.apache.org/job/beam_PostCommit_Java_PVR_Spark_Batch/ws/src/sdks/java/container/license_scripts/dep_urls_java.yaml>        --manual_license_path=<https://ci-beam.apache.org/job/beam_PostCommit_Java_PVR_Spark_Batch/ws/src/sdks/java/container/license_scripts/manual_licenses>
INFO:root:Pulling license for 125 dependencies using 16 threads.
INFO:root:Replaced local file URL with file://<https://ci-beam.apache.org/job/beam_PostCommit_Java_PVR_Spark_Batch/ws/src/sdks/java/container/license_scripts/manual_licenses/xz/COPYING> for xz-1.5
INFO:root:pull_licenses_java.py succeed. It took 1.397619 seconds with 16 threads.
Copying licenses from <https://ci-beam.apache.org/job/beam_PostCommit_Java_PVR_Spark_Batch/ws/src/sdks/java/container/build/target/java_third_party_licenses> to <https://ci-beam.apache.org/job/beam_PostCommit_Java_PVR_Spark_Batch/ws/src/sdks/java/container/build/target/third_party_licenses.>
Finished license_scripts.sh

> Task :release:go-licenses:java:dockerRun
+ rm -rf '/output/*'
+ go get github.com/apache/beam/sdks/v2/java/container
go: downloading github.com/apache/beam/sdks/v2 v2.51.0
go: downloading github.com/apache/beam v2.51.0+incompatible

> Task :sdks:java:container:downloadCloudProfilerAgent
  % Total    % Received % Xferd  Average Speed   Time    Time     Time  Current
                                 Dload  Upload   Total   Spent    Left  Speed
  0     0    0     0    0     0      0      0 --:--:-- --:--:-- --:--:--     0version.txt
NOTICES
profiler_java_agent.so
100 4183k  100 4183k    0     0  25.3M      0 --:--:-- --:--:-- --:--:-- 25.3M

> Task :sdks:java:container:goPrepare UP-TO-DATE
> Task :sdks:java:container:java8:copyJavaThirdPartyLicenses

> Task :sdks:java:container:goBuild
/home/jenkins/go/bin/go1.21.3 build -o ./build/target/linux_amd64/boot boot.go boot_test.go pathingjar.go pathingjar_test.go

> Task :sdks:java:container:java8:copySdkHarnessLauncher

> Task :release:go-licenses:java:dockerRun
go: downloading github.com/golang/protobuf v1.5.3
go: downloading google.golang.org/grpc v1.58.1
go: downloading google.golang.org/protobuf v1.31.0
go: downloading golang.org/x/sys v0.12.0
go: downloading golang.org/x/net v0.15.0
go: downloading google.golang.org/genproto/googleapis/rpc v0.0.0-20230913181813-007df8e322eb
go: downloading google.golang.org/genproto v0.0.0-20230821184602-ccc8af3d0e93
go: downloading golang.org/x/text v0.13.0
go: added github.com/apache/beam/sdks/v2 v2.51.0
go: added github.com/golang/protobuf v1.5.3
go: added golang.org/x/net v0.15.0
go: added golang.org/x/sys v0.12.0
go: added golang.org/x/text v0.13.0
go: added google.golang.org/genproto/googleapis/rpc v0.0.0-20230913181813-007df8e322eb
go: added google.golang.org/grpc v1.58.1
go: added google.golang.org/protobuf v1.31.0
+ go-licenses save github.com/apache/beam/sdks/v2/java/container --save_path=/output/licenses
W1028 22:21:13.309311      39 library.go:101] "golang.org/x/sys/unix" contains non-Go code that can't be inspected for further dependencies:
/go/pkg/mod/golang.org/x/sys@v0.12.0/unix/asm_linux_amd64.s
+ go-licenses csv github.com/apache/beam/sdks/v2/java/container
+ tee /output/licenses/list.csv
W1028 22:21:20.099981      78 library.go:101] "golang.org/x/sys/unix" contains non-Go code that can't be inspected for further dependencies:
/go/pkg/mod/golang.org/x/sys@v0.12.0/unix/asm_linux_amd64.s
github.com/apache/beam/sdks/v2/go,https://github.com/apache/beam/blob/sdks/v2.51.0/sdks/go/README.md,Apache-2.0
github.com/apache/beam/sdks/v2/java/container,https://github.com/apache/beam/blob/sdks/v2.51.0/sdks/LICENSE,Apache-2.0
github.com/golang/protobuf,https://github.com/golang/protobuf/blob/v1.5.3/LICENSE,BSD-3-Clause
golang.org/x/net,https://cs.opensource.google/go/x/net/+/v0.15.0:LICENSE,BSD-3-Clause
golang.org/x/sys/unix,https://cs.opensource.google/go/x/sys/+/v0.12.0:LICENSE,BSD-3-Clause
golang.org/x/text,https://cs.opensource.google/go/x/text/+/v0.13.0:LICENSE,BSD-3-Clause
google.golang.org/genproto/googleapis/rpc/status,https://github.com/googleapis/go-genproto/blob/007df8e322eb/googleapis/rpc/LICENSE,Apache-2.0
google.golang.org/grpc,https://github.com/grpc/grpc-go/blob/v1.58.1/LICENSE,Apache-2.0
google.golang.org/protobuf,https://github.com/protocolbuffers/protobuf-go/blob/v1.31.0/LICENSE,BSD-3-Clause
+ chmod -R a+w /output/licenses

> Task :runners:spark:3:job-server:validatesPortableRunnerBatch
> Task :release:go-licenses:java:createLicenses
> Task :sdks:java:container:java8:copyGolangLicenses
> Task :sdks:java:container:java8:dockerPrepare

> Task :sdks:java:container:java8:docker
#1 [internal] load .dockerignore
#1 transferring context: 2B done
#1 ...

#2 [internal] load build definition from Dockerfile
#2 transferring dockerfile: 2.59kB done
#2 DONE 2.4s

#1 [internal] load .dockerignore
#1 DONE 2.6s

#3 [internal] load metadata for docker.io/library/eclipse-temurin:8
#3 DONE 1.8s

#4 [ 1/16] FROM docker.io/library/eclipse-temurin:8@sha256:5840452260db162c2dd31033cb55575745861634b1be75a1d8cff559b6c8b942
#4 resolve docker.io/library/eclipse-temurin:8@sha256:5840452260db162c2dd31033cb55575745861634b1be75a1d8cff559b6c8b942 0.0s done
#4 CACHED

#5 [internal] load build context
#5 transferring context: 51.03MB 0.5s done
#5 DONE 0.5s

#6 [ 2/16] ADD target/slf4j-api.jar /opt/apache/beam/jars/
#6 DONE 1.2s

#7 [ 3/16] ADD target/slf4j-jdk14.jar /opt/apache/beam/jars/
#7 DONE 0.1s

#8 [ 4/16] ADD target/jcl-over-slf4j.jar /opt/apache/beam/jars/
#8 DONE 0.1s

#9 [ 5/16] ADD target/log4j-over-slf4j.jar /opt/apache/beam/jars/
#9 DONE 0.1s

#10 [ 6/16] ADD target/log4j-to-slf4j.jar /opt/apache/beam/jars/
#10 DONE 0.0s

#11 [ 7/16] ADD target/beam-sdks-java-harness.jar /opt/apache/beam/jars/
#11 DONE 0.1s

#12 [ 8/16] COPY target/jamm.jar target/open-module-agent*.jar /opt/apache/beam/jars/
#12 DONE 0.1s

#13 [ 9/16] COPY target/linux_amd64/boot /opt/apache/beam/
#13 DONE 0.2s

#14 [10/16] COPY target/LICENSE /opt/apache/beam/
#14 DONE 0.1s

#15 [11/16] COPY target/NOTICE /opt/apache/beam/
#15 DONE 0.1s

#16 [12/16] ADD target/third_party_licenses /opt/apache/beam/third_party_licenses/
#16 DONE 0.2s

#17 [13/16] COPY target/LICENSE target/options/* /opt/apache/beam/options/
#17 DONE 0.1s

#18 [14/16] COPY target/go-licenses/* /opt/apache/beam/third_party_licenses/golang/
#18 DONE 0.1s

#19 [15/16] RUN if [ "true" = "false" ] ; then     rm -rf /opt/apache/beam/third_party_licenses ;    fi
#19 DONE 0.7s

#20 [16/16] COPY target/profiler/* /opt/google_cloud_profiler/
#20 DONE 0.1s

#21 exporting to image
#21 exporting layers
#21 exporting layers 0.4s done
#21 writing image sha256:9c862373f0a1f6831b4625d80d248c2380c8f23d5fb764f8ca05d1cc3d6c64b7 done
#21 naming to docker.io/apache/beam_java8_sdk:2.52.0.dev done
#21 DONE 0.4s

> Task :runners:spark:3:job-server:validatesPortableRunnerBatch

org.apache.beam.sdk.transforms.CombineTest$WindowingTests > testCombineGloballyAsSingletonView FAILED
    java.lang.RuntimeException at CombineTest.java:1359

org.apache.beam.sdk.transforms.CombineTest$WindowingTests > testSlidingWindowsCombine FAILED
    java.lang.RuntimeException at CombineTest.java:1164

[shutdown-hook-0] INFO org.apache.spark.util.ShutdownHookManager - Shutdown hook called
[shutdown-hook-0] INFO org.apache.spark.util.ShutdownHookManager - Deleting directory /tmp/spark-b8c4fadd-f343-4cb5-b479-6eca551f844a
[shutdown-hook-0] INFO org.apache.spark.util.ShutdownHookManager - Shutdown hook called
[shutdown-hook-0] INFO org.apache.spark.util.ShutdownHookManager - Deleting directory /tmp/spark-891677ce-41cc-4377-a547-2aac218a58fe
[shutdown-hook-0] INFO org.apache.spark.util.ShutdownHookManager - Shutdown hook called
[shutdown-hook-0] INFO org.apache.spark.util.ShutdownHookManager - Deleting directory /tmp/spark-ef444072-01d9-4ec4-8670-987579ee6b82
[shutdown-hook-0] INFO org.apache.spark.util.ShutdownHookManager - Shutdown hook called
[shutdown-hook-0] INFO org.apache.spark.util.ShutdownHookManager - Deleting directory /tmp/spark-15771b44-59d4-40e2-8e1e-c8f10dd0e542

> Task :runners:spark:3:job-server:validatesPortableRunnerBatch

233 tests completed, 2 failed, 1 skipped

> Task :runners:spark:3:job-server:validatesPortableRunnerBatch FAILED
> Task :runners:spark:3:job-server:validatesPortableRunnerDocker FROM-CACHE

FAILURE: Build failed with an exception.

* What went wrong:
Execution failed for task ':runners:spark:3:job-server:validatesPortableRunnerBatch'.
> There were failing tests. See the report at: file://<https://ci-beam.apache.org/job/beam_PostCommit_Java_PVR_Spark_Batch/ws/src/runners/spark/3/job-server/build/reports/tests/validatesPortableRunnerBatch/index.html>

Deprecated Gradle features were used in this build, making it incompatible with Gradle 9.0.

You can use '--warning-mode all' to show the individual deprecation warnings and determine if they come from your own scripts or plugins.

For more on this, please refer to https://docs.gradle.org/8.4/userguide/command_line_interface.html#sec:command_line_warnings in the Gradle documentation.

BUILD FAILED in 1h 33m 9s
116 actionable tasks: 74 executed, 40 from cache, 2 up-to-date

Publishing build scan...
https://ge.apache.org/s/6eeokxkfu6un4

Build step 'Invoke Gradle script' changed build result to FAILURE
Build step 'Invoke Gradle script' marked build as failure

---------------------------------------------------------------------
To unsubscribe, e-mail: builds-unsubscribe@beam.apache.org
For additional commands, e-mail: builds-help@beam.apache.org


Build failed in Jenkins: beam_PostCommit_Java_PVR_Spark_Batch #2678

Posted by Apache Jenkins Server <je...@builds.apache.org>.
See <https://ci-beam.apache.org/job/beam_PostCommit_Java_PVR_Spark_Batch/2678/display/redirect?page=changes>

Changes:

[noreply] remove anon functions from minimal wordcount (#29179)


------------------------------------------
[...truncated 41.76 KB...]

#5 [internal] load build context
#5 transferring context: 1.96kB 0.1s done
#5 DONE 0.1s

#6 [2/5] WORKDIR /usr/src/app
#6 CACHED

#7 [3/5] COPY go.mod ./
#7 CACHED

#8 [4/5] RUN go install github.com/google/go-licenses@latest
#8 CACHED

#9 [5/5] COPY get-licenses.sh /opt/apache/beam/
#9 CACHED

#10 exporting to image
#10 exporting layers done
#10 writing image sha256:6da5749ca4d996017cb613d5dd6fd97b13df3f15aca078bfcde5caaf7666674a done
#10 naming to docker.io/library/golicenses-java done
#10 DONE 0.0s

> Task :sdks:java:container:pullLicenses
Collecting setuptools
  Using cached setuptools-68.2.2-py3-none-any.whl (807 kB)
Collecting wheel
  Using cached wheel-0.41.2-py3-none-any.whl (64 kB)
Installing collected packages: pip, setuptools, wheel
  Attempting uninstall: pip
    Found existing installation: pip 20.0.2
    Uninstalling pip-20.0.2:
      Successfully uninstalled pip-20.0.2
  Attempting uninstall: setuptools
    Found existing installation: setuptools 44.0.0
    Uninstalling setuptools-44.0.0:
      Successfully uninstalled setuptools-44.0.0
Successfully installed pip-23.3.1 setuptools-68.2.2 wheel-0.41.2
Collecting beautifulsoup4<5.0,>=4.9.0 (from -r <https://ci-beam.apache.org/job/beam_PostCommit_Java_PVR_Spark_Batch/ws/src/sdks/java/container/license_scripts/requirement.txt> (line 19))
  Using cached beautifulsoup4-4.12.2-py3-none-any.whl (142 kB)
Collecting pyyaml<7,>=6.0.1 (from -r <https://ci-beam.apache.org/job/beam_PostCommit_Java_PVR_Spark_Batch/ws/src/sdks/java/container/license_scripts/requirement.txt> (line 20))
  Using cached PyYAML-6.0.1-cp38-cp38-manylinux_2_17_x86_64.manylinux2014_x86_64.whl.metadata (2.1 kB)
Collecting tenacity<9.0,>=6.1.0 (from -r <https://ci-beam.apache.org/job/beam_PostCommit_Java_PVR_Spark_Batch/ws/src/sdks/java/container/license_scripts/requirement.txt> (line 21))
  Using cached tenacity-8.2.3-py3-none-any.whl.metadata (1.0 kB)
Collecting soupsieve>1.2 (from beautifulsoup4<5.0,>=4.9.0->-r <https://ci-beam.apache.org/job/beam_PostCommit_Java_PVR_Spark_Batch/ws/src/sdks/java/container/license_scripts/requirement.txt> (line 19))
  Using cached soupsieve-2.5-py3-none-any.whl.metadata (4.7 kB)
Using cached PyYAML-6.0.1-cp38-cp38-manylinux_2_17_x86_64.manylinux2014_x86_64.whl (736 kB)
Using cached tenacity-8.2.3-py3-none-any.whl (24 kB)
Using cached soupsieve-2.5-py3-none-any.whl (36 kB)
Installing collected packages: tenacity, soupsieve, pyyaml, beautifulsoup4
Successfully installed beautifulsoup4-4.12.2 pyyaml-6.0.1 soupsieve-2.5 tenacity-8.2.3
Executing python <https://ci-beam.apache.org/job/beam_PostCommit_Java_PVR_Spark_Batch/ws/src/sdks/java/container/license_scripts/pull_licenses_java.py> --license_index=<https://ci-beam.apache.org/job/beam_PostCommit_Java_PVR_Spark_Batch/ws/src/sdks/java/container/build/reports/dependency-license/index.json>        --output_dir=<https://ci-beam.apache.org/job/beam_PostCommit_Java_PVR_Spark_Batch/ws/src/sdks/java/container/build/target/java_third_party_licenses>        --dep_url_yaml=<https://ci-beam.apache.org/job/beam_PostCommit_Java_PVR_Spark_Batch/ws/src/sdks/java/container/license_scripts/dep_urls_java.yaml>        --manual_license_path=<https://ci-beam.apache.org/job/beam_PostCommit_Java_PVR_Spark_Batch/ws/src/sdks/java/container/license_scripts/manual_licenses>
INFO:root:Pulling license for 125 dependencies using 16 threads.
INFO:root:Replaced local file URL with file://<https://ci-beam.apache.org/job/beam_PostCommit_Java_PVR_Spark_Batch/ws/src/sdks/java/container/license_scripts/manual_licenses/xz/COPYING> for xz-1.5
INFO:root:pull_licenses_java.py succeed. It took 1.456632 seconds with 16 threads.
Copying licenses from <https://ci-beam.apache.org/job/beam_PostCommit_Java_PVR_Spark_Batch/ws/src/sdks/java/container/build/target/java_third_party_licenses> to <https://ci-beam.apache.org/job/beam_PostCommit_Java_PVR_Spark_Batch/ws/src/sdks/java/container/build/target/third_party_licenses.>
Finished license_scripts.sh

> Task :release:go-licenses:java:dockerRun
+ rm -rf '/output/*'
+ go get github.com/apache/beam/sdks/v2/java/container
go: downloading github.com/apache/beam/sdks/v2 v2.51.0
go: downloading github.com/apache/beam v2.51.0+incompatible

> Task :sdks:java:container:java8:copyJavaThirdPartyLicenses

> Task :sdks:java:container:downloadCloudProfilerAgent
version.txt
  % Total    % Received % Xferd  Average Speed   Time    Time     Time  Current
NOTICES
                                 Dload  Upload   Total   Spent    Left  Speed
profiler_java_agent.so
  0     0    0     0    0     0      0      0 --:--:-- --:--:-- --:--:--     0100 4183k  100 4183k    0     0  18.0M      0 --:--:-- --:--:-- --:--:-- 18.0M

> Task :sdks:java:container:goPrepare UP-TO-DATE

> Task :sdks:java:container:goBuild
/home/jenkins/go/bin/go1.21.3 build -o ./build/target/linux_amd64/boot boot.go boot_test.go pathingjar.go pathingjar_test.go

> Task :release:go-licenses:java:dockerRun
go: downloading github.com/golang/protobuf v1.5.3
go: downloading google.golang.org/protobuf v1.31.0
go: downloading google.golang.org/grpc v1.58.1
go: downloading golang.org/x/sys v0.12.0

> Task :sdks:java:container:java8:copySdkHarnessLauncher

> Task :release:go-licenses:java:dockerRun
go: downloading golang.org/x/net v0.15.0
go: downloading google.golang.org/genproto/googleapis/rpc v0.0.0-20230913181813-007df8e322eb
go: downloading google.golang.org/genproto v0.0.0-20230821184602-ccc8af3d0e93
go: downloading golang.org/x/text v0.13.0
go: added github.com/apache/beam/sdks/v2 v2.51.0
go: added github.com/golang/protobuf v1.5.3
go: added golang.org/x/net v0.15.0
go: added golang.org/x/sys v0.12.0
go: added golang.org/x/text v0.13.0
go: added google.golang.org/genproto/googleapis/rpc v0.0.0-20230913181813-007df8e322eb
go: added google.golang.org/grpc v1.58.1
go: added google.golang.org/protobuf v1.31.0
+ go-licenses save github.com/apache/beam/sdks/v2/java/container --save_path=/output/licenses
W1028 16:21:15.501827      31 library.go:101] "golang.org/x/sys/unix" contains non-Go code that can't be inspected for further dependencies:
/go/pkg/mod/golang.org/x/sys@v0.12.0/unix/asm_linux_amd64.s
+ go-licenses csv github.com/apache/beam/sdks/v2/java/container
+ tee /output/licenses/list.csv
W1028 16:21:23.205745      75 library.go:101] "golang.org/x/sys/unix" contains non-Go code that can't be inspected for further dependencies:
/go/pkg/mod/golang.org/x/sys@v0.12.0/unix/asm_linux_amd64.s

> Task :runners:spark:3:job-server:validatesPortableRunnerBatch

> Task :release:go-licenses:java:dockerRun
github.com/apache/beam/sdks/v2/go,https://github.com/apache/beam/blob/sdks/v2.51.0/sdks/go/README.md,Apache-2.0
github.com/apache/beam/sdks/v2/java/container,https://github.com/apache/beam/blob/sdks/v2.51.0/sdks/LICENSE,Apache-2.0
github.com/golang/protobuf,https://github.com/golang/protobuf/blob/v1.5.3/LICENSE,BSD-3-Clause
golang.org/x/net,https://cs.opensource.google/go/x/net/+/v0.15.0:LICENSE,BSD-3-Clause
golang.org/x/sys/unix,https://cs.opensource.google/go/x/sys/+/v0.12.0:LICENSE,BSD-3-Clause
golang.org/x/text,https://cs.opensource.google/go/x/text/+/v0.13.0:LICENSE,BSD-3-Clause
google.golang.org/genproto/googleapis/rpc/status,https://github.com/googleapis/go-genproto/blob/007df8e322eb/googleapis/rpc/LICENSE,Apache-2.0
google.golang.org/grpc,https://github.com/grpc/grpc-go/blob/v1.58.1/LICENSE,Apache-2.0
google.golang.org/protobuf,https://github.com/protocolbuffers/protobuf-go/blob/v1.31.0/LICENSE,BSD-3-Clause
+ chmod -R a+w /output/licenses

> Task :release:go-licenses:java:createLicenses
> Task :sdks:java:container:java8:copyGolangLicenses
> Task :sdks:java:container:java8:dockerPrepare

> Task :sdks:java:container:java8:docker
#1 [internal] load build definition from Dockerfile
#1 transferring dockerfile:
#1 transferring dockerfile: 2.59kB done
#1 ...

#2 [internal] load .dockerignore
#2 transferring context: 2B done
#2 DONE 1.3s

#1 [internal] load build definition from Dockerfile
#1 DONE 2.1s

#3 [internal] load metadata for docker.io/library/eclipse-temurin:8
#3 DONE 0.3s

#4 [ 1/16] FROM docker.io/library/eclipse-temurin:8@sha256:5840452260db162c2dd31033cb55575745861634b1be75a1d8cff559b6c8b942
#4 resolve docker.io/library/eclipse-temurin:8@sha256:5840452260db162c2dd31033cb55575745861634b1be75a1d8cff559b6c8b942 0.0s done
#4 CACHED

#5 [internal] load build context
#5 transferring context: 51.03MB 0.9s done
#5 DONE 0.9s

#6 [ 2/16] ADD target/slf4j-api.jar /opt/apache/beam/jars/
#6 DONE 2.1s

#7 [ 3/16] ADD target/slf4j-jdk14.jar /opt/apache/beam/jars/
#7 DONE 0.1s

#8 [ 4/16] ADD target/jcl-over-slf4j.jar /opt/apache/beam/jars/
#8 DONE 0.1s

#9 [ 5/16] ADD target/log4j-over-slf4j.jar /opt/apache/beam/jars/
#9 DONE 0.1s

#10 [ 6/16] ADD target/log4j-to-slf4j.jar /opt/apache/beam/jars/
#10 DONE 0.1s

#11 [ 7/16] ADD target/beam-sdks-java-harness.jar /opt/apache/beam/jars/
#11 DONE 0.1s

#12 [ 8/16] COPY target/jamm.jar target/open-module-agent*.jar /opt/apache/beam/jars/
#12 DONE 0.1s

#13 [ 9/16] COPY target/linux_amd64/boot /opt/apache/beam/
#13 DONE 0.2s

#14 [10/16] COPY target/LICENSE /opt/apache/beam/
#14 DONE 0.1s

#15 [11/16] COPY target/NOTICE /opt/apache/beam/
#15 DONE 0.1s

#16 [12/16] ADD target/third_party_licenses /opt/apache/beam/third_party_licenses/
#16 DONE 0.2s

#17 [13/16] COPY target/LICENSE target/options/* /opt/apache/beam/options/
#17 DONE 0.1s

#18 [14/16] COPY target/go-licenses/* /opt/apache/beam/third_party_licenses/golang/
#18 DONE 0.1s

#19 [15/16] RUN if [ "true" = "false" ] ; then     rm -rf /opt/apache/beam/third_party_licenses ;    fi
#19 DONE 0.5s

#20 [16/16] COPY target/profiler/* /opt/google_cloud_profiler/
#20 DONE 0.2s

#21 exporting to image
#21 exporting layers
#21 exporting layers 0.4s done
#21 writing image sha256:62cd5096e860b3a3e9475912c6697c7e382ac7f7a98756db13dd007991181cfa done
#21 naming to docker.io/apache/beam_java8_sdk:2.52.0.dev done
#21 DONE 0.5s

> Task :runners:spark:3:job-server:validatesPortableRunnerBatch

org.apache.beam.sdk.transforms.CombineTest$WindowingTests > testSlidingWindowsCombine FAILED
    java.lang.RuntimeException at CombineTest.java:1164

org.apache.beam.sdk.transforms.CombineTest$WindowingTests > testWindowedCombineGloballyAsSingletonView FAILED
    java.lang.RuntimeException at CombineTest.java:1402

org.apache.beam.sdk.transforms.ParDoTest$TimerCoderInferenceTests > testValueStateCoderInference FAILED
    java.lang.RuntimeException at ParDoTest.java:6309

[shutdown-hook-0] INFO org.apache.spark.util.ShutdownHookManager - Shutdown hook called
[shutdown-hook-0] INFO org.apache.spark.util.ShutdownHookManager - Deleting directory /tmp/spark-7a041bee-7350-49c0-8666-be91dd7da47c
[shutdown-hook-0] INFO org.apache.spark.util.ShutdownHookManager - Shutdown hook called
[shutdown-hook-0] INFO org.apache.spark.util.ShutdownHookManager - Deleting directory /tmp/spark-15728d2b-2424-4056-9717-5327310eb07f
[shutdown-hook-0] INFO org.apache.spark.util.ShutdownHookManager - Shutdown hook called
[shutdown-hook-0] INFO org.apache.spark.util.ShutdownHookManager - Deleting directory /tmp/spark-cdaa95cd-1eb8-4b84-a4a3-092ab48716ac
[shutdown-hook-0] INFO org.apache.spark.util.ShutdownHookManager - Shutdown hook called
[shutdown-hook-0] INFO org.apache.spark.util.ShutdownHookManager - Deleting directory /tmp/spark-f09e54ea-2aaf-4980-a705-7bc20381ef5c

> Task :runners:spark:3:job-server:validatesPortableRunnerBatch

233 tests completed, 3 failed, 1 skipped

> Task :runners:spark:3:job-server:validatesPortableRunnerBatch FAILED
> Task :runners:spark:3:job-server:validatesPortableRunnerDocker FROM-CACHE

FAILURE: Build failed with an exception.

* What went wrong:
Execution failed for task ':runners:spark:3:job-server:validatesPortableRunnerBatch'.
> There were failing tests. See the report at: file://<https://ci-beam.apache.org/job/beam_PostCommit_Java_PVR_Spark_Batch/ws/src/runners/spark/3/job-server/build/reports/tests/validatesPortableRunnerBatch/index.html>

Deprecated Gradle features were used in this build, making it incompatible with Gradle 9.0.

You can use '--warning-mode all' to show the individual deprecation warnings and determine if they come from your own scripts or plugins.

For more on this, please refer to https://docs.gradle.org/8.4/userguide/command_line_interface.html#sec:command_line_warnings in the Gradle documentation.

BUILD FAILED in 1h 36m 5s
116 actionable tasks: 74 executed, 40 from cache, 2 up-to-date

Publishing build scan...
https://ge.apache.org/s/mcmbskwgjfaru

Build step 'Invoke Gradle script' changed build result to FAILURE
Build step 'Invoke Gradle script' marked build as failure

---------------------------------------------------------------------
To unsubscribe, e-mail: builds-unsubscribe@beam.apache.org
For additional commands, e-mail: builds-help@beam.apache.org


Build failed in Jenkins: beam_PostCommit_Java_PVR_Spark_Batch #2677

Posted by Apache Jenkins Server <je...@builds.apache.org>.
See <https://ci-beam.apache.org/job/beam_PostCommit_Java_PVR_Spark_Batch/2677/display/redirect>

Changes:


------------------------------------------
[...truncated 41.37 KB...]
#2 transferring context: 2B done
#2 DONE 0.0s

#3 [internal] load metadata for docker.io/library/golang:1.20-bullseye
#3 DONE 0.3s

#4 [1/5] FROM docker.io/library/golang:1.20-bullseye@sha256:082569b3303b164cc4a7c88ac59b19b69c1a5d662041ac0dca046ac239632442
#4 resolve docker.io/library/golang:1.20-bullseye@sha256:082569b3303b164cc4a7c88ac59b19b69c1a5d662041ac0dca046ac239632442 0.0s done
#4 DONE 0.0s

#5 [internal] load build context
#5 transferring context: 1.96kB 0.0s done
#5 DONE 0.1s

#6 [3/5] COPY go.mod ./
#6 CACHED

#7 [4/5] RUN go install github.com/google/go-licenses@latest
#7 CACHED

#8 [2/5] WORKDIR /usr/src/app
#8 CACHED

#9 [5/5] COPY get-licenses.sh /opt/apache/beam/
#9 CACHED

#10 exporting to image
#10 exporting layers done
#10 writing image sha256:6da5749ca4d996017cb613d5dd6fd97b13df3f15aca078bfcde5caaf7666674a done
#10 naming to docker.io/library/golicenses-java done
#10 DONE 0.0s

> Task :sdks:java:container:pullLicenses
Collecting setuptools
  Using cached setuptools-68.2.2-py3-none-any.whl (807 kB)
Collecting wheel
  Using cached wheel-0.41.2-py3-none-any.whl (64 kB)
Installing collected packages: pip, setuptools, wheel
  Attempting uninstall: pip
    Found existing installation: pip 20.0.2
    Uninstalling pip-20.0.2:
      Successfully uninstalled pip-20.0.2
  Attempting uninstall: setuptools
    Found existing installation: setuptools 44.0.0
    Uninstalling setuptools-44.0.0:
      Successfully uninstalled setuptools-44.0.0
Successfully installed pip-23.3.1 setuptools-68.2.2 wheel-0.41.2
Collecting beautifulsoup4<5.0,>=4.9.0 (from -r <https://ci-beam.apache.org/job/beam_PostCommit_Java_PVR_Spark_Batch/ws/src/sdks/java/container/license_scripts/requirement.txt> (line 19))
  Using cached beautifulsoup4-4.12.2-py3-none-any.whl (142 kB)
Collecting pyyaml<7,>=6.0.1 (from -r <https://ci-beam.apache.org/job/beam_PostCommit_Java_PVR_Spark_Batch/ws/src/sdks/java/container/license_scripts/requirement.txt> (line 20))
  Using cached PyYAML-6.0.1-cp38-cp38-manylinux_2_17_x86_64.manylinux2014_x86_64.whl.metadata (2.1 kB)
Collecting tenacity<9.0,>=6.1.0 (from -r <https://ci-beam.apache.org/job/beam_PostCommit_Java_PVR_Spark_Batch/ws/src/sdks/java/container/license_scripts/requirement.txt> (line 21))
  Using cached tenacity-8.2.3-py3-none-any.whl.metadata (1.0 kB)
Collecting soupsieve>1.2 (from beautifulsoup4<5.0,>=4.9.0->-r <https://ci-beam.apache.org/job/beam_PostCommit_Java_PVR_Spark_Batch/ws/src/sdks/java/container/license_scripts/requirement.txt> (line 19))
  Using cached soupsieve-2.5-py3-none-any.whl.metadata (4.7 kB)
Using cached PyYAML-6.0.1-cp38-cp38-manylinux_2_17_x86_64.manylinux2014_x86_64.whl (736 kB)
Using cached tenacity-8.2.3-py3-none-any.whl (24 kB)
Using cached soupsieve-2.5-py3-none-any.whl (36 kB)
Installing collected packages: tenacity, soupsieve, pyyaml, beautifulsoup4
Successfully installed beautifulsoup4-4.12.2 pyyaml-6.0.1 soupsieve-2.5 tenacity-8.2.3
Executing python <https://ci-beam.apache.org/job/beam_PostCommit_Java_PVR_Spark_Batch/ws/src/sdks/java/container/license_scripts/pull_licenses_java.py> --license_index=<https://ci-beam.apache.org/job/beam_PostCommit_Java_PVR_Spark_Batch/ws/src/sdks/java/container/build/reports/dependency-license/index.json>        --output_dir=<https://ci-beam.apache.org/job/beam_PostCommit_Java_PVR_Spark_Batch/ws/src/sdks/java/container/build/target/java_third_party_licenses>        --dep_url_yaml=<https://ci-beam.apache.org/job/beam_PostCommit_Java_PVR_Spark_Batch/ws/src/sdks/java/container/license_scripts/dep_urls_java.yaml>        --manual_license_path=<https://ci-beam.apache.org/job/beam_PostCommit_Java_PVR_Spark_Batch/ws/src/sdks/java/container/license_scripts/manual_licenses>
INFO:root:Pulling license for 125 dependencies using 16 threads.
INFO:root:Replaced local file URL with file://<https://ci-beam.apache.org/job/beam_PostCommit_Java_PVR_Spark_Batch/ws/src/sdks/java/container/license_scripts/manual_licenses/xz/COPYING> for xz-1.5
INFO:root:pull_licenses_java.py succeed. It took 1.453335 seconds with 16 threads.
Copying licenses from <https://ci-beam.apache.org/job/beam_PostCommit_Java_PVR_Spark_Batch/ws/src/sdks/java/container/build/target/java_third_party_licenses> to <https://ci-beam.apache.org/job/beam_PostCommit_Java_PVR_Spark_Batch/ws/src/sdks/java/container/build/target/third_party_licenses.>
Finished license_scripts.sh

> Task :release:go-licenses:java:dockerRun
+ rm -rf '/output/*'
+ go get github.com/apache/beam/sdks/v2/java/container
go: downloading github.com/apache/beam/sdks/v2 v2.51.0
go: downloading github.com/apache/beam v2.51.0+incompatible

> Task :sdks:java:container:java8:copyJavaThirdPartyLicenses

> Task :sdks:java:container:downloadCloudProfilerAgent
  % Total    % Received % Xferd  Average Speed   Time    Time     Time  Current
                                 Dload  Upload   Total   Spent    Left  Speed
  0     0    0     0    0     0      0      0 --:--:-- --:--:-- --:--:--     0version.txt
NOTICES
profiler_java_agent.so
100 4183k  100 4183k    0     0  24.7M      0 --:--:-- --:--:-- --:--:-- 24.7M

> Task :sdks:java:container:goPrepare UP-TO-DATE

> Task :release:go-licenses:java:dockerRun
go: downloading google.golang.org/grpc v1.58.1
go: downloading github.com/golang/protobuf v1.5.3
go: downloading google.golang.org/protobuf v1.31.0
go: downloading golang.org/x/sys v0.12.0
go: downloading google.golang.org/genproto/googleapis/rpc v0.0.0-20230913181813-007df8e322eb
go: downloading golang.org/x/net v0.15.0
go: downloading google.golang.org/genproto v0.0.0-20230821184602-ccc8af3d0e93
go: downloading golang.org/x/text v0.13.0

> Task :sdks:java:container:goBuild
/home/jenkins/go/bin/go1.21.3 build -o ./build/target/linux_amd64/boot boot.go boot_test.go pathingjar.go pathingjar_test.go

> Task :sdks:java:container:java8:copySdkHarnessLauncher

> Task :release:go-licenses:java:dockerRun
go: added github.com/apache/beam/sdks/v2 v2.51.0
go: added github.com/golang/protobuf v1.5.3
go: added golang.org/x/net v0.15.0
go: added golang.org/x/sys v0.12.0
go: added golang.org/x/text v0.13.0
go: added google.golang.org/genproto/googleapis/rpc v0.0.0-20230913181813-007df8e322eb
go: added google.golang.org/grpc v1.58.1
go: added google.golang.org/protobuf v1.31.0
+ go-licenses save github.com/apache/beam/sdks/v2/java/container --save_path=/output/licenses
W1028 10:21:12.022924      37 library.go:101] "golang.org/x/sys/unix" contains non-Go code that can't be inspected for further dependencies:
/go/pkg/mod/golang.org/x/sys@v0.12.0/unix/asm_linux_amd64.s
+ go-licenses csv github.com/apache/beam/sdks/v2/java/container
+ tee /output/licenses/list.csv
W1028 10:21:18.865249      83 library.go:101] "golang.org/x/sys/unix" contains non-Go code that can't be inspected for further dependencies:
/go/pkg/mod/golang.org/x/sys@v0.12.0/unix/asm_linux_amd64.s
github.com/apache/beam/sdks/v2/go,https://github.com/apache/beam/blob/sdks/v2.51.0/sdks/go/README.md,Apache-2.0
github.com/apache/beam/sdks/v2/java/container,https://github.com/apache/beam/blob/sdks/v2.51.0/sdks/LICENSE,Apache-2.0
github.com/golang/protobuf,https://github.com/golang/protobuf/blob/v1.5.3/LICENSE,BSD-3-Clause
golang.org/x/net,https://cs.opensource.google/go/x/net/+/v0.15.0:LICENSE,BSD-3-Clause
golang.org/x/sys/unix,https://cs.opensource.google/go/x/sys/+/v0.12.0:LICENSE,BSD-3-Clause
golang.org/x/text,https://cs.opensource.google/go/x/text/+/v0.13.0:LICENSE,BSD-3-Clause
google.golang.org/genproto/googleapis/rpc/status,https://github.com/googleapis/go-genproto/blob/007df8e322eb/googleapis/rpc/LICENSE,Apache-2.0
google.golang.org/grpc,https://github.com/grpc/grpc-go/blob/v1.58.1/LICENSE,Apache-2.0
google.golang.org/protobuf,https://github.com/protocolbuffers/protobuf-go/blob/v1.31.0/LICENSE,BSD-3-Clause
+ chmod -R a+w /output/licenses

> Task :runners:spark:3:job-server:validatesPortableRunnerBatch
> Task :release:go-licenses:java:createLicenses
> Task :sdks:java:container:java8:copyGolangLicenses
> Task :sdks:java:container:java8:dockerPrepare

> Task :sdks:java:container:java8:docker
#1 [internal] load .dockerignore
#1 transferring context: 2B done
#1 ...

#2 [internal] load build definition from Dockerfile
#2 transferring dockerfile: 2.59kB done
#2 DONE 2.1s

#1 [internal] load .dockerignore
#1 DONE 2.7s

#3 [internal] load metadata for docker.io/library/eclipse-temurin:8
#3 DONE 2.4s

#4 [ 1/16] FROM docker.io/library/eclipse-temurin:8@sha256:5840452260db162c2dd31033cb55575745861634b1be75a1d8cff559b6c8b942
#4 resolve docker.io/library/eclipse-temurin:8@sha256:5840452260db162c2dd31033cb55575745861634b1be75a1d8cff559b6c8b942
#4 resolve docker.io/library/eclipse-temurin:8@sha256:5840452260db162c2dd31033cb55575745861634b1be75a1d8cff559b6c8b942 0.7s done
#4 CACHED

#5 [internal] load build context
#5 transferring context: 51.03MB 0.4s done
#5 DONE 1.3s

#6 [ 2/16] ADD target/slf4j-api.jar /opt/apache/beam/jars/
#6 DONE 1.4s

#7 [ 3/16] ADD target/slf4j-jdk14.jar /opt/apache/beam/jars/
#7 DONE 0.1s

#8 [ 4/16] ADD target/jcl-over-slf4j.jar /opt/apache/beam/jars/
#8 DONE 0.1s

#9 [ 5/16] ADD target/log4j-over-slf4j.jar /opt/apache/beam/jars/
#9 DONE 0.1s

#10 [ 6/16] ADD target/log4j-to-slf4j.jar /opt/apache/beam/jars/
#10 DONE 0.1s

#11 [ 7/16] ADD target/beam-sdks-java-harness.jar /opt/apache/beam/jars/
#11 DONE 0.1s

#12 [ 8/16] COPY target/jamm.jar target/open-module-agent*.jar /opt/apache/beam/jars/
#12 DONE 0.1s

#13 [ 9/16] COPY target/linux_amd64/boot /opt/apache/beam/
#13 DONE 0.2s

#14 [10/16] COPY target/LICENSE /opt/apache/beam/
#14 DONE 0.1s

#15 [11/16] COPY target/NOTICE /opt/apache/beam/
#15 DONE 0.1s

#16 [12/16] ADD target/third_party_licenses /opt/apache/beam/third_party_licenses/
#16 DONE 0.2s

#17 [13/16] COPY target/LICENSE target/options/* /opt/apache/beam/options/
#17 DONE 0.1s

#18 [14/16] COPY target/go-licenses/* /opt/apache/beam/third_party_licenses/golang/
#18 DONE 0.1s

#19 [15/16] RUN if [ "true" = "false" ] ; then     rm -rf /opt/apache/beam/third_party_licenses ;    fi
#19 DONE 0.5s

#20 [16/16] COPY target/profiler/* /opt/google_cloud_profiler/
#20 DONE 0.1s

#21 exporting to image
#21 exporting layers
#21 exporting layers 0.3s done
#21 writing image sha256:31bf9802d6cad59aa81b608415c6a0747c4d35d4b84ffc21dac041b8fcb89adb done
#21 naming to docker.io/apache/beam_java8_sdk:2.52.0.dev done
#21 DONE 0.4s

> Task :runners:spark:3:job-server:validatesPortableRunnerBatch

org.apache.beam.sdk.transforms.CombineTest$WindowingTests > testCombineGloballyAsSingletonView FAILED
    java.lang.RuntimeException at CombineTest.java:1359

[shutdown-hook-0] INFO org.apache.spark.util.ShutdownHookManager - Shutdown hook called
[shutdown-hook-0] INFO org.apache.spark.util.ShutdownHookManager - Deleting directory /tmp/spark-1f0adc80-723f-40c0-83f2-97f8d5d1fb4d
[shutdown-hook-0] INFO org.apache.spark.util.ShutdownHookManager - Shutdown hook called
[shutdown-hook-0] INFO org.apache.spark.util.ShutdownHookManager - Deleting directory /tmp/spark-0fd74b73-adba-4bf8-bb55-5f1d42f07736
[shutdown-hook-0] INFO org.apache.spark.util.ShutdownHookManager - Shutdown hook called
[shutdown-hook-0] INFO org.apache.spark.util.ShutdownHookManager - Deleting directory /tmp/spark-e3a9b8bc-6138-4e02-a10e-48bbdd330177
[shutdown-hook-0] INFO org.apache.spark.util.ShutdownHookManager - Shutdown hook called
[shutdown-hook-0] INFO org.apache.spark.util.ShutdownHookManager - Deleting directory /tmp/spark-f849f580-3ab0-4a1a-8128-95ebec23a0dd

> Task :runners:spark:3:job-server:validatesPortableRunnerBatch

233 tests completed, 1 failed, 1 skipped

> Task :runners:spark:3:job-server:validatesPortableRunnerBatch FAILED
> Task :runners:spark:3:job-server:validatesPortableRunnerDocker FROM-CACHE

FAILURE: Build failed with an exception.

* What went wrong:
Execution failed for task ':runners:spark:3:job-server:validatesPortableRunnerBatch'.
> There were failing tests. See the report at: file://<https://ci-beam.apache.org/job/beam_PostCommit_Java_PVR_Spark_Batch/ws/src/runners/spark/3/job-server/build/reports/tests/validatesPortableRunnerBatch/index.html>

Deprecated Gradle features were used in this build, making it incompatible with Gradle 9.0.

You can use '--warning-mode all' to show the individual deprecation warnings and determine if they come from your own scripts or plugins.

For more on this, please refer to https://docs.gradle.org/8.4/userguide/command_line_interface.html#sec:command_line_warnings in the Gradle documentation.

BUILD FAILED in 1h 33m 46s
116 actionable tasks: 74 executed, 40 from cache, 2 up-to-date

Publishing build scan...
https://ge.apache.org/s/ylnfxtsu6fy66

Build step 'Invoke Gradle script' changed build result to FAILURE
Build step 'Invoke Gradle script' marked build as failure

---------------------------------------------------------------------
To unsubscribe, e-mail: builds-unsubscribe@beam.apache.org
For additional commands, e-mail: builds-help@beam.apache.org


Build failed in Jenkins: beam_PostCommit_Java_PVR_Spark_Batch #2676

Posted by Apache Jenkins Server <je...@builds.apache.org>.
See <https://ci-beam.apache.org/job/beam_PostCommit_Java_PVR_Spark_Batch/2676/display/redirect>

Changes:


------------------------------------------
[...truncated 52.38 KB...]
#2 DONE 0.7s

#1 [internal] load .dockerignore
#1 transferring context: 2B done
#1 DONE 0.9s

#3 [internal] load metadata for docker.io/library/eclipse-temurin:8
#3 DONE 0.4s

#4 [ 1/16] FROM docker.io/library/eclipse-temurin:8@sha256:5840452260db162c2dd31033cb55575745861634b1be75a1d8cff559b6c8b942
#4 resolve docker.io/library/eclipse-temurin:8@sha256:5840452260db162c2dd31033cb55575745861634b1be75a1d8cff559b6c8b942
#4 ...

#5 [internal] load build context
#5 transferring context: 51.03MB 0.5s done
#5 DONE 1.6s

#4 [ 1/16] FROM docker.io/library/eclipse-temurin:8@sha256:5840452260db162c2dd31033cb55575745861634b1be75a1d8cff559b6c8b942
#4 resolve docker.io/library/eclipse-temurin:8@sha256:5840452260db162c2dd31033cb55575745861634b1be75a1d8cff559b6c8b942 1.6s done
#4 CACHED

#6 [ 2/16] ADD target/slf4j-api.jar /opt/apache/beam/jars/
#6 DONE 2.7s

#7 [ 3/16] ADD target/slf4j-jdk14.jar /opt/apache/beam/jars/
#7 DONE 0.1s

#8 [ 4/16] ADD target/jcl-over-slf4j.jar /opt/apache/beam/jars/
#8 DONE 0.1s

#9 [ 5/16] ADD target/log4j-over-slf4j.jar /opt/apache/beam/jars/
#9 DONE 0.0s

#10 [ 6/16] ADD target/log4j-to-slf4j.jar /opt/apache/beam/jars/
#10 DONE 0.1s

#11 [ 7/16] ADD target/beam-sdks-java-harness.jar /opt/apache/beam/jars/
#11 DONE 0.1s

#12 [ 8/16] COPY target/jamm.jar target/open-module-agent*.jar /opt/apache/beam/jars/
#12 DONE 0.1s

#13 [ 9/16] COPY target/linux_amd64/boot /opt/apache/beam/
#13 DONE 0.2s

#14 [10/16] COPY target/LICENSE /opt/apache/beam/
#14 DONE 0.1s

#15 [11/16] COPY target/NOTICE /opt/apache/beam/
#15 DONE 0.1s

#16 [12/16] ADD target/third_party_licenses /opt/apache/beam/third_party_licenses/
#16 DONE 0.2s

#17 [13/16] COPY target/LICENSE target/options/* /opt/apache/beam/options/
#17 DONE 0.1s

#18 [14/16] COPY target/go-licenses/* /opt/apache/beam/third_party_licenses/golang/
#18 DONE 0.1s

#19 [15/16] RUN if [ "true" = "false" ] ; then     rm -rf /opt/apache/beam/third_party_licenses ;    fi
#19 DONE 0.6s

#20 [16/16] COPY target/profiler/* /opt/google_cloud_profiler/
#20 DONE 0.1s

#21 exporting to image
#21 exporting layers
#21 exporting layers 0.4s done
#21 writing image sha256:1bef33046676ba51d1fff6c6ea1d5a87809dd0b2098e69d72f487f483b22680f done
#21 naming to docker.io/apache/beam_java8_sdk:2.52.0.dev done
#21 DONE 0.4s

> Task :runners:spark:3:job-server:validatesPortableRunnerBatch

org.apache.beam.sdk.transforms.CombineTest$WindowingTests > testCombineGloballyAsSingletonView FAILED
    java.lang.RuntimeException at CombineTest.java:1359

org.apache.beam.sdk.transforms.CombineTest$WindowingTests > testSlidingWindowsCombine FAILED
    java.lang.RuntimeException at CombineTest.java:1164

org.apache.beam.sdk.transforms.CombineTest$WindowingTests > testWindowedCombineGloballyAsSingletonView FAILED
    java.lang.RuntimeException at CombineTest.java:1402

org.apache.beam.sdk.transforms.ParDoTest$MultipleInputsAndOutputTests > testMultiOutputParDoWithSideInputs FAILED
    java.lang.RuntimeException at ParDoTest.java:1251

org.apache.beam.sdk.transforms.ParDoTest$TimerCoderInferenceTests > testValueStateCoderInference FAILED
    java.lang.RuntimeException at ParDoTest.java:6309

org.apache.beam.sdk.transforms.ParDoTest$MultipleInputsAndOutputTests > testMultiOutputParDoWithSideInputsIsCumulative FAILED
    java.lang.RuntimeException at ParDoTest.java:1289

org.apache.beam.sdk.transforms.ParDoTest$MultipleInputsAndOutputTests > testParDoWithEmptyTaggedOutput FAILED
    java.lang.RuntimeException at ParDoTest.java:789

[shutdown-hook-0] INFO org.apache.spark.util.ShutdownHookManager - Shutdown hook called
[shutdown-hook-0] INFO org.apache.spark.util.ShutdownHookManager - Deleting directory /tmp/spark-252ccc22-b553-4d48-bc15-322b95a34798

> Task :runners:spark:3:job-server:validatesPortableRunnerBatch

org.apache.beam.sdk.transforms.ParDoTest$StateTests > testCombiningState FAILED
    java.lang.RuntimeException at ParDoTest.java:3497

org.apache.beam.sdk.transforms.ParDoTest$StateTests > testValueStateSameId FAILED
    java.lang.RuntimeException at ParDoTest.java:2528

org.apache.beam.sdk.transforms.ParDoTest$StateTests > testValueStateTaggedOutput FAILED
    java.lang.RuntimeException at ParDoTest.java:2579

org.apache.beam.sdk.transforms.ParDoTest$StateTests > testBagStateSideInput FAILED
    java.lang.RuntimeException at ParDoTest.java:3583

[shutdown-hook-0] INFO org.apache.spark.util.ShutdownHookManager - Shutdown hook called
[shutdown-hook-0] INFO org.apache.spark.util.ShutdownHookManager - Deleting directory /tmp/spark-288942d6-6474-435b-8382-67e4c42e83b4
[shutdown-hook-0] INFO org.apache.spark.util.ShutdownHookManager - Shutdown hook called
[shutdown-hook-0] INFO org.apache.spark.util.ShutdownHookManager - Deleting directory /tmp/spark-3f409ee1-7790-4106-a687-b3867abb63af
[shutdown-hook-0] INFO org.apache.spark.util.ShutdownHookManager - Shutdown hook called
[shutdown-hook-0] INFO org.apache.spark.util.ShutdownHookManager - Deleting directory /tmp/spark-782fdb08-b713-47d9-96b8-0d9a791cefcb
[pool-840-thread-2] WARN org.apache.beam.fn.harness.control.ExecutionStateSampler - Operation ongoing in bundle 4 for at least 01h23m43s without outputting or completing:
  at sun.misc.Unsafe.park(Native Method)
  at java.util.concurrent.locks.LockSupport.park(LockSupport.java:175)
  at java.util.concurrent.locks.AbstractQueuedSynchronizer$ConditionObject.await(AbstractQueuedSynchronizer.java:2039)
  at org.apache.beam.sdk.fn.CancellableQueue.take(CancellableQueue.java:95)
  at org.apache.beam.sdk.fn.data.BeamFnDataInboundObserver.awaitCompletion(BeamFnDataInboundObserver.java:122)
  at org.apache.beam.fn.harness.control.ProcessBundleHandler.processBundle(ProcessBundleHandler.java:550)
  at org.apache.beam.fn.harness.FnHarness$$Lambda$1616/961174949.apply(Unknown Source)
  at org.apache.beam.fn.harness.control.BeamFnControlClient.delegateOnInstructionRequestType(BeamFnControlClient.java:150)
  at org.apache.beam.fn.harness.control.BeamFnControlClient$InboundObserver.lambda$onNext$0(BeamFnControlClient.java:115)
  at org.apache.beam.fn.harness.control.BeamFnControlClient$InboundObserver$$Lambda$1640/951676127.run(Unknown Source)
  at java.util.concurrent.Executors$RunnableAdapter.call(Executors.java:511)
  at java.util.concurrent.FutureTask.run(FutureTask.java:266)
  at org.apache.beam.sdk.util.UnboundedScheduledExecutorService$ScheduledFutureTask.run(UnboundedScheduledExecutorService.java:163)
  at java.util.concurrent.ThreadPoolExecutor.runWorker(ThreadPoolExecutor.java:1149)
  at java.util.concurrent.ThreadPoolExecutor$Worker.run(ThreadPoolExecutor.java:624)
  at java.lang.Thread.run(Thread.java:750)
[pool-732-thread-2] WARN org.apache.beam.fn.harness.control.ExecutionStateSampler - Operation ongoing in bundle 2 for at least 01h26m05s without outputting or completing:
  at sun.misc.Unsafe.park(Native Method)
  at java.util.concurrent.locks.LockSupport.park(LockSupport.java:175)
  at java.util.concurrent.locks.AbstractQueuedSynchronizer$ConditionObject.await(AbstractQueuedSynchronizer.java:2039)
  at org.apache.beam.sdk.fn.CancellableQueue.take(CancellableQueue.java:95)
  at org.apache.beam.sdk.fn.data.BeamFnDataInboundObserver.awaitCompletion(BeamFnDataInboundObserver.java:122)
  at org.apache.beam.fn.harness.control.ProcessBundleHandler.processBundle(ProcessBundleHandler.java:550)
  at org.apache.beam.fn.harness.FnHarness$$Lambda$1616/961174949.apply(Unknown Source)
  at org.apache.beam.fn.harness.control.BeamFnControlClient.delegateOnInstructionRequestType(BeamFnControlClient.java:150)
  at org.apache.beam.fn.harness.control.BeamFnControlClient$InboundObserver.lambda$onNext$0(BeamFnControlClient.java:115)
  at org.apache.beam.fn.harness.control.BeamFnControlClient$InboundObserver$$Lambda$1640/951676127.run(Unknown Source)
  at java.util.concurrent.Executors$RunnableAdapter.call(Executors.java:511)
  at java.util.concurrent.FutureTask.run(FutureTask.java:266)
  at org.apache.beam.sdk.util.UnboundedScheduledExecutorService$ScheduledFutureTask.run(UnboundedScheduledExecutorService.java:163)
  at java.util.concurrent.ThreadPoolExecutor.runWorker(ThreadPoolExecutor.java:1149)
  at java.util.concurrent.ThreadPoolExecutor$Worker.run(ThreadPoolExecutor.java:624)
  at java.lang.Thread.run(Thread.java:750)
[pool-921-thread-2] WARN org.apache.beam.fn.harness.control.ExecutionStateSampler - Operation ongoing in bundle 5 for at least 01h21m49s without outputting or completing:
  at sun.misc.Unsafe.park(Native Method)
  at java.util.concurrent.locks.LockSupport.park(LockSupport.java:175)
  at java.util.concurrent.locks.AbstractQueuedSynchronizer$ConditionObject.await(AbstractQueuedSynchronizer.java:2039)
  at org.apache.beam.sdk.fn.CancellableQueue.take(CancellableQueue.java:95)
  at org.apache.beam.sdk.fn.data.BeamFnDataInboundObserver.awaitCompletion(BeamFnDataInboundObserver.java:122)
  at org.apache.beam.fn.harness.control.ProcessBundleHandler.processBundle(ProcessBundleHandler.java:550)
  at org.apache.beam.fn.harness.FnHarness$$Lambda$1616/961174949.apply(Unknown Source)
  at org.apache.beam.fn.harness.control.BeamFnControlClient.delegateOnInstructionRequestType(BeamFnControlClient.java:150)
  at org.apache.beam.fn.harness.control.BeamFnControlClient$InboundObserver.lambda$onNext$0(BeamFnControlClient.java:115)
  at org.apache.beam.fn.harness.control.BeamFnControlClient$InboundObserver$$Lambda$1640/951676127.run(Unknown Source)
  at java.util.concurrent.Executors$RunnableAdapter.call(Executors.java:511)
  at java.util.concurrent.FutureTask.run(FutureTask.java:266)
  at org.apache.beam.sdk.util.UnboundedScheduledExecutorService$ScheduledFutureTask.run(UnboundedScheduledExecutorService.java:163)
  at java.util.concurrent.ThreadPoolExecutor.runWorker(ThreadPoolExecutor.java:1149)
  at java.util.concurrent.ThreadPoolExecutor$Worker.run(ThreadPoolExecutor.java:624)
  at java.lang.Thread.run(Thread.java:750)
[pool-975-thread-2] WARN org.apache.beam.fn.harness.control.ExecutionStateSampler - Operation ongoing in bundle 6 for at least 01h20m22s without outputting or completing:
  at sun.misc.Unsafe.park(Native Method)
  at java.util.concurrent.locks.LockSupport.park(LockSupport.java:175)
  at java.util.concurrent.locks.AbstractQueuedSynchronizer$ConditionObject.await(AbstractQueuedSynchronizer.java:2039)
  at org.apache.beam.sdk.fn.CancellableQueue.take(CancellableQueue.java:95)
  at org.apache.beam.sdk.fn.data.BeamFnDataInboundObserver.awaitCompletion(BeamFnDataInboundObserver.java:122)
  at org.apache.beam.fn.harness.control.ProcessBundleHandler.processBundle(ProcessBundleHandler.java:550)
  at org.apache.beam.fn.harness.FnHarness$$Lambda$1616/961174949.apply(Unknown Source)
  at org.apache.beam.fn.harness.control.BeamFnControlClient.delegateOnInstructionRequestType(BeamFnControlClient.java:150)
  at org.apache.beam.fn.harness.control.BeamFnControlClient$InboundObserver.lambda$onNext$0(BeamFnControlClient.java:115)
  at org.apache.beam.fn.harness.control.BeamFnControlClient$InboundObserver$$Lambda$1640/951676127.run(Unknown Source)
  at java.util.concurrent.Executors$RunnableAdapter.call(Executors.java:511)
  at java.util.concurrent.FutureTask.run(FutureTask.java:266)
  at org.apache.beam.sdk.util.UnboundedScheduledExecutorService$ScheduledFutureTask.run(UnboundedScheduledExecutorService.java:163)
  at java.util.concurrent.ThreadPoolExecutor.runWorker(ThreadPoolExecutor.java:1149)
  at java.util.concurrent.ThreadPoolExecutor$Worker.run(ThreadPoolExecutor.java:624)
  at java.lang.Thread.run(Thread.java:750)
[pool-840-thread-2] WARN org.apache.beam.fn.harness.control.ExecutionStateSampler - Operation ongoing in bundle 4 for at least 01h23m43s without outputting or completing:
  at sun.misc.Unsafe.park(Native Method)
  at java.util.concurrent.locks.LockSupport.park(LockSupport.java:175)
  at java.util.concurrent.locks.AbstractQueuedSynchronizer$ConditionObject.await(AbstractQueuedSynchronizer.java:2039)
  at org.apache.beam.sdk.fn.CancellableQueue.take(CancellableQueue.java:95)
  at org.apache.beam.sdk.fn.data.BeamFnDataInboundObserver.awaitCompletion(BeamFnDataInboundObserver.java:122)
  at org.apache.beam.fn.harness.control.ProcessBundleHandler.processBundle(ProcessBundleHandler.java:550)
  at org.apache.beam.fn.harness.FnHarness$$Lambda$1616/961174949.apply(Unknown Source)
  at org.apache.beam.fn.harness.control.BeamFnControlClient.delegateOnInstructionRequestType(BeamFnControlClient.java:150)
  at org.apache.beam.fn.harness.control.BeamFnControlClient$InboundObserver.lambda$onNext$0(BeamFnControlClient.java:115)
  at org.apache.beam.fn.harness.control.BeamFnControlClient$InboundObserver$$Lambda$1640/951676127.run(Unknown Source)
  at java.util.concurrent.Executors$RunnableAdapter.call(Executors.java:511)
  at java.util.concurrent.FutureTask.run(FutureTask.java:266)
  at org.apache.beam.sdk.util.UnboundedScheduledExecutorService$ScheduledFutureTask.run(UnboundedScheduledExecutorService.java:163)
  at java.util.concurrent.ThreadPoolExecutor.runWorker(ThreadPoolExecutor.java:1149)
  at java.util.concurrent.ThreadPoolExecutor$Worker.run(ThreadPoolExecutor.java:624)
  at java.lang.Thread.run(Thread.java:750)
[pool-732-thread-2] WARN org.apache.beam.fn.harness.control.ExecutionStateSampler - Operation ongoing in bundle 2 for at least 01h26m05s without outputting or completing:
  at sun.misc.Unsafe.park(Native Method)
  at java.util.concurrent.locks.LockSupport.park(LockSupport.java:175)
  at java.util.concurrent.locks.AbstractQueuedSynchronizer$ConditionObject.await(AbstractQueuedSynchronizer.java:2039)
  at org.apache.beam.sdk.fn.CancellableQueue.take(CancellableQueue.java:95)
  at org.apache.beam.sdk.fn.data.BeamFnDataInboundObserver.awaitCompletion(BeamFnDataInboundObserver.java:122)
  at org.apache.beam.fn.harness.control.ProcessBundleHandler.processBundle(ProcessBundleHandler.java:550)
  at org.apache.beam.fn.harness.FnHarness$$Lambda$1616/961174949.apply(Unknown Source)
  at org.apache.beam.fn.harness.control.BeamFnControlClient.delegateOnInstructionRequestType(BeamFnControlClient.java:150)
  at org.apache.beam.fn.harness.control.BeamFnControlClient$InboundObserver.lambda$onNext$0(BeamFnControlClient.java:115)
  at org.apache.beam.fn.harness.control.BeamFnControlClient$InboundObserver$$Lambda$1640/951676127.run(Unknown Source)
  at java.util.concurrent.Executors$RunnableAdapter.call(Executors.java:511)
  at java.util.concurrent.FutureTask.run(FutureTask.java:266)
  at org.apache.beam.sdk.util.UnboundedScheduledExecutorService$ScheduledFutureTask.run(UnboundedScheduledExecutorService.java:163)
  at java.util.concurrent.ThreadPoolExecutor.runWorker(ThreadPoolExecutor.java:1149)
  at java.util.concurrent.ThreadPoolExecutor$Worker.run(ThreadPoolExecutor.java:624)
  at java.lang.Thread.run(Thread.java:750)

> Task :runners:spark:3:job-server:validatesPortableRunnerBatch

233 tests completed, 11 failed, 1 skipped

> Task :runners:spark:3:job-server:validatesPortableRunnerBatch FAILED
> Task :runners:spark:3:job-server:validatesPortableRunnerDocker FROM-CACHE

FAILURE: Build failed with an exception.

* What went wrong:
Execution failed for task ':runners:spark:3:job-server:validatesPortableRunnerBatch'.
> There were failing tests. See the report at: file://<https://ci-beam.apache.org/job/beam_PostCommit_Java_PVR_Spark_Batch/ws/src/runners/spark/3/job-server/build/reports/tests/validatesPortableRunnerBatch/index.html>

Deprecated Gradle features were used in this build, making it incompatible with Gradle 9.0.

You can use '--warning-mode all' to show the individual deprecation warnings and determine if they come from your own scripts or plugins.

For more on this, please refer to https://docs.gradle.org/8.4/userguide/command_line_interface.html#sec:command_line_warnings in the Gradle documentation.

BUILD FAILED in 1h 40m 13s
116 actionable tasks: 74 executed, 40 from cache, 2 up-to-date

Publishing build scan...
https://ge.apache.org/s/5gas7bawi3vra

Build step 'Invoke Gradle script' changed build result to FAILURE
Build step 'Invoke Gradle script' marked build as failure

---------------------------------------------------------------------
To unsubscribe, e-mail: builds-unsubscribe@beam.apache.org
For additional commands, e-mail: builds-help@beam.apache.org


Build failed in Jenkins: beam_PostCommit_Java_PVR_Spark_Batch #2675

Posted by Apache Jenkins Server <je...@builds.apache.org>.
See <https://ci-beam.apache.org/job/beam_PostCommit_Java_PVR_Spark_Batch/2675/display/redirect>

Changes:


------------------------------------------
[...truncated 40.94 KB...]
> Task :release:go-licenses:java:dockerPrepare

> Task :release:go-licenses:java:docker
#1 [internal] load build definition from Dockerfile
#1 transferring dockerfile:
#1 transferring dockerfile: 1.24kB done
#1 DONE 0.1s

#2 [internal] load .dockerignore
#2 transferring context: 2B done
#2 DONE 0.1s

#3 [internal] load metadata for docker.io/library/golang:1.20-bullseye
#3 DONE 0.3s

#4 [1/5] FROM docker.io/library/golang:1.20-bullseye@sha256:082569b3303b164cc4a7c88ac59b19b69c1a5d662041ac0dca046ac239632442
#4 resolve docker.io/library/golang:1.20-bullseye@sha256:082569b3303b164cc4a7c88ac59b19b69c1a5d662041ac0dca046ac239632442 0.0s done
#4 DONE 0.0s

#5 [internal] load build context
#5 transferring context: 1.96kB 0.0s done
#5 DONE 0.0s

#6 [4/5] RUN go install github.com/google/go-licenses@latest
#6 CACHED

#7 [2/5] WORKDIR /usr/src/app
#7 CACHED

#8 [3/5] COPY go.mod ./
#8 CACHED

#9 [5/5] COPY get-licenses.sh /opt/apache/beam/
#9 CACHED

#10 exporting to image
#10 exporting layers done
#10 writing image sha256:9ea52fe4a7ba5fd35bea84d8290705d54d882e38018e6e10178b177673c2b500 done
#10 naming to docker.io/library/golicenses-java done
#10 DONE 0.0s

> Task :sdks:java:container:pullLicenses
  Attempting uninstall: setuptools
    Found existing installation: setuptools 44.0.0
    Uninstalling setuptools-44.0.0:
      Successfully uninstalled setuptools-44.0.0
Successfully installed pip-23.3.1 setuptools-68.2.2 wheel-0.41.2
Collecting beautifulsoup4<5.0,>=4.9.0 (from -r <https://ci-beam.apache.org/job/beam_PostCommit_Java_PVR_Spark_Batch/ws/src/sdks/java/container/license_scripts/requirement.txt> (line 19))
  Using cached beautifulsoup4-4.12.2-py3-none-any.whl (142 kB)
Collecting pyyaml<7,>=6.0.1 (from -r <https://ci-beam.apache.org/job/beam_PostCommit_Java_PVR_Spark_Batch/ws/src/sdks/java/container/license_scripts/requirement.txt> (line 20))
  Using cached PyYAML-6.0.1-cp38-cp38-manylinux_2_17_x86_64.manylinux2014_x86_64.whl.metadata (2.1 kB)
Collecting tenacity<9.0,>=6.1.0 (from -r <https://ci-beam.apache.org/job/beam_PostCommit_Java_PVR_Spark_Batch/ws/src/sdks/java/container/license_scripts/requirement.txt> (line 21))
  Using cached tenacity-8.2.3-py3-none-any.whl.metadata (1.0 kB)
Collecting soupsieve>1.2 (from beautifulsoup4<5.0,>=4.9.0->-r <https://ci-beam.apache.org/job/beam_PostCommit_Java_PVR_Spark_Batch/ws/src/sdks/java/container/license_scripts/requirement.txt> (line 19))
  Using cached soupsieve-2.5-py3-none-any.whl.metadata (4.7 kB)
Using cached PyYAML-6.0.1-cp38-cp38-manylinux_2_17_x86_64.manylinux2014_x86_64.whl (736 kB)
Using cached tenacity-8.2.3-py3-none-any.whl (24 kB)
Using cached soupsieve-2.5-py3-none-any.whl (36 kB)
Installing collected packages: tenacity, soupsieve, pyyaml, beautifulsoup4
Successfully installed beautifulsoup4-4.12.2 pyyaml-6.0.1 soupsieve-2.5 tenacity-8.2.3
Executing python <https://ci-beam.apache.org/job/beam_PostCommit_Java_PVR_Spark_Batch/ws/src/sdks/java/container/license_scripts/pull_licenses_java.py> --license_index=<https://ci-beam.apache.org/job/beam_PostCommit_Java_PVR_Spark_Batch/ws/src/sdks/java/container/build/reports/dependency-license/index.json>        --output_dir=<https://ci-beam.apache.org/job/beam_PostCommit_Java_PVR_Spark_Batch/ws/src/sdks/java/container/build/target/java_third_party_licenses>        --dep_url_yaml=<https://ci-beam.apache.org/job/beam_PostCommit_Java_PVR_Spark_Batch/ws/src/sdks/java/container/license_scripts/dep_urls_java.yaml>        --manual_license_path=<https://ci-beam.apache.org/job/beam_PostCommit_Java_PVR_Spark_Batch/ws/src/sdks/java/container/license_scripts/manual_licenses>
INFO:root:Pulling license for 125 dependencies using 16 threads.
INFO:root:Replaced local file URL with file://<https://ci-beam.apache.org/job/beam_PostCommit_Java_PVR_Spark_Batch/ws/src/sdks/java/container/license_scripts/manual_licenses/xz/COPYING> for xz-1.5
INFO:root:pull_licenses_java.py succeed. It took 1.452699 seconds with 16 threads.
Copying licenses from <https://ci-beam.apache.org/job/beam_PostCommit_Java_PVR_Spark_Batch/ws/src/sdks/java/container/build/target/java_third_party_licenses> to <https://ci-beam.apache.org/job/beam_PostCommit_Java_PVR_Spark_Batch/ws/src/sdks/java/container/build/target/third_party_licenses.>
Finished license_scripts.sh

> Task :release:go-licenses:java:dockerRun
+ rm -rf '/output/*'
+ go get github.com/apache/beam/sdks/v2/java/container
go: downloading github.com/apache/beam/sdks/v2 v2.51.0
go: downloading github.com/apache/beam v2.51.0+incompatible

> Task :sdks:java:container:java8:copyJavaThirdPartyLicenses

> Task :sdks:java:container:downloadCloudProfilerAgent
  % Total    % Received % Xferd  Average Speed   Time    Time     Time  Current
                                 Dload  Upload   Total   Spent    Left  Speed
  0     0    0     0    0     0      0      0 --:--:-- --:--:-- --:--:--     0version.txt
NOTICES
profiler_java_agent.so
100 4183k  100 4183k    0     0  16.6M      0 --:--:-- --:--:-- --:--:-- 16.6M

> Task :sdks:java:container:goPrepare UP-TO-DATE

> Task :release:go-licenses:java:dockerRun
go: downloading google.golang.org/grpc v1.58.1
go: downloading github.com/golang/protobuf v1.5.3
go: downloading google.golang.org/protobuf v1.31.0
go: downloading golang.org/x/sys v0.12.0
go: downloading golang.org/x/net v0.15.0
go: downloading google.golang.org/genproto/googleapis/rpc v0.0.0-20230913181813-007df8e322eb
go: downloading google.golang.org/genproto v0.0.0-20230821184602-ccc8af3d0e93
go: downloading golang.org/x/text v0.13.0

> Task :sdks:java:container:goBuild
/home/jenkins/go/bin/go1.21.3 build -o ./build/target/linux_amd64/boot boot.go boot_test.go pathingjar.go pathingjar_test.go

> Task :sdks:java:container:java8:copySdkHarnessLauncher

> Task :release:go-licenses:java:dockerRun
go: added github.com/apache/beam/sdks/v2 v2.51.0
go: added github.com/golang/protobuf v1.5.3
go: added golang.org/x/net v0.15.0
go: added golang.org/x/sys v0.12.0
go: added golang.org/x/text v0.13.0
go: added google.golang.org/genproto/googleapis/rpc v0.0.0-20230913181813-007df8e322eb
go: added google.golang.org/grpc v1.58.1
go: added google.golang.org/protobuf v1.31.0
+ go-licenses save github.com/apache/beam/sdks/v2/java/container --save_path=/output/licenses
W1027 22:21:12.042839      36 library.go:101] "golang.org/x/sys/unix" contains non-Go code that can't be inspected for further dependencies:
/go/pkg/mod/golang.org/x/sys@v0.12.0/unix/asm_linux_amd64.s
+ go-licenses csv github.com/apache/beam/sdks/v2/java/container
+ tee /output/licenses/list.csv
W1027 22:21:19.464950      78 library.go:101] "golang.org/x/sys/unix" contains non-Go code that can't be inspected for further dependencies:
/go/pkg/mod/golang.org/x/sys@v0.12.0/unix/asm_linux_amd64.s
github.com/apache/beam/sdks/v2/go,https://github.com/apache/beam/blob/sdks/v2.51.0/sdks/go/README.md,Apache-2.0
github.com/apache/beam/sdks/v2/java/container,https://github.com/apache/beam/blob/sdks/v2.51.0/sdks/LICENSE,Apache-2.0
github.com/golang/protobuf,https://github.com/golang/protobuf/blob/v1.5.3/LICENSE,BSD-3-Clause
golang.org/x/net,https://cs.opensource.google/go/x/net/+/v0.15.0:LICENSE,BSD-3-Clause
golang.org/x/sys/unix,https://cs.opensource.google/go/x/sys/+/v0.12.0:LICENSE,BSD-3-Clause
golang.org/x/text,https://cs.opensource.google/go/x/text/+/v0.13.0:LICENSE,BSD-3-Clause
google.golang.org/genproto/googleapis/rpc/status,https://github.com/googleapis/go-genproto/blob/007df8e322eb/googleapis/rpc/LICENSE,Apache-2.0
google.golang.org/grpc,https://github.com/grpc/grpc-go/blob/v1.58.1/LICENSE,Apache-2.0
google.golang.org/protobuf,https://github.com/protocolbuffers/protobuf-go/blob/v1.31.0/LICENSE,BSD-3-Clause
+ chmod -R a+w /output/licenses

> Task :runners:spark:3:job-server:validatesPortableRunnerBatch
> Task :release:go-licenses:java:createLicenses
> Task :sdks:java:container:java8:copyGolangLicenses
> Task :sdks:java:container:java8:dockerPrepare

> Task :sdks:java:container:java8:docker
#1 [internal] load build definition from Dockerfile
#1 transferring dockerfile: 2.59kB done
#1 DONE 0.0s

#2 [internal] load .dockerignore
#2 transferring context: 2B done
#2 DONE 0.0s

#3 [internal] load metadata for docker.io/library/eclipse-temurin:8
#3 DONE 0.4s

#4 [ 1/16] FROM docker.io/library/eclipse-temurin:8@sha256:5840452260db162c2dd31033cb55575745861634b1be75a1d8cff559b6c8b942
#4 resolve docker.io/library/eclipse-temurin:8@sha256:5840452260db162c2dd31033cb55575745861634b1be75a1d8cff559b6c8b942 0.0s done
#4 CACHED

#5 [internal] load build context
#5 transferring context: 51.03MB 0.4s done
#5 DONE 0.4s

#6 [ 2/16] ADD target/slf4j-api.jar /opt/apache/beam/jars/
#6 DONE 1.5s

#7 [ 3/16] ADD target/slf4j-jdk14.jar /opt/apache/beam/jars/
#7 DONE 0.1s

#8 [ 4/16] ADD target/jcl-over-slf4j.jar /opt/apache/beam/jars/
#8 DONE 0.1s

#9 [ 5/16] ADD target/log4j-over-slf4j.jar /opt/apache/beam/jars/
#9 DONE 0.1s

#10 [ 6/16] ADD target/log4j-to-slf4j.jar /opt/apache/beam/jars/
#10 DONE 0.1s

#11 [ 7/16] ADD target/beam-sdks-java-harness.jar /opt/apache/beam/jars/
#11 DONE 0.1s

#12 [ 8/16] COPY target/jamm.jar target/open-module-agent*.jar /opt/apache/beam/jars/
#12 DONE 0.1s

#13 [ 9/16] COPY target/linux_amd64/boot /opt/apache/beam/
#13 DONE 0.2s

#14 [10/16] COPY target/LICENSE /opt/apache/beam/
#14 DONE 0.1s

#15 [11/16] COPY target/NOTICE /opt/apache/beam/
#15 DONE 0.1s

#16 [12/16] ADD target/third_party_licenses /opt/apache/beam/third_party_licenses/
#16 DONE 0.3s

#17 [13/16] COPY target/LICENSE target/options/* /opt/apache/beam/options/
#17 DONE 0.1s

#18 [14/16] COPY target/go-licenses/* /opt/apache/beam/third_party_licenses/golang/
#18 DONE 0.1s

#19 [15/16] RUN if [ "true" = "false" ] ; then     rm -rf /opt/apache/beam/third_party_licenses ;    fi
#19 DONE 0.3s

#20 [16/16] COPY target/profiler/* /opt/google_cloud_profiler/
#20 DONE 0.1s

#21 exporting to image
#21 exporting layers
#21 exporting layers 0.2s done
#21 writing image sha256:0d468ffe8d06e424aef1dfd8c0fb61e36b97f28ec3000137999f53bac383c04f
#21 writing image sha256:0d468ffe8d06e424aef1dfd8c0fb61e36b97f28ec3000137999f53bac383c04f done
#21 naming to docker.io/apache/beam_java8_sdk:2.52.0.dev done
#21 DONE 0.3s

> Task :runners:spark:3:job-server:validatesPortableRunnerBatch

org.apache.beam.sdk.transforms.CombineTest$WindowingTests > testCombineGloballyAsSingletonView FAILED
    java.lang.RuntimeException at CombineTest.java:1359

org.apache.beam.sdk.transforms.CombineTest$WindowingTests > testWindowedCombineGloballyAsSingletonView FAILED
    java.lang.RuntimeException at CombineTest.java:1402

[shutdown-hook-0] INFO org.apache.spark.util.ShutdownHookManager - Shutdown hook called
[shutdown-hook-0] INFO org.apache.spark.util.ShutdownHookManager - Deleting directory /tmp/spark-9a33f5a2-07e3-42fd-93b4-4b502c4a8344
[shutdown-hook-0] INFO org.apache.spark.util.ShutdownHookManager - Shutdown hook called
[shutdown-hook-0] INFO org.apache.spark.util.ShutdownHookManager - Deleting directory /tmp/spark-3241ebb2-0ff7-4ed0-bc33-b018582480a4
[shutdown-hook-0] INFO org.apache.spark.util.ShutdownHookManager - Shutdown hook called
[shutdown-hook-0] INFO org.apache.spark.util.ShutdownHookManager - Deleting directory /tmp/spark-f33a9ad5-395c-44d1-a48e-33b6794043c1
[shutdown-hook-0] INFO org.apache.spark.util.ShutdownHookManager - Shutdown hook called
[shutdown-hook-0] INFO org.apache.spark.util.ShutdownHookManager - Deleting directory /tmp/spark-8bb8361b-5cd1-4a68-8e27-9001d1486bf1

> Task :runners:spark:3:job-server:validatesPortableRunnerBatch

233 tests completed, 2 failed, 1 skipped

> Task :runners:spark:3:job-server:validatesPortableRunnerBatch FAILED
> Task :runners:spark:3:job-server:validatesPortableRunnerDocker FROM-CACHE

FAILURE: Build failed with an exception.

* What went wrong:
Execution failed for task ':runners:spark:3:job-server:validatesPortableRunnerBatch'.
> There were failing tests. See the report at: file://<https://ci-beam.apache.org/job/beam_PostCommit_Java_PVR_Spark_Batch/ws/src/runners/spark/3/job-server/build/reports/tests/validatesPortableRunnerBatch/index.html>

Deprecated Gradle features were used in this build, making it incompatible with Gradle 9.0.

You can use '--warning-mode all' to show the individual deprecation warnings and determine if they come from your own scripts or plugins.

For more on this, please refer to https://docs.gradle.org/8.4/userguide/command_line_interface.html#sec:command_line_warnings in the Gradle documentation.

BUILD FAILED in 1h 31m 30s
116 actionable tasks: 74 executed, 40 from cache, 2 up-to-date

Publishing build scan...
https://ge.apache.org/s/rewldya6wocr4

Build step 'Invoke Gradle script' changed build result to FAILURE
Build step 'Invoke Gradle script' marked build as failure

---------------------------------------------------------------------
To unsubscribe, e-mail: builds-unsubscribe@beam.apache.org
For additional commands, e-mail: builds-help@beam.apache.org