You are viewing a plain text version of this content. The canonical link for it is here.
Posted to dev@lucene.apache.org by Policeman Jenkins Server <je...@thetaphi.de> on 2013/07/24 15:59:45 UTC

[JENKINS] Lucene-Solr-trunk-Linux (32bit/jdk1.7.0_25) - Build # 6711 - Failure!

Build: http://jenkins.thetaphi.de/job/Lucene-Solr-trunk-Linux/6711/
Java: 32bit/jdk1.7.0_25 -server -XX:+UseSerialGC

4 tests failed.
REGRESSION:  org.apache.lucene.analysis.icu.TestICUFoldingFilter.testRandomStrings

Error Message:
Could not initialize class org.apache.lucene.analysis.icu.ICUFoldingFilter

Stack Trace:
java.lang.NoClassDefFoundError: Could not initialize class org.apache.lucene.analysis.icu.ICUFoldingFilter
	at __randomizedtesting.SeedInfo.seed([E8BEA549989FD0BE:6037A5F73B9B878B]:0)
	at org.apache.lucene.analysis.icu.TestICUFoldingFilter$1.createComponents(TestICUFoldingFilter.java:34)
	at org.apache.lucene.analysis.Analyzer.tokenStream(Analyzer.java:139)
	at org.apache.lucene.analysis.BaseTokenStreamTestCase.checkAnalysisConsistency(BaseTokenStreamTestCase.java:620)
	at org.apache.lucene.analysis.BaseTokenStreamTestCase.checkRandomData(BaseTokenStreamTestCase.java:546)
	at org.apache.lucene.analysis.BaseTokenStreamTestCase.checkRandomData(BaseTokenStreamTestCase.java:447)
	at org.apache.lucene.analysis.BaseTokenStreamTestCase.checkRandomData(BaseTokenStreamTestCase.java:370)
	at org.apache.lucene.analysis.icu.TestICUFoldingFilter.testRandomStrings(TestICUFoldingFilter.java:79)
	at sun.reflect.NativeMethodAccessorImpl.invoke0(Native Method)
	at sun.reflect.NativeMethodAccessorImpl.invoke(NativeMethodAccessorImpl.java:57)
	at sun.reflect.DelegatingMethodAccessorImpl.invoke(DelegatingMethodAccessorImpl.java:43)
	at java.lang.reflect.Method.invoke(Method.java:606)
	at com.carrotsearch.randomizedtesting.RandomizedRunner.invoke(RandomizedRunner.java:1559)
	at com.carrotsearch.randomizedtesting.RandomizedRunner.access$600(RandomizedRunner.java:79)
	at com.carrotsearch.randomizedtesting.RandomizedRunner$6.evaluate(RandomizedRunner.java:737)
	at com.carrotsearch.randomizedtesting.RandomizedRunner$7.evaluate(RandomizedRunner.java:773)
	at com.carrotsearch.randomizedtesting.RandomizedRunner$8.evaluate(RandomizedRunner.java:787)
	at org.apache.lucene.util.TestRuleSetupTeardownChained$1.evaluate(TestRuleSetupTeardownChained.java:50)
	at org.apache.lucene.util.TestRuleFieldCacheSanity$1.evaluate(TestRuleFieldCacheSanity.java:51)
	at org.apache.lucene.util.AbstractBeforeAfterRule$1.evaluate(AbstractBeforeAfterRule.java:46)
	at com.carrotsearch.randomizedtesting.rules.SystemPropertiesInvariantRule$1.evaluate(SystemPropertiesInvariantRule.java:55)
	at org.apache.lucene.util.TestRuleThreadAndTestName$1.evaluate(TestRuleThreadAndTestName.java:49)
	at org.apache.lucene.util.TestRuleIgnoreAfterMaxFailures$1.evaluate(TestRuleIgnoreAfterMaxFailures.java:70)
	at org.apache.lucene.util.TestRuleMarkFailure$1.evaluate(TestRuleMarkFailure.java:48)
	at com.carrotsearch.randomizedtesting.rules.StatementAdapter.evaluate(StatementAdapter.java:36)
	at com.carrotsearch.randomizedtesting.ThreadLeakControl$StatementRunner.run(ThreadLeakControl.java:358)
	at com.carrotsearch.randomizedtesting.ThreadLeakControl.forkTimeoutingTask(ThreadLeakControl.java:782)
	at com.carrotsearch.randomizedtesting.ThreadLeakControl$3.evaluate(ThreadLeakControl.java:442)
	at com.carrotsearch.randomizedtesting.RandomizedRunner.runSingleTest(RandomizedRunner.java:746)
	at com.carrotsearch.randomizedtesting.RandomizedRunner$3.evaluate(RandomizedRunner.java:648)
	at com.carrotsearch.randomizedtesting.RandomizedRunner$4.evaluate(RandomizedRunner.java:682)
	at com.carrotsearch.randomizedtesting.RandomizedRunner$5.evaluate(RandomizedRunner.java:693)
	at org.apache.lucene.util.AbstractBeforeAfterRule$1.evaluate(AbstractBeforeAfterRule.java:46)
	at org.apache.lucene.util.TestRuleStoreClassName$1.evaluate(TestRuleStoreClassName.java:42)
	at com.carrotsearch.randomizedtesting.rules.SystemPropertiesInvariantRule$1.evaluate(SystemPropertiesInvariantRule.java:55)
	at com.carrotsearch.randomizedtesting.rules.NoShadowingOrOverridesOnMethodsRule$1.evaluate(NoShadowingOrOverridesOnMethodsRule.java:39)
	at com.carrotsearch.randomizedtesting.rules.NoShadowingOrOverridesOnMethodsRule$1.evaluate(NoShadowingOrOverridesOnMethodsRule.java:39)
	at com.carrotsearch.randomizedtesting.rules.StatementAdapter.evaluate(StatementAdapter.java:36)
	at org.apache.lucene.util.TestRuleAssertionsRequired$1.evaluate(TestRuleAssertionsRequired.java:43)
	at org.apache.lucene.util.TestRuleMarkFailure$1.evaluate(TestRuleMarkFailure.java:48)
	at org.apache.lucene.util.TestRuleIgnoreAfterMaxFailures$1.evaluate(TestRuleIgnoreAfterMaxFailures.java:70)
	at org.apache.lucene.util.TestRuleIgnoreTestSuites$1.evaluate(TestRuleIgnoreTestSuites.java:55)
	at com.carrotsearch.randomizedtesting.rules.StatementAdapter.evaluate(StatementAdapter.java:36)
	at com.carrotsearch.randomizedtesting.ThreadLeakControl$StatementRunner.run(ThreadLeakControl.java:358)
	at java.lang.Thread.run(Thread.java:724)


REGRESSION:  org.apache.lucene.analysis.icu.TestICUFoldingFilter.testDefaults

Error Message:
Could not initialize class org.apache.lucene.analysis.icu.ICUFoldingFilter

Stack Trace:
java.lang.NoClassDefFoundError: Could not initialize class org.apache.lucene.analysis.icu.ICUFoldingFilter
	at __randomizedtesting.SeedInfo.seed([E8BEA549989FD0BE:471AEB63B09A8392]:0)
	at org.apache.lucene.analysis.icu.TestICUFoldingFilter$1.createComponents(TestICUFoldingFilter.java:34)
	at org.apache.lucene.analysis.Analyzer.tokenStream(Analyzer.java:177)
	at org.apache.lucene.analysis.BaseTokenStreamTestCase.assertAnalyzesTo(BaseTokenStreamTestCase.java:302)
	at org.apache.lucene.analysis.BaseTokenStreamTestCase.assertAnalyzesTo(BaseTokenStreamTestCase.java:310)
	at org.apache.lucene.analysis.icu.TestICUFoldingFilter.testDefaults(TestICUFoldingFilter.java:39)
	at sun.reflect.NativeMethodAccessorImpl.invoke0(Native Method)
	at sun.reflect.NativeMethodAccessorImpl.invoke(NativeMethodAccessorImpl.java:57)
	at sun.reflect.DelegatingMethodAccessorImpl.invoke(DelegatingMethodAccessorImpl.java:43)
	at java.lang.reflect.Method.invoke(Method.java:606)
	at com.carrotsearch.randomizedtesting.RandomizedRunner.invoke(RandomizedRunner.java:1559)
	at com.carrotsearch.randomizedtesting.RandomizedRunner.access$600(RandomizedRunner.java:79)
	at com.carrotsearch.randomizedtesting.RandomizedRunner$6.evaluate(RandomizedRunner.java:737)
	at com.carrotsearch.randomizedtesting.RandomizedRunner$7.evaluate(RandomizedRunner.java:773)
	at com.carrotsearch.randomizedtesting.RandomizedRunner$8.evaluate(RandomizedRunner.java:787)
	at org.apache.lucene.util.TestRuleSetupTeardownChained$1.evaluate(TestRuleSetupTeardownChained.java:50)
	at org.apache.lucene.util.TestRuleFieldCacheSanity$1.evaluate(TestRuleFieldCacheSanity.java:51)
	at org.apache.lucene.util.AbstractBeforeAfterRule$1.evaluate(AbstractBeforeAfterRule.java:46)
	at com.carrotsearch.randomizedtesting.rules.SystemPropertiesInvariantRule$1.evaluate(SystemPropertiesInvariantRule.java:55)
	at org.apache.lucene.util.TestRuleThreadAndTestName$1.evaluate(TestRuleThreadAndTestName.java:49)
	at org.apache.lucene.util.TestRuleIgnoreAfterMaxFailures$1.evaluate(TestRuleIgnoreAfterMaxFailures.java:70)
	at org.apache.lucene.util.TestRuleMarkFailure$1.evaluate(TestRuleMarkFailure.java:48)
	at com.carrotsearch.randomizedtesting.rules.StatementAdapter.evaluate(StatementAdapter.java:36)
	at com.carrotsearch.randomizedtesting.ThreadLeakControl$StatementRunner.run(ThreadLeakControl.java:358)
	at com.carrotsearch.randomizedtesting.ThreadLeakControl.forkTimeoutingTask(ThreadLeakControl.java:782)
	at com.carrotsearch.randomizedtesting.ThreadLeakControl$3.evaluate(ThreadLeakControl.java:442)
	at com.carrotsearch.randomizedtesting.RandomizedRunner.runSingleTest(RandomizedRunner.java:746)
	at com.carrotsearch.randomizedtesting.RandomizedRunner$3.evaluate(RandomizedRunner.java:648)
	at com.carrotsearch.randomizedtesting.RandomizedRunner$4.evaluate(RandomizedRunner.java:682)
	at com.carrotsearch.randomizedtesting.RandomizedRunner$5.evaluate(RandomizedRunner.java:693)
	at org.apache.lucene.util.AbstractBeforeAfterRule$1.evaluate(AbstractBeforeAfterRule.java:46)
	at org.apache.lucene.util.TestRuleStoreClassName$1.evaluate(TestRuleStoreClassName.java:42)
	at com.carrotsearch.randomizedtesting.rules.SystemPropertiesInvariantRule$1.evaluate(SystemPropertiesInvariantRule.java:55)
	at com.carrotsearch.randomizedtesting.rules.NoShadowingOrOverridesOnMethodsRule$1.evaluate(NoShadowingOrOverridesOnMethodsRule.java:39)
	at com.carrotsearch.randomizedtesting.rules.NoShadowingOrOverridesOnMethodsRule$1.evaluate(NoShadowingOrOverridesOnMethodsRule.java:39)
	at com.carrotsearch.randomizedtesting.rules.StatementAdapter.evaluate(StatementAdapter.java:36)
	at org.apache.lucene.util.TestRuleAssertionsRequired$1.evaluate(TestRuleAssertionsRequired.java:43)
	at org.apache.lucene.util.TestRuleMarkFailure$1.evaluate(TestRuleMarkFailure.java:48)
	at org.apache.lucene.util.TestRuleIgnoreAfterMaxFailures$1.evaluate(TestRuleIgnoreAfterMaxFailures.java:70)
	at org.apache.lucene.util.TestRuleIgnoreTestSuites$1.evaluate(TestRuleIgnoreTestSuites.java:55)
	at com.carrotsearch.randomizedtesting.rules.StatementAdapter.evaluate(StatementAdapter.java:36)
	at com.carrotsearch.randomizedtesting.ThreadLeakControl$StatementRunner.run(ThreadLeakControl.java:358)
	at java.lang.Thread.run(Thread.java:724)


REGRESSION:  org.apache.lucene.analysis.icu.TestICUFoldingFilter.testEmptyTerm

Error Message:
Could not initialize class org.apache.lucene.analysis.icu.ICUFoldingFilter

Stack Trace:
java.lang.NoClassDefFoundError: Could not initialize class org.apache.lucene.analysis.icu.ICUFoldingFilter
	at __randomizedtesting.SeedInfo.seed([E8BEA549989FD0BE:2A82FD1BCC8EAFAF]:0)
	at org.apache.lucene.analysis.icu.TestICUFoldingFilter$2.createComponents(TestICUFoldingFilter.java:87)
	at org.apache.lucene.analysis.Analyzer.tokenStream(Analyzer.java:177)
	at org.apache.lucene.analysis.BaseTokenStreamTestCase.assertAnalyzesToReuse(BaseTokenStreamTestCase.java:335)
	at org.apache.lucene.analysis.BaseTokenStreamTestCase.assertAnalyzesToReuse(BaseTokenStreamTestCase.java:339)
	at org.apache.lucene.analysis.BaseTokenStreamTestCase.checkOneTermReuse(BaseTokenStreamTestCase.java:365)
	at org.apache.lucene.analysis.icu.TestICUFoldingFilter.testEmptyTerm(TestICUFoldingFilter.java:90)
	at sun.reflect.NativeMethodAccessorImpl.invoke0(Native Method)
	at sun.reflect.NativeMethodAccessorImpl.invoke(NativeMethodAccessorImpl.java:57)
	at sun.reflect.DelegatingMethodAccessorImpl.invoke(DelegatingMethodAccessorImpl.java:43)
	at java.lang.reflect.Method.invoke(Method.java:606)
	at com.carrotsearch.randomizedtesting.RandomizedRunner.invoke(RandomizedRunner.java:1559)
	at com.carrotsearch.randomizedtesting.RandomizedRunner.access$600(RandomizedRunner.java:79)
	at com.carrotsearch.randomizedtesting.RandomizedRunner$6.evaluate(RandomizedRunner.java:737)
	at com.carrotsearch.randomizedtesting.RandomizedRunner$7.evaluate(RandomizedRunner.java:773)
	at com.carrotsearch.randomizedtesting.RandomizedRunner$8.evaluate(RandomizedRunner.java:787)
	at org.apache.lucene.util.TestRuleSetupTeardownChained$1.evaluate(TestRuleSetupTeardownChained.java:50)
	at org.apache.lucene.util.TestRuleFieldCacheSanity$1.evaluate(TestRuleFieldCacheSanity.java:51)
	at org.apache.lucene.util.AbstractBeforeAfterRule$1.evaluate(AbstractBeforeAfterRule.java:46)
	at com.carrotsearch.randomizedtesting.rules.SystemPropertiesInvariantRule$1.evaluate(SystemPropertiesInvariantRule.java:55)
	at org.apache.lucene.util.TestRuleThreadAndTestName$1.evaluate(TestRuleThreadAndTestName.java:49)
	at org.apache.lucene.util.TestRuleIgnoreAfterMaxFailures$1.evaluate(TestRuleIgnoreAfterMaxFailures.java:70)
	at org.apache.lucene.util.TestRuleMarkFailure$1.evaluate(TestRuleMarkFailure.java:48)
	at com.carrotsearch.randomizedtesting.rules.StatementAdapter.evaluate(StatementAdapter.java:36)
	at com.carrotsearch.randomizedtesting.ThreadLeakControl$StatementRunner.run(ThreadLeakControl.java:358)
	at com.carrotsearch.randomizedtesting.ThreadLeakControl.forkTimeoutingTask(ThreadLeakControl.java:782)
	at com.carrotsearch.randomizedtesting.ThreadLeakControl$3.evaluate(ThreadLeakControl.java:442)
	at com.carrotsearch.randomizedtesting.RandomizedRunner.runSingleTest(RandomizedRunner.java:746)
	at com.carrotsearch.randomizedtesting.RandomizedRunner$3.evaluate(RandomizedRunner.java:648)
	at com.carrotsearch.randomizedtesting.RandomizedRunner$4.evaluate(RandomizedRunner.java:682)
	at com.carrotsearch.randomizedtesting.RandomizedRunner$5.evaluate(RandomizedRunner.java:693)
	at org.apache.lucene.util.AbstractBeforeAfterRule$1.evaluate(AbstractBeforeAfterRule.java:46)
	at org.apache.lucene.util.TestRuleStoreClassName$1.evaluate(TestRuleStoreClassName.java:42)
	at com.carrotsearch.randomizedtesting.rules.SystemPropertiesInvariantRule$1.evaluate(SystemPropertiesInvariantRule.java:55)
	at com.carrotsearch.randomizedtesting.rules.NoShadowingOrOverridesOnMethodsRule$1.evaluate(NoShadowingOrOverridesOnMethodsRule.java:39)
	at com.carrotsearch.randomizedtesting.rules.NoShadowingOrOverridesOnMethodsRule$1.evaluate(NoShadowingOrOverridesOnMethodsRule.java:39)
	at com.carrotsearch.randomizedtesting.rules.StatementAdapter.evaluate(StatementAdapter.java:36)
	at org.apache.lucene.util.TestRuleAssertionsRequired$1.evaluate(TestRuleAssertionsRequired.java:43)
	at org.apache.lucene.util.TestRuleMarkFailure$1.evaluate(TestRuleMarkFailure.java:48)
	at org.apache.lucene.util.TestRuleIgnoreAfterMaxFailures$1.evaluate(TestRuleIgnoreAfterMaxFailures.java:70)
	at org.apache.lucene.util.TestRuleIgnoreTestSuites$1.evaluate(TestRuleIgnoreTestSuites.java:55)
	at com.carrotsearch.randomizedtesting.rules.StatementAdapter.evaluate(StatementAdapter.java:36)
	at com.carrotsearch.randomizedtesting.ThreadLeakControl$StatementRunner.run(ThreadLeakControl.java:358)
	at java.lang.Thread.run(Thread.java:724)


REGRESSION:  org.apache.lucene.analysis.icu.TestICUFoldingFilterFactory.test

Error Message:


Stack Trace:
java.lang.ExceptionInInitializerError
	at __randomizedtesting.SeedInfo.seed([E8BEA549989FD0BE:60EA9A933663BD46]:0)
	at org.apache.lucene.analysis.icu.ICUFoldingFilterFactory.create(ICUFoldingFilterFactory.java:50)
	at org.apache.lucene.analysis.icu.TestICUFoldingFilterFactory.test(TestICUFoldingFilterFactory.java:36)
	at sun.reflect.NativeMethodAccessorImpl.invoke0(Native Method)
	at sun.reflect.NativeMethodAccessorImpl.invoke(NativeMethodAccessorImpl.java:57)
	at sun.reflect.DelegatingMethodAccessorImpl.invoke(DelegatingMethodAccessorImpl.java:43)
	at java.lang.reflect.Method.invoke(Method.java:606)
	at com.carrotsearch.randomizedtesting.RandomizedRunner.invoke(RandomizedRunner.java:1559)
	at com.carrotsearch.randomizedtesting.RandomizedRunner.access$600(RandomizedRunner.java:79)
	at com.carrotsearch.randomizedtesting.RandomizedRunner$6.evaluate(RandomizedRunner.java:737)
	at com.carrotsearch.randomizedtesting.RandomizedRunner$7.evaluate(RandomizedRunner.java:773)
	at com.carrotsearch.randomizedtesting.RandomizedRunner$8.evaluate(RandomizedRunner.java:787)
	at org.apache.lucene.util.TestRuleSetupTeardownChained$1.evaluate(TestRuleSetupTeardownChained.java:50)
	at org.apache.lucene.util.TestRuleFieldCacheSanity$1.evaluate(TestRuleFieldCacheSanity.java:51)
	at org.apache.lucene.util.AbstractBeforeAfterRule$1.evaluate(AbstractBeforeAfterRule.java:46)
	at com.carrotsearch.randomizedtesting.rules.SystemPropertiesInvariantRule$1.evaluate(SystemPropertiesInvariantRule.java:55)
	at org.apache.lucene.util.TestRuleThreadAndTestName$1.evaluate(TestRuleThreadAndTestName.java:49)
	at org.apache.lucene.util.TestRuleIgnoreAfterMaxFailures$1.evaluate(TestRuleIgnoreAfterMaxFailures.java:70)
	at org.apache.lucene.util.TestRuleMarkFailure$1.evaluate(TestRuleMarkFailure.java:48)
	at com.carrotsearch.randomizedtesting.rules.StatementAdapter.evaluate(StatementAdapter.java:36)
	at com.carrotsearch.randomizedtesting.ThreadLeakControl$StatementRunner.run(ThreadLeakControl.java:358)
	at com.carrotsearch.randomizedtesting.ThreadLeakControl.forkTimeoutingTask(ThreadLeakControl.java:782)
	at com.carrotsearch.randomizedtesting.ThreadLeakControl$3.evaluate(ThreadLeakControl.java:442)
	at com.carrotsearch.randomizedtesting.RandomizedRunner.runSingleTest(RandomizedRunner.java:746)
	at com.carrotsearch.randomizedtesting.RandomizedRunner$3.evaluate(RandomizedRunner.java:648)
	at com.carrotsearch.randomizedtesting.RandomizedRunner$4.evaluate(RandomizedRunner.java:682)
	at com.carrotsearch.randomizedtesting.RandomizedRunner$5.evaluate(RandomizedRunner.java:693)
	at org.apache.lucene.util.AbstractBeforeAfterRule$1.evaluate(AbstractBeforeAfterRule.java:46)
	at org.apache.lucene.util.TestRuleStoreClassName$1.evaluate(TestRuleStoreClassName.java:42)
	at com.carrotsearch.randomizedtesting.rules.SystemPropertiesInvariantRule$1.evaluate(SystemPropertiesInvariantRule.java:55)
	at com.carrotsearch.randomizedtesting.rules.NoShadowingOrOverridesOnMethodsRule$1.evaluate(NoShadowingOrOverridesOnMethodsRule.java:39)
	at com.carrotsearch.randomizedtesting.rules.NoShadowingOrOverridesOnMethodsRule$1.evaluate(NoShadowingOrOverridesOnMethodsRule.java:39)
	at com.carrotsearch.randomizedtesting.rules.StatementAdapter.evaluate(StatementAdapter.java:36)
	at org.apache.lucene.util.TestRuleAssertionsRequired$1.evaluate(TestRuleAssertionsRequired.java:43)
	at org.apache.lucene.util.TestRuleMarkFailure$1.evaluate(TestRuleMarkFailure.java:48)
	at org.apache.lucene.util.TestRuleIgnoreAfterMaxFailures$1.evaluate(TestRuleIgnoreAfterMaxFailures.java:70)
	at org.apache.lucene.util.TestRuleIgnoreTestSuites$1.evaluate(TestRuleIgnoreTestSuites.java:55)
	at com.carrotsearch.randomizedtesting.rules.StatementAdapter.evaluate(StatementAdapter.java:36)
	at com.carrotsearch.randomizedtesting.ThreadLeakControl$StatementRunner.run(ThreadLeakControl.java:358)
	at java.lang.Thread.run(Thread.java:724)
Caused by: java.lang.RuntimeException: java.io.IOException: ICU data file error: Header authentication failed, please check if you have a valid ICU data file
	at com.ibm.icu.impl.Normalizer2Impl.load(Normalizer2Impl.java:492)
	at com.ibm.icu.impl.Norm2AllModes$1.createInstance(Norm2AllModes.java:348)
	at com.ibm.icu.impl.Norm2AllModes$1.createInstance(Norm2AllModes.java:342)
	at com.ibm.icu.impl.SoftCache.getInstance(SoftCache.java:58)
	at com.ibm.icu.impl.Norm2AllModes.getInstance(Norm2AllModes.java:339)
	at com.ibm.icu.text.Normalizer2.getInstance(Normalizer2.java:190)
	at org.apache.lucene.analysis.icu.ICUFoldingFilter.<clinit>(ICUFoldingFilter.java:64)
	... 39 more
Caused by: java.io.IOException: ICU data file error: Header authentication failed, please check if you have a valid ICU data file
	at com.ibm.icu.impl.ICUBinary.readHeader(ICUBinary.java:132)
	at com.ibm.icu.impl.ICUBinary.readHeaderAndDataVersion(ICUBinary.java:144)
	at com.ibm.icu.impl.Normalizer2Impl.load(Normalizer2Impl.java:420)
	... 45 more




Build Log:
[...truncated 5438 lines...]
   [junit4] Suite: org.apache.lucene.analysis.icu.TestICUFoldingFilterFactory
   [junit4]   2> NOTE: reproduce with: ant test  -Dtestcase=TestICUFoldingFilterFactory -Dtests.method=test -Dtests.seed=E8BEA549989FD0BE -Dtests.multiplier=3 -Dtests.slow=true -Dtests.locale=sr_BA_#Latn -Dtests.timezone=Asia/Macau -Dtests.file.encoding=UTF-8
   [junit4] ERROR   0.26s J0 | TestICUFoldingFilterFactory.test <<<
   [junit4]    > Throwable #1: java.lang.ExceptionInInitializerError
   [junit4]    > 	at __randomizedtesting.SeedInfo.seed([E8BEA549989FD0BE:60EA9A933663BD46]:0)
   [junit4]    > 	at org.apache.lucene.analysis.icu.ICUFoldingFilterFactory.create(ICUFoldingFilterFactory.java:50)
   [junit4]    > 	at org.apache.lucene.analysis.icu.TestICUFoldingFilterFactory.test(TestICUFoldingFilterFactory.java:36)
   [junit4]    > 	at java.lang.Thread.run(Thread.java:724)
   [junit4]    > Caused by: java.lang.RuntimeException: java.io.IOException: ICU data file error: Header authentication failed, please check if you have a valid ICU data file
   [junit4]    > 	at com.ibm.icu.impl.Normalizer2Impl.load(Normalizer2Impl.java:492)
   [junit4]    > 	at com.ibm.icu.impl.Norm2AllModes$1.createInstance(Norm2AllModes.java:348)
   [junit4]    > 	at com.ibm.icu.impl.Norm2AllModes$1.createInstance(Norm2AllModes.java:342)
   [junit4]    > 	at com.ibm.icu.impl.SoftCache.getInstance(SoftCache.java:58)
   [junit4]    > 	at com.ibm.icu.impl.Norm2AllModes.getInstance(Norm2AllModes.java:339)
   [junit4]    > 	at com.ibm.icu.text.Normalizer2.getInstance(Normalizer2.java:190)
   [junit4]    > 	at org.apache.lucene.analysis.icu.ICUFoldingFilter.<clinit>(ICUFoldingFilter.java:64)
   [junit4]    > 	... 39 more
   [junit4]    > Caused by: java.io.IOException: ICU data file error: Header authentication failed, please check if you have a valid ICU data file
   [junit4]    > 	at com.ibm.icu.impl.ICUBinary.readHeader(ICUBinary.java:132)
   [junit4]    > 	at com.ibm.icu.impl.ICUBinary.readHeaderAndDataVersion(ICUBinary.java:144)
   [junit4]    > 	at com.ibm.icu.impl.Normalizer2Impl.load(Normalizer2Impl.java:420)
   [junit4]    > 	... 45 more
   [junit4]   2> NOTE: test params are: codec=Lucene42: {}, docValues:{}, sim=RandomSimilarityProvider(queryNorm=false,coord=crazy): {}, locale=sr_BA_#Latn, timezone=Asia/Macau
   [junit4]   2> NOTE: Linux 3.2.0-49-generic i386/Oracle Corporation 1.7.0_25 (32-bit)/cpus=8,threads=1,free=48977056,total=64880640
   [junit4]   2> NOTE: All tests run in this JVM: [TestCharArrayIterator, TestICUFoldingFilterFactory]
   [junit4] Completed on J0 in 0.31s, 2 tests, 1 error <<< FAILURES!

[...truncated 22 lines...]
   [junit4] Suite: org.apache.lucene.analysis.icu.TestICUFoldingFilter
   [junit4]   2> TEST FAIL: useCharFilter=false text='q \u1cfa\u1ce6\u1cdc\u1ce6\u1cf1\u1cf0\u1cd6\u1cda'
   [junit4]   2> NOTE: reproduce with: ant test  -Dtestcase=TestICUFoldingFilter -Dtests.method=testRandomStrings -Dtests.seed=E8BEA549989FD0BE -Dtests.multiplier=3 -Dtests.slow=true -Dtests.locale=ja_JP_JP_#u-ca-japanese -Dtests.timezone=America/Thunder_Bay -Dtests.file.encoding=UTF-8
   [junit4] ERROR   0.12s J0 | TestICUFoldingFilter.testRandomStrings <<<
   [junit4]    > Throwable #1: java.lang.NoClassDefFoundError: Could not initialize class org.apache.lucene.analysis.icu.ICUFoldingFilter
   [junit4]    > 	at __randomizedtesting.SeedInfo.seed([E8BEA549989FD0BE:6037A5F73B9B878B]:0)
   [junit4]    > 	at org.apache.lucene.analysis.icu.TestICUFoldingFilter$1.createComponents(TestICUFoldingFilter.java:34)
   [junit4]    > 	at org.apache.lucene.analysis.Analyzer.tokenStream(Analyzer.java:139)
   [junit4]    > 	at org.apache.lucene.analysis.BaseTokenStreamTestCase.checkAnalysisConsistency(BaseTokenStreamTestCase.java:620)
   [junit4]    > 	at org.apache.lucene.analysis.BaseTokenStreamTestCase.checkRandomData(BaseTokenStreamTestCase.java:546)
   [junit4]    > 	at org.apache.lucene.analysis.BaseTokenStreamTestCase.checkRandomData(BaseTokenStreamTestCase.java:447)
   [junit4]    > 	at org.apache.lucene.analysis.BaseTokenStreamTestCase.checkRandomData(BaseTokenStreamTestCase.java:370)
   [junit4]    > 	at org.apache.lucene.analysis.icu.TestICUFoldingFilter.testRandomStrings(TestICUFoldingFilter.java:79)
   [junit4]    > 	at java.lang.Thread.run(Thread.java:724)
   [junit4]   2> NOTE: reproduce with: ant test  -Dtestcase=TestICUFoldingFilter -Dtests.method=testDefaults -Dtests.seed=E8BEA549989FD0BE -Dtests.multiplier=3 -Dtests.slow=true -Dtests.locale=ja_JP_JP_#u-ca-japanese -Dtests.timezone=America/Thunder_Bay -Dtests.file.encoding=UTF-8
   [junit4] ERROR   0.01s J0 | TestICUFoldingFilter.testDefaults <<<
   [junit4]    > Throwable #1: java.lang.NoClassDefFoundError: Could not initialize class org.apache.lucene.analysis.icu.ICUFoldingFilter
   [junit4]    > 	at __randomizedtesting.SeedInfo.seed([E8BEA549989FD0BE:471AEB63B09A8392]:0)
   [junit4]    > 	at org.apache.lucene.analysis.icu.TestICUFoldingFilter$1.createComponents(TestICUFoldingFilter.java:34)
   [junit4]    > 	at org.apache.lucene.analysis.Analyzer.tokenStream(Analyzer.java:177)
   [junit4]    > 	at org.apache.lucene.analysis.BaseTokenStreamTestCase.assertAnalyzesTo(BaseTokenStreamTestCase.java:302)
   [junit4]    > 	at org.apache.lucene.analysis.BaseTokenStreamTestCase.assertAnalyzesTo(BaseTokenStreamTestCase.java:310)
   [junit4]    > 	at org.apache.lucene.analysis.icu.TestICUFoldingFilter.testDefaults(TestICUFoldingFilter.java:39)
   [junit4]    > 	at java.lang.Thread.run(Thread.java:724)
   [junit4]   2> NOTE: reproduce with: ant test  -Dtestcase=TestICUFoldingFilter -Dtests.method=testEmptyTerm -Dtests.seed=E8BEA549989FD0BE -Dtests.multiplier=3 -Dtests.slow=true -Dtests.locale=ja_JP_JP_#u-ca-japanese -Dtests.timezone=America/Thunder_Bay -Dtests.file.encoding=UTF-8
   [junit4] ERROR   0.01s J0 | TestICUFoldingFilter.testEmptyTerm <<<
   [junit4]    > Throwable #1: java.lang.NoClassDefFoundError: Could not initialize class org.apache.lucene.analysis.icu.ICUFoldingFilter
   [junit4]    > 	at __randomizedtesting.SeedInfo.seed([E8BEA549989FD0BE:2A82FD1BCC8EAFAF]:0)
   [junit4]    > 	at org.apache.lucene.analysis.icu.TestICUFoldingFilter$2.createComponents(TestICUFoldingFilter.java:87)
   [junit4]    > 	at org.apache.lucene.analysis.Analyzer.tokenStream(Analyzer.java:177)
   [junit4]    > 	at org.apache.lucene.analysis.BaseTokenStreamTestCase.assertAnalyzesToReuse(BaseTokenStreamTestCase.java:335)
   [junit4]    > 	at org.apache.lucene.analysis.BaseTokenStreamTestCase.assertAnalyzesToReuse(BaseTokenStreamTestCase.java:339)
   [junit4]    > 	at org.apache.lucene.analysis.BaseTokenStreamTestCase.checkOneTermReuse(BaseTokenStreamTestCase.java:365)
   [junit4]    > 	at org.apache.lucene.analysis.icu.TestICUFoldingFilter.testEmptyTerm(TestICUFoldingFilter.java:90)
   [junit4]    > 	at java.lang.Thread.run(Thread.java:724)
   [junit4]   2> NOTE: test params are: codec=Lucene42: {dummy=PostingsFormat(name=SimpleText)}, docValues:{}, sim=RandomSimilarityProvider(queryNorm=true,coord=yes): {}, locale=ja_JP_JP_#u-ca-japanese, timezone=America/Thunder_Bay
   [junit4]   2> NOTE: Linux 3.2.0-49-generic i386/Oracle Corporation 1.7.0_25 (32-bit)/cpus=8,threads=1,free=31711144,total=64880640
   [junit4]   2> NOTE: All tests run in this JVM: [TestCharArrayIterator, TestICUFoldingFilterFactory, TestICUTokenizer, TestICUTransformFilterFactory, TestICUCollationKeyAnalyzer, TestICUNormalizer2Filter, TestWithCJKBigramFilter, TestICUFoldingFilter]
   [junit4] Completed on J0 in 0.17s, 3 tests, 3 errors <<< FAILURES!

[...truncated 19 lines...]
BUILD FAILED
/mnt/ssd/jenkins/workspace/Lucene-Solr-trunk-Linux/build.xml:389: The following error occurred while executing this line:
/mnt/ssd/jenkins/workspace/Lucene-Solr-trunk-Linux/build.xml:369: The following error occurred while executing this line:
/mnt/ssd/jenkins/workspace/Lucene-Solr-trunk-Linux/build.xml:39: The following error occurred while executing this line:
/mnt/ssd/jenkins/workspace/Lucene-Solr-trunk-Linux/lucene/build.xml:556: The following error occurred while executing this line:
/mnt/ssd/jenkins/workspace/Lucene-Solr-trunk-Linux/lucene/common-build.xml:1885: The following error occurred while executing this line:
/mnt/ssd/jenkins/workspace/Lucene-Solr-trunk-Linux/lucene/analysis/build.xml:105: The following error occurred while executing this line:
/mnt/ssd/jenkins/workspace/Lucene-Solr-trunk-Linux/lucene/analysis/build.xml:38: The following error occurred while executing this line:
/mnt/ssd/jenkins/workspace/Lucene-Solr-trunk-Linux/lucene/module-build.xml:61: The following error occurred while executing this line:
/mnt/ssd/jenkins/workspace/Lucene-Solr-trunk-Linux/lucene/common-build.xml:1230: The following error occurred while executing this line:
/mnt/ssd/jenkins/workspace/Lucene-Solr-trunk-Linux/lucene/common-build.xml:873: There were test failures: 13 suites, 87 tests, 4 errors

Total time: 10 minutes 32 seconds
Build step 'Invoke Ant' marked build as failure
Description set: Java: 32bit/jdk1.7.0_25 -server -XX:+UseSerialGC
Archiving artifacts
Recording test results
Email was triggered for: Failure
Sending email for trigger: Failure