You are viewing a plain text version of this content. The canonical link for it is here.
Posted to dev@pdfbox.apache.org by Apache Jenkins Server <je...@builds.apache.org> on 2017/03/27 21:21:19 UTC
Build failed in Jenkins: PDFBox-trunk #3316
See <https://builds.apache.org/job/PDFBox-trunk/3316/display/redirect?page=changes>
Changes:
[lehmi] PDFBOX-3736: switch trunkto java 7, update mvn plugins
[tilman] PDFBOX-2852: simplify and optimize code
------------------------------------------
[...truncated 143.33 KB...]
AU preflight/src/main/java/org/apache/pdfbox/preflight/process/BookmarkValidationProcess.java
AU preflight/src/main/java/org/apache/pdfbox/preflight/process/AbstractProcess.java
AU preflight/src/main/java/org/apache/pdfbox/preflight/process/AcroFormValidationProcess.java
AU preflight/src/main/java/org/apache/pdfbox/preflight/process/CatalogValidationProcess.java
A preflight/src/main/java/org/apache/pdfbox/preflight/process/reflect
AU preflight/src/main/java/org/apache/pdfbox/preflight/process/reflect/ActionsValidationProcess.java
AU preflight/src/main/java/org/apache/pdfbox/preflight/process/reflect/DestinationValidationProcess.java
AU preflight/src/main/java/org/apache/pdfbox/preflight/process/reflect/GraphicObjectPageValidationProcess.java
AU preflight/src/main/java/org/apache/pdfbox/preflight/process/reflect/TilingPatternValidationProcess.java
AU preflight/src/main/java/org/apache/pdfbox/preflight/process/reflect/FontValidationProcess.java
AU preflight/src/main/java/org/apache/pdfbox/preflight/process/reflect/ExtGStateValidationProcess.java
AU preflight/src/main/java/org/apache/pdfbox/preflight/process/reflect/AnnotationValidationProcess.java
AU preflight/src/main/java/org/apache/pdfbox/preflight/process/reflect/ResourcesValidationProcess.java
AU preflight/src/main/java/org/apache/pdfbox/preflight/process/reflect/ShadingPatternValidationProcess.java
AU preflight/src/main/java/org/apache/pdfbox/preflight/process/reflect/SinglePageValidationProcess.java
AU preflight/src/main/java/org/apache/pdfbox/preflight/process/StreamValidationProcess.java
AU preflight/src/main/java/org/apache/pdfbox/preflight/process/PageTreeValidationProcess.java
AU preflight/src/main/java/org/apache/pdfbox/preflight/process/EmptyValidationProcess.java
A preflight/src/main/java/org/apache/pdfbox/preflight/metadata
AU preflight/src/main/java/org/apache/pdfbox/preflight/metadata/PDFAIdentificationValidation.java
AU preflight/src/main/java/org/apache/pdfbox/preflight/metadata/XpacketParsingException.java
AU preflight/src/main/java/org/apache/pdfbox/preflight/metadata/RDFAboutAttributeConcordanceValidation.java
AU preflight/src/main/java/org/apache/pdfbox/preflight/metadata/SynchronizedMetaDataValidation.java
AU preflight/src/main/java/org/apache/pdfbox/preflight/PreflightPath.java
AU preflight/pom.xml
AU RELEASE-NOTES.txt
A debugger
A debugger/src
A debugger/src/main
A debugger/src/main/java
A debugger/src/main/java/org
A debugger/src/main/java/org/apache
A debugger/src/main/java/org/apache/pdfbox
A debugger/src/main/java/org/apache/pdfbox/debugger
A debugger/src/main/java/org/apache/pdfbox/debugger/fontencodingpane
AU debugger/src/main/java/org/apache/pdfbox/debugger/fontencodingpane/FontEncodingPaneController.java
AU debugger/src/main/java/org/apache/pdfbox/debugger/fontencodingpane/FontEncodingView.java
AU debugger/src/main/java/org/apache/pdfbox/debugger/fontencodingpane/Type0Font.java
AU debugger/src/main/java/org/apache/pdfbox/debugger/fontencodingpane/Type3Font.java
AU debugger/src/main/java/org/apache/pdfbox/debugger/fontencodingpane/SimpleFont.java
A debugger/src/main/java/org/apache/pdfbox/debugger/colorpane
AU debugger/src/main/java/org/apache/pdfbox/debugger/colorpane/DeviceNColorant.java
AU debugger/src/main/java/org/apache/pdfbox/debugger/colorpane/IndexedColorant.java
AU debugger/src/main/java/org/apache/pdfbox/debugger/colorpane/CSArrayBased.java
AU debugger/src/main/java/org/apache/pdfbox/debugger/colorpane/CSDeviceN.java
AU debugger/src/main/java/org/apache/pdfbox/debugger/colorpane/CSIndexed.java
AU debugger/src/main/java/org/apache/pdfbox/debugger/colorpane/DeviceNTableModel.java
AU debugger/src/main/java/org/apache/pdfbox/debugger/colorpane/IndexedTableModel.java
AU debugger/src/main/java/org/apache/pdfbox/debugger/colorpane/ColorBarCellRenderer.java
AU debugger/src/main/java/org/apache/pdfbox/debugger/colorpane/CSSeparation.java
A debugger/src/main/java/org/apache/pdfbox/debugger/treestatus
AU debugger/src/main/java/org/apache/pdfbox/debugger/treestatus/TreeStatus.java
AU debugger/src/main/java/org/apache/pdfbox/debugger/treestatus/TreeStatusPane.java
A debugger/src/main/java/org/apache/pdfbox/debugger/hexviewer
AU debugger/src/main/java/org/apache/pdfbox/debugger/hexviewer/ASCIIPane.java
AU debugger/src/main/java/org/apache/pdfbox/debugger/hexviewer/HexView.java
AU debugger/src/main/java/org/apache/pdfbox/debugger/hexviewer/UpperPane.java
AU debugger/src/main/java/org/apache/pdfbox/debugger/hexviewer/HexChangeListener.java
AU debugger/src/main/java/org/apache/pdfbox/debugger/hexviewer/HexChangedEvent.java
AU debugger/src/main/java/org/apache/pdfbox/debugger/hexviewer/HexModelChangeListener.java
AU debugger/src/main/java/org/apache/pdfbox/debugger/hexviewer/HexModelChangedEvent.java
AU debugger/src/main/java/org/apache/pdfbox/debugger/hexviewer/SelectEvent.java
AU debugger/src/main/java/org/apache/pdfbox/debugger/hexviewer/SelectionChangeListener.java
AU debugger/src/main/java/org/apache/pdfbox/debugger/hexviewer/HexModel.java
AU debugger/src/main/java/org/apache/pdfbox/debugger/hexviewer/StatusPane.java
AU debugger/src/main/java/org/apache/pdfbox/debugger/hexviewer/HexPane.java
AU debugger/src/main/java/org/apache/pdfbox/debugger/hexviewer/AddressPane.java
AU debugger/src/main/java/org/apache/pdfbox/debugger/hexviewer/HexEditor.java
A debugger/src/main/java/org/apache/pdfbox/debugger/stringpane
AU debugger/src/main/java/org/apache/pdfbox/debugger/stringpane/StringPane.java
A debugger/src/main/java/org/apache/pdfbox/debugger/ui
AU debugger/src/main/java/org/apache/pdfbox/debugger/ui/PageEntry.java
AU debugger/src/main/java/org/apache/pdfbox/debugger/ui/Tree.java
AU debugger/src/main/java/org/apache/pdfbox/debugger/ui/MapEntry.java
AU debugger/src/main/java/org/apache/pdfbox/debugger/ui/MenuBase.java
AU debugger/src/main/java/org/apache/pdfbox/debugger/ui/ArrayEntry.java
AU debugger/src/main/java/org/apache/pdfbox/debugger/ui/DocumentEntry.java
AU debugger/src/main/java/org/apache/pdfbox/debugger/ui/FileOpenSaveDialog.java
AU debugger/src/main/java/org/apache/pdfbox/debugger/ui/LogDialog.java
AU debugger/src/main/java/org/apache/pdfbox/debugger/ui/RecentFiles.java
AU debugger/src/main/java/org/apache/pdfbox/debugger/ui/ReaderBottomPanel.java
AU debugger/src/main/java/org/apache/pdfbox/debugger/ui/ZoomMenu.java
AU debugger/src/main/java/org/apache/pdfbox/debugger/ui/ErrorDialog.java
AU debugger/src/main/java/org/apache/pdfbox/debugger/ui/OSXAdapter.java
AU debugger/src/main/java/org/apache/pdfbox/debugger/ui/PDFTreeModel.java
AU debugger/src/main/java/org/apache/pdfbox/debugger/ui/HighResolutionImageIcon.java
AU debugger/src/main/java/org/apache/pdfbox/debugger/ui/PDFTreeCellRenderer.java
AU debugger/src/main/java/org/apache/pdfbox/debugger/ui/ImageUtil.java
A debugger/src/main/java/org/apache/pdfbox/debugger/ui/textsearcher
AU debugger/src/main/java/org/apache/pdfbox/debugger/ui/textsearcher/SearchPanel.java
AU debugger/src/main/java/org/apache/pdfbox/debugger/ui/textsearcher/SearchEngine.java
AU debugger/src/main/java/org/apache/pdfbox/debugger/ui/textsearcher/Searcher.java
AU debugger/src/main/java/org/apache/pdfbox/debugger/ui/ExtensionFileFilter.java
AU debugger/src/main/java/org/apache/pdfbox/debugger/ui/RotationMenu.java
AU debugger/src/main/java/org/apache/pdfbox/debugger/ui/DebugLog.java
AU debugger/src/main/java/org/apache/pdfbox/debugger/PDFDebugger.java
A debugger/src/main/java/org/apache/pdfbox/debugger/flagbitspane
AU debugger/src/main/java/org/apache/pdfbox/debugger/flagbitspane/SigFlag.java
AU debugger/src/main/java/org/apache/pdfbox/debugger/flagbitspane/FieldFlag.java
AU debugger/src/main/java/org/apache/pdfbox/debugger/flagbitspane/EncryptFlag.java
AU debugger/src/main/java/org/apache/pdfbox/debugger/flagbitspane/FlagBitsPane.java
AU debugger/src/main/java/org/apache/pdfbox/debugger/flagbitspane/PanoseFlag.java
AU debugger/src/main/java/org/apache/pdfbox/debugger/flagbitspane/FontFlag.java
AU debugger/src/main/java/org/apache/pdfbox/debugger/flagbitspane/AnnotFlag.java
AU debugger/src/main/java/org/apache/pdfbox/debugger/flagbitspane/Flag.java
AU debugger/src/main/java/org/apache/pdfbox/debugger/flagbitspane/FlagBitsPaneView.java
A debugger/src/main/java/org/apache/pdfbox/debugger/streampane
AU debugger/src/main/java/org/apache/pdfbox/debugger/streampane/OperatorMarker.java
AU debugger/src/main/java/org/apache/pdfbox/debugger/streampane/StreamPane.java
AU debugger/src/main/java/org/apache/pdfbox/debugger/streampane/StreamImageView.java
AU debugger/src/main/java/org/apache/pdfbox/debugger/streampane/StreamPaneView.java
A debugger/src/main/java/org/apache/pdfbox/debugger/streampane/tooltip
AU debugger/src/main/java/org/apache/pdfbox/debugger/streampane/tooltip/RGToolTip.java
AU debugger/src/main/java/org/apache/pdfbox/debugger/streampane/tooltip/KToolTip.java
AU debugger/src/main/java/org/apache/pdfbox/debugger/streampane/tooltip/ColorToolTip.java
AU debugger/src/main/java/org/apache/pdfbox/debugger/streampane/tooltip/SCNToolTip.java
AU debugger/src/main/java/org/apache/pdfbox/debugger/streampane/tooltip/ToolTipController.java
AU debugger/src/main/java/org/apache/pdfbox/debugger/streampane/tooltip/FontToolTip.java
AU debugger/src/main/java/org/apache/pdfbox/debugger/streampane/tooltip/GToolTip.java
AU debugger/src/main/java/org/apache/pdfbox/debugger/streampane/Stream.java
AU debugger/src/main/java/org/apache/pdfbox/debugger/streampane/StreamTextView.java
A debugger/src/main/java/org/apache/pdfbox/debugger/pagepane
AU debugger/src/main/java/org/apache/pdfbox/debugger/pagepane/DebugTextOverlay.java
AU debugger/src/main/java/org/apache/pdfbox/debugger/pagepane/PagePane.java
AU debugger/src/main/java/org/apache/pdfbox/debugger/pagepane/DebugPDFRenderer.java
AU debugger/src/main/java/org/apache/pdfbox/debugger/pagepane/DebugPageDrawer.java
A debugger/src/main/resources
A debugger/src/main/resources/org
A debugger/src/main/resources/org/apache
A debugger/src/main/resources/org/apache/pdfbox
A debugger/src/main/resources/org/apache/pdfbox/debugger
AU debugger/src/main/resources/org/apache/pdfbox/debugger/dict.png
AU debugger/src/main/resources/org/apache/pdfbox/debugger/real.png
AU debugger/src/main/resources/org/apache/pdfbox/debugger/hex.png
AU debugger/src/main/resources/org/apache/pdfbox/debugger/string.png
AU debugger/src/main/resources/org/apache/pdfbox/debugger/pdf.png
AU debugger/src/main/resources/org/apache/pdfbox/debugger/null.png
AU debugger/src/main/resources/org/apache/pdfbox/debugger/page.png
AU debugger/src/main/resources/org/apache/pdfbox/debugger/stream-dict.png
AU debugger/src/main/resources/org/apache/pdfbox/debugger/integer.png
AU debugger/src/main/resources/org/apache/pdfbox/debugger/array.png
AU debugger/src/main/resources/org/apache/pdfbox/debugger/boolean.png
AU debugger/src/main/resources/org/apache/pdfbox/debugger/name.png
AU debugger/src/main/resources/org/apache/pdfbox/debugger/indirect.png
AU debugger/pom.xml
U .
At revision 1789012
Parsing POMs
Modules changed, recalculating dependency graph
Established TCP socket on 39148
maven3-agent.jar already up to date
maven3-interceptor.jar already up to date
maven3-interceptor-commons.jar already up to date
[trunk] $ /home/jenkins/tools/java/jdk1.7.0_79-unlimited-security/bin/java -Xmx1g -XX:MaxPermSize=300m -cp /home/jenkins/jenkins-slave/maven3-agent.jar:/home/jenkins/tools/maven/apache-maven-3.3.3/boot/plexus-classworlds-2.5.2.jar org.jvnet.hudson.maven3.agent.Maven3Main /home/jenkins/tools/maven/apache-maven-3.3.3 /home/jenkins/jenkins-slave/slave.jar /home/jenkins/jenkins-slave/maven3-interceptor.jar /home/jenkins/jenkins-slave/maven3-interceptor-commons.jar 39148
<===[JENKINS REMOTING CAPACITY]===> channel started
Executing Maven: -B -f <https://builds.apache.org/job/PDFBox-trunk/ws/trunk/pom.xml> -Dmaven.repo.local=/home/jenkins/jenkins-slave/maven-repositories/0 clean deploy -Ppedantic -Dskip-bavaria=false
java.lang.reflect.InvocationTargetException
at sun.reflect.NativeMethodAccessorImpl.invoke0(Native Method)
at sun.reflect.NativeMethodAccessorImpl.invoke(NativeMethodAccessorImpl.java:57)
at sun.reflect.DelegatingMethodAccessorImpl.invoke(DelegatingMethodAccessorImpl.java:43)
at java.lang.reflect.Method.invoke(Method.java:606)
at org.codehaus.plexus.classworlds.launcher.Launcher.launchStandard(Launcher.java:330)
at org.codehaus.plexus.classworlds.launcher.Launcher.launch(Launcher.java:238)
at org.jvnet.hudson.maven3.agent.Maven3Main.launch(Maven3Main.java:181)
at sun.reflect.NativeMethodAccessorImpl.invoke0(Native Method)
at sun.reflect.NativeMethodAccessorImpl.invoke(NativeMethodAccessorImpl.java:57)
at sun.reflect.DelegatingMethodAccessorImpl.invoke(DelegatingMethodAccessorImpl.java:43)
at java.lang.reflect.Method.invoke(Method.java:606)
at hudson.maven.Maven3Builder.call(Maven3Builder.java:139)
at hudson.maven.Maven3Builder.call(Maven3Builder.java:70)
at hudson.remoting.UserRequest.perform(UserRequest.java:153)
at hudson.remoting.UserRequest.perform(UserRequest.java:50)
at hudson.remoting.Request$2.run(Request.java:336)
at hudson.remoting.InterceptingExecutorService$1.call(InterceptingExecutorService.java:68)
at java.util.concurrent.FutureTask.run(FutureTask.java:262)
at java.util.concurrent.ThreadPoolExecutor.runWorker(ThreadPoolExecutor.java:1145)
at java.util.concurrent.ThreadPoolExecutor$Worker.run(ThreadPoolExecutor.java:615)
at java.lang.Thread.run(Thread.java:745)
Caused by: java.lang.NoClassDefFoundError: org/apache/maven/cli/MavenLoggerManager
at org.jvnet.hudson.maven3.launcher.Maven3Launcher.main(Maven3Launcher.java:87)
... 21 more
Caused by: java.lang.ClassNotFoundException: org.apache.maven.cli.MavenLoggerManager
at org.codehaus.plexus.classworlds.strategy.SelfFirstStrategy.loadClass(SelfFirstStrategy.java:50)
at org.codehaus.plexus.classworlds.realm.ClassRealm.unsynchronizedLoadClass(ClassRealm.java:271)
at org.codehaus.plexus.classworlds.realm.ClassRealm.loadClass(ClassRealm.java:247)
at org.codehaus.plexus.classworlds.realm.ClassRealm.loadClass(ClassRealm.java:239)
... 22 more
ERROR: Failed to parse POMs
java.io.IOException: java.lang.reflect.InvocationTargetException
at hudson.maven.Maven3Builder.call(Maven3Builder.java:179)
at hudson.maven.Maven3Builder.call(Maven3Builder.java:70)
at hudson.remoting.UserRequest.perform(UserRequest.java:153)
at hudson.remoting.UserRequest.perform(UserRequest.java:50)
at hudson.remoting.Request$2.run(Request.java:336)
at hudson.remoting.InterceptingExecutorService$1.call(InterceptingExecutorService.java:68)
at java.util.concurrent.FutureTask.run(FutureTask.java:262)
at java.util.concurrent.ThreadPoolExecutor.runWorker(ThreadPoolExecutor.java:1145)
at java.util.concurrent.ThreadPoolExecutor$Worker.run(ThreadPoolExecutor.java:615)
at java.lang.Thread.run(Thread.java:745)
at ......remote call to Channel to Maven [/home/jenkins/tools/java/jdk1.7.0_79-unlimited-security/bin/java, -Xmx1g, -XX:MaxPermSize=300m, -cp, /home/jenkins/jenkins-slave/maven3-agent.jar:/home/jenkins/tools/maven/apache-maven-3.3.3/boot/plexus-classworlds-2.5.2.jar, org.jvnet.hudson.maven3.agent.Maven3Main, /home/jenkins/tools/maven/apache-maven-3.3.3, /home/jenkins/jenkins-slave/slave.jar, /home/jenkins/jenkins-slave/maven3-interceptor.jar, /home/jenkins/jenkins-slave/maven3-interceptor-commons.jar, 39148](Native Method)
at hudson.remoting.Channel.attachCallSiteStackTrace(Channel.java:1537)
at hudson.remoting.UserResponse.retrieve(UserRequest.java:253)
at hudson.remoting.Channel.call(Channel.java:822)
at hudson.maven.ProcessCache$MavenProcess.call(ProcessCache.java:161)
at hudson.maven.MavenModuleSetBuild$MavenModuleSetBuildExecution.doRun(MavenModuleSetBuild.java:873)
at hudson.model.AbstractBuild$AbstractBuildExecution.run(AbstractBuild.java:534)
at hudson.model.Run.execute(Run.java:1728)
at hudson.maven.MavenModuleSetBuild.run(MavenModuleSetBuild.java:544)
at hudson.model.ResourceController.execute(ResourceController.java:98)
at hudson.model.Executor.run(Executor.java:404)
Caused by: java.lang.reflect.InvocationTargetException
at sun.reflect.NativeMethodAccessorImpl.invoke0(Native Method)
at sun.reflect.NativeMethodAccessorImpl.invoke(NativeMethodAccessorImpl.java:57)
at sun.reflect.DelegatingMethodAccessorImpl.invoke(DelegatingMethodAccessorImpl.java:43)
at java.lang.reflect.Method.invoke(Method.java:606)
at hudson.maven.Maven3Builder.call(Maven3Builder.java:139)
at hudson.maven.Maven3Builder.call(Maven3Builder.java:70)
at hudson.remoting.UserRequest.perform(UserRequest.java:153)
at hudson.remoting.UserRequest.perform(UserRequest.java:50)
at hudson.remoting.Request$2.run(Request.java:336)
at hudson.remoting.InterceptingExecutorService$1.call(InterceptingExecutorService.java:68)
at java.util.concurrent.FutureTask.run(FutureTask.java:262)
at java.util.concurrent.ThreadPoolExecutor.runWorker(ThreadPoolExecutor.java:1145)
at java.util.concurrent.ThreadPoolExecutor$Worker.run(ThreadPoolExecutor.java:615)
at java.lang.Thread.run(Thread.java:745)
Caused by: java.lang.Exception: java.lang.reflect.InvocationTargetException
at org.jvnet.hudson.maven3.agent.Maven3Main.launch(Maven3Main.java:184)
... 14 more
Caused by: java.lang.reflect.InvocationTargetException
at sun.reflect.NativeMethodAccessorImpl.invoke0(Native Method)
at sun.reflect.NativeMethodAccessorImpl.invoke(NativeMethodAccessorImpl.java:57)
at sun.reflect.DelegatingMethodAccessorImpl.invoke(DelegatingMethodAccessorImpl.java:43)
at java.lang.reflect.Method.invoke(Method.java:606)
at org.codehaus.plexus.classworlds.launcher.Launcher.launchStandard(Launcher.java:330)
at org.codehaus.plexus.classworlds.launcher.Launcher.launch(Launcher.java:238)
at org.jvnet.hudson.maven3.agent.Maven3Main.launch(Maven3Main.java:181)
... 14 more
Caused by: java.lang.NoClassDefFoundError: org/apache/maven/cli/MavenLoggerManager
at org.jvnet.hudson.maven3.launcher.Maven3Launcher.main(Maven3Launcher.java:87)
... 21 more
Caused by: java.lang.ClassNotFoundException: org.apache.maven.cli.MavenLoggerManager
at org.codehaus.plexus.classworlds.strategy.SelfFirstStrategy.loadClass(SelfFirstStrategy.java:50)
at org.codehaus.plexus.classworlds.realm.ClassRealm.unsynchronizedLoadClass(ClassRealm.java:271)
at org.codehaus.plexus.classworlds.realm.ClassRealm.loadClass(ClassRealm.java:247)
at org.codehaus.plexus.classworlds.realm.ClassRealm.loadClass(ClassRealm.java:239)
... 22 more
channel stopped
Archiving artifacts
---------------------------------------------------------------------
To unsubscribe, e-mail: dev-unsubscribe@pdfbox.apache.org
For additional commands, e-mail: dev-help@pdfbox.apache.org
Jenkins build is back to normal : PDFBox-trunk #3317
Posted by Apache Jenkins Server <je...@builds.apache.org>.
See <https://builds.apache.org/job/PDFBox-trunk/3317/display/redirect?page=changes>
---------------------------------------------------------------------
To unsubscribe, e-mail: dev-unsubscribe@pdfbox.apache.org
For additional commands, e-mail: dev-help@pdfbox.apache.org