You are viewing a plain text version of this content. The canonical link for it is here.
Posted to builds@cassandra.apache.org by Apache Jenkins Server <je...@builds.apache.org> on 2026/05/22 11:48:08 UTC
Build complete: Cassandra-6.0 #30 [ABORTED] d1b76b6e9ad4c530cef4054739a839629af5334c
-------------------------------------------------------------------------------
Build Cassandra-6.0 #30 Aborted
URL: https://ci-cassandra.apache.org/job/Cassandra-6.0/30/
-------------------------------------------------------------------------------
Changes:
[Patrick McFadin] CASSANDRA-21342: Fix broken Antora xref/anchor targets in cassandra docs
[Patrick McFadin] CASSANDRA-21342: Retarget commands-toc.adoc xrefs to consolidated CQL
[Dmitry Konstantinov] Print class histogram in case of ant failure in check-code.sh
[Maxim Muzafarov] Bump checkstyle version up to 10.26.1
[Dmitry Konstantinov] Increase Xmx to 2Gb for Ant executed by check-code.sh to avoid OOM
-------------------------------------------------------------------------------
Failed Tests:
74 tests failed.
FAILED: dtest-large-latest.snitch_test.TestDynamicEndpointSnitch.Tests / dtest-large-latest jdk11 6/6 / test_multidatacenter_local_quorum
FAILED: dtest-latest.materialized_views_test.TestMaterializedViews.Tests / dtest-latest jdk21 63/64 / test_drop_with_stopped_build
FAILED: dtest-latest.secondary_indexes_test.TestSecondaryIndexes.Tests / dtest-latest jdk21 63/64 / test_6924_dropping_ks
FAILED: dtest-novnode.materialized_views_test.TestMaterializedViews.Tests / dtest-novnode jdk17 52/64 / test_drop_mv
FAILED: dtest-novnode.rebuild_test.TestRebuild.Tests / dtest-novnode jdk21 25/64 / test_resumable_rebuild
FAILED: dtest-novnode.repair_tests.repair_test.TestRepair.Tests / dtest-novnode jdk11 5/64 / test_dead_sync_initiator
FAILED: dtest-novnode.secondary_indexes_test.TestSecondaryIndexes.Tests / dtest-novnode jdk17 14/64 / test_6924_dropping_cf
FAILED: dtest-upgrade-novnode.upgrade_tests.cql_tests.TestCQLNodes2RF1_Upgrade_current_5_0_x_To_indev_6_0_x.Tests / dtest-upgrade-novnode jdk11 139/160 / test_ticket_5230
FAILED: dtest-upgrade-novnode.upgrade_tests.cql_tests.TestCQLNodes2RF1_Upgrade_current_6_0_x_To_indev_6_0_x.Tests / dtest-upgrade-novnode jdk11 125/160 / test_edge_2i_on_complex_pk
FAILED: dtest-upgrade-novnode.upgrade_tests.cql_tests.TestCQLNodes3RF3_Upgrade_current_4_0_x_To_indev_6_0_x.Tests / dtest-upgrade-novnode jdk11 147/160 / test_expanded_map_item_conditional
FAILED: dtest-upgrade-novnode.upgrade_tests.cql_tests.TestCQLNodes3RF3_Upgrade_current_5_0_x_To_indev_6_0_x.Tests / dtest-upgrade-novnode jdk11 133/160 / test_blobAs_functions
FAILED: dtest-upgrade-novnode.upgrade_tests.cql_tests.TestCQLNodes3RF3_Upgrade_current_5_0_x_To_indev_6_0_x.Tests / dtest-upgrade-novnode jdk11 125/160 / test_static_with_limit
FAILED: dtest-upgrade.upgrade_tests.cql_tests.TestCQLNodes2RF1_Upgrade_current_5_0_x_To_indev_6_0_x.Tests / dtest-upgrade jdk11 68/160 / test_invalid_custom_timestamp
FAILED: dtest-upgrade.upgrade_tests.cql_tests.TestCQLNodes3RF3_Upgrade_current_6_0_x_To_indev_6_0_x.Tests / dtest-upgrade jdk11 68/160 / test_negative_timestamp
FAILED: dtest-upgrade.upgrade_tests.cql_tests.TestCQLNodes3RF3_Upgrade_indev_4_0_x_To_indev_6_0_x.Tests / dtest-upgrade jdk11 159/160 / test_select_with_alias
FAILED: dtest-upgrade.upgrade_tests.cql_tests.TestCQLNodes3RF3_Upgrade_indev_4_0_x_To_indev_6_0_x.Tests / dtest-upgrade jdk11 19/160 / test_static_columns_with_2i
FAILED: dtest-upgrade.upgrade_tests.paging_test.TestPagingWithDeletionsNodes2RF1_Upgrade_current_6_0_x_To_indev_6_0_x.Tests / dtest-upgrade jdk11 82/160 / test_ttl_deletions
FAILED: dtest.materialized_views_test.TestMaterializedViews.Tests / dtest jdk11 63/64 / test_drop_with_stopped_build
FAILED: dtest.replace_address_test.TestReplaceAddress.Tests / dtest jdk11 18/64 / test_fail_without_replace
FAILED: dtest.secondary_indexes_test.TestSecondaryIndexes.Tests / dtest jdk11 63/64 / test_6924_dropping_ks
FAILED: org.apache.cassandra.distributed.test.accord.AccordMigrationTest.Tests / jvm-dtest jdk21 4/16 / testPaxosToAccordCAS-_jdk21_x86_64
FAILED: org.apache.cassandra.distributed.test.accord.AccordMigrationTest.Tests / jvm-dtest jdk21 4/16 / testPaxosToAccordSerialRead-_jdk21_x86_64
FAILED: org.apache.cassandra.fuzz.topology.HarryOnAccordTopologyMixupTest.Tests / jvm-dtest jdk21 1/16 / test-_jdk21_x86_64
FAILED: org.apache.cassandra.repair.autorepair.AutoRepairParameterizedTest.Tests / test-cdc jdk11 8/20 / testRepairSuccessAfterRetry[repairType=PREVIEW_REPAIRED]-cassandra.testtag_IS_UNDEFINED
FAILED: org.apache.cassandra.simulator.test.SingleNodeSingleTableASTTest.Tests / simulator-dtest jdk11 2/2 / accordFull-cassandra.testtag_IS_UNDEFINED
FAILED: org.apache.cassandra.simulator.test.TrivialSimulationTest.Tests / simulator-dtest jdk11 1/2 / trivialTest-_jdk11_x86_64
FAILED: org.apache.cassandra.simulator.test.ShortAccordSimulationTest.Tests / simulator-dtest jdk11 2/2 / simulationTest-_jdk11_x86_64
FAILED: org.apache.cassandra.distributed.test.accord.InteropAccordCQLTest.Tests / jvm-dtest jdk17 15/16 / testCASSimulatorLite-_jdk17_x86_64
FAILED: org.apache.cassandra.simulator.test.EpochStressTest.Tests / simulator-dtest jdk11 2/2 / manyEpochsAndAccordConverges-_jdk11_x86_64
FAILED: org.apache.cassandra.simulator.test.AccordHarrySimulationTest.Tests / simulator-dtest jdk11 2/2 / test-_jdk11_x86_64
FAILED: org.apache.cassandra.simulator.test.ShortPaxosSimulationTest.Tests / simulator-dtest jdk11 1/2 / selfReconcileTest-cassandra.testtag_IS_UNDEFINED
FAILED: dtest-upgrade-large-novnode.upgrade_tests.upgrade_through_versions_test.TestUpgrade_current_6_0_x_To_indev_6_0_x.Tests / dtest-upgrade-large-novnode jdk11 8/40 / test_bootstrap_multidc
FAILED: dtest-upgrade-large-novnode.upgrade_tests.upgrade_through_versions_test.TestUpgrade_current_6_0_x_To_indev_6_0_x.Tests / dtest-upgrade-large-novnode jdk11 9/40 / test_parallel_upgrade
FAILED: dtest-upgrade-large-novnode.upgrade_tests.upgrade_through_versions_test.TestUpgrade_current_6_0_x_To_indev_6_0_x.Tests / dtest-upgrade-large-novnode jdk11 11/40 / test_parallel_upgrade_with_internode_ssl
FAILED: dtest-upgrade-large-novnode.upgrade_tests.upgrade_through_versions_test.TestUpgrade_current_6_0_x_To_indev_6_0_x.Tests / dtest-upgrade-large-novnode jdk11 12/40 / test_rolling_upgrade_with_internode_ssl
FAILED: dtest-upgrade-large-novnode.upgrade_tests.upgrade_through_versions_test.TestUpgrade_indev_6_0_x_To_indev_trunk.Tests / dtest-upgrade-large-novnode jdk11 31/40 / test_bootstrap
FAILED: dtest-upgrade-large-novnode.upgrade_tests.upgrade_through_versions_test.TestUpgrade_indev_6_0_x_To_indev_trunk.Tests / dtest-upgrade-large-novnode jdk11 32/40 / test_bootstrap_multidc
FAILED: dtest-upgrade-large-novnode.upgrade_tests.upgrade_through_versions_test.TestUpgrade_indev_6_0_x_To_indev_trunk.Tests / dtest-upgrade-large-novnode jdk11 33/40 / test_parallel_upgrade
FAILED: dtest-upgrade-large-novnode.upgrade_tests.upgrade_through_versions_test.TestUpgrade_indev_6_0_x_To_indev_trunk.Tests / dtest-upgrade-large-novnode jdk11 35/40 / test_parallel_upgrade_with_internode_ssl
FAILED: dtest-upgrade-large-novnode.upgrade_tests.upgrade_through_versions_test.TestUpgrade_indev_6_0_x_To_indev_trunk.Tests / dtest-upgrade-large-novnode jdk11 34/40 / test_rolling_upgrade
FAILED: dtest-upgrade-large-novnode.upgrade_tests.upgrade_through_versions_test.TestUpgrade_indev_6_0_x_To_indev_trunk.Tests / dtest-upgrade-large-novnode jdk11 36/40 / test_rolling_upgrade_with_internode_ssl
FAILED: dtest-upgrade-large.upgrade_tests.upgrade_through_versions_test.TestUpgrade_current_6_0_x_To_indev_6_0_x.Tests / dtest-upgrade-large jdk11 11/40 / test_parallel_upgrade_with_internode_ssl
FAILED: dtest-upgrade-large.upgrade_tests.upgrade_through_versions_test.TestUpgrade_current_6_0_x_To_indev_6_0_x.Tests / dtest-upgrade-large jdk11 12/40 / test_rolling_upgrade_with_internode_ssl
FAILED: dtest-upgrade-large.upgrade_tests.upgrade_through_versions_test.TestUpgrade_indev_6_0_x_To_indev_trunk.Tests / dtest-upgrade-large jdk11 31/40 / test_bootstrap
FAILED: dtest-upgrade-large.upgrade_tests.upgrade_through_versions_test.TestUpgrade_indev_6_0_x_To_indev_trunk.Tests / dtest-upgrade-large jdk11 32/40 / test_bootstrap_multidc
FAILED: dtest-upgrade-large.upgrade_tests.upgrade_through_versions_test.TestUpgrade_indev_6_0_x_To_indev_trunk.Tests / dtest-upgrade-large jdk11 33/40 / test_parallel_upgrade
FAILED: dtest-upgrade-large.upgrade_tests.upgrade_through_versions_test.TestUpgrade_indev_6_0_x_To_indev_trunk.Tests / dtest-upgrade-large jdk11 35/40 / test_parallel_upgrade_with_internode_ssl
FAILED: dtest-upgrade-large.upgrade_tests.upgrade_through_versions_test.TestUpgrade_indev_6_0_x_To_indev_trunk.Tests / dtest-upgrade-large jdk11 34/40 / test_rolling_upgrade
FAILED: dtest-upgrade-large.upgrade_tests.upgrade_through_versions_test.TestUpgrade_indev_6_0_x_To_indev_trunk.Tests / dtest-upgrade-large jdk11 36/40 / test_rolling_upgrade_with_internode_ssl
FAILED: dtest-upgrade-large-novnode.upgrade_tests.upgrade_through_versions_test.TestUpgrade_current_6_0_x_To_indev_6_0_x.Tests / dtest-upgrade-large-novnode jdk11 7/40 / test_bootstrap
FAILED: dtest-upgrade-large-novnode.upgrade_tests.upgrade_through_versions_test.TestUpgrade_current_6_0_x_To_indev_6_0_x.Tests / dtest-upgrade-large-novnode jdk11 10/40 / test_rolling_upgrade
FAILED: dtest-upgrade-large.upgrade_tests.upgrade_through_versions_test.TestUpgrade_current_6_0_x_To_indev_6_0_x.Tests / dtest-upgrade-large jdk11 7/40 / test_bootstrap
FAILED: dtest-upgrade-large.upgrade_tests.upgrade_through_versions_test.TestUpgrade_current_6_0_x_To_indev_6_0_x.Tests / dtest-upgrade-large jdk11 8/40 / test_bootstrap_multidc
FAILED: dtest-upgrade-large.upgrade_tests.upgrade_through_versions_test.TestUpgrade_current_6_0_x_To_indev_6_0_x.Tests / dtest-upgrade-large jdk11 9/40 / test_parallel_upgrade
FAILED: dtest-upgrade-large.upgrade_tests.upgrade_through_versions_test.TestUpgrade_current_6_0_x_To_indev_6_0_x.Tests / dtest-upgrade-large jdk11 10/40 / test_rolling_upgrade
FAILED: dtest-latest.bootstrap_test.TestBootstrap.Tests / dtest-latest jdk17 7/64 / test_consistent_range_movement_false_with_rf1_should_succeed
FAILED: dtest-latest.bootstrap_test.TestBootstrap.Tests / dtest-latest jdk21 7/64 / test_consistent_range_movement_false_with_rf1_should_succeed
FAILED: dtest-latest.bootstrap_test.TestBootstrap.Tests / dtest-latest jdk11 7/64 / test_consistent_range_movement_false_with_rf1_should_succeed
FAILED: dtest-latest.bootstrap_test.TestBootstrap.Tests / dtest-latest jdk17 6/64 / test_consistent_range_movement_true_with_rf1_should_fail
FAILED: dtest-latest.bootstrap_test.TestBootstrap.Tests / dtest-latest jdk11 6/64 / test_consistent_range_movement_true_with_rf1_should_fail
FAILED: dtest-latest.bootstrap_test.TestBootstrap.Tests / dtest-latest jdk21 6/64 / test_consistent_range_movement_true_with_rf1_should_fail
FAILED: dtest-latest.client_request_metrics_test.TestClientRequestMetrics.Tests / dtest-latest jdk21 34/64 / test_client_request_metrics
FAILED: dtest-latest.client_request_metrics_test.TestClientRequestMetrics.Tests / dtest-latest jdk17 34/64 / test_client_request_metrics
FAILED: dtest-latest.client_request_metrics_test.TestClientRequestMetrics.Tests / dtest-latest jdk11 34/64 / test_client_request_metrics
FAILED: dtest-latest.replace_address_test.TestReplaceAddress.Tests / dtest-latest jdk21 23/64 / test_replace_with_insufficient_replicas
FAILED: dtest-latest.replace_address_test.TestReplaceAddress.Tests / dtest-latest jdk21 23/64 / test_replace_with_insufficient_replicas
FAILED: dtest-latest.replace_address_test.TestReplaceAddress.Tests / dtest-latest jdk11 23/64 / test_replace_with_insufficient_replicas
FAILED: dtest-latest.replace_address_test.TestReplaceAddress.Tests / dtest-latest jdk11 23/64 / test_replace_with_insufficient_replicas
FAILED: dtest-latest.replace_address_test.TestReplaceAddress.Tests / dtest-latest jdk17 23/64 / test_replace_with_insufficient_replicas
FAILED: dtest-latest.replace_address_test.TestReplaceAddress.Tests / dtest-latest jdk21 23/64 / test_replace_with_insufficient_replicas
FAILED: dtest-latest.replace_address_test.TestReplaceAddress.Tests / dtest-latest jdk17 23/64 / test_replace_with_insufficient_replicas
FAILED: dtest-latest.replace_address_test.TestReplaceAddress.Tests / dtest-latest jdk11 23/64 / test_replace_with_insufficient_replicas
FAILED: dtest-latest.replace_address_test.TestReplaceAddress.Tests / dtest-latest jdk17 23/64 / test_replace_with_insufficient_replicas
FAILED: org.apache.cassandra.distributed.upgrade.ClusterMetadataUpgradeHarryTest.Tests / jvm-dtest-upgrade jdk11 4/6 / simpleUpgradeTest-cassandra.testtag_IS_UNDEFINED
-------------------------------------------------------------------------------
For complete test report and logs see https://nightlies.apache.org/cassandra/Cassandra-6.0/30/