You are viewing a plain text version of this content. The canonical link for it is here.
Posted to dev@directory.apache.org by Mark Swanson <ma...@ScheduleWorld.com> on 2004/12/01 05:12:56 UTC

compile error (Missing JavaSchema.java, others...)

Hello,

Please help me run maven in a way that prevents Maven from running tests - is 
that possible?

(Or, please check in the missing files? Or are these generated from antlr? - 
no other compile errors happened. I even tried 'maven clean' first..)

Thank you.

test:compile:
    [javac] Compiling 18 source files 
to /mnt/hda3/mswanson/src/eve/jndi-provider/target/test-classes
/mnt/hda3/mswanson/src/eve/jndi-provider/src/test/org/apache/eve/schema/bootstrap/BootstrapSchemaLoaderTest.java:117: 
cannot find symbol
symbol  : class SystemSchema
location: class org.apache.eve.schema.bootstrap.BootstrapSchemaLoaderTest
        SystemSchema systemSchema = new SystemSchema();
        ^
/mnt/hda3/mswanson/src/eve/jndi-provider/src/test/org/apache/eve/schema/bootstrap/BootstrapSchemaLoaderTest.java:117: 
cannot find symbol
symbol  : class SystemSchema
location: class org.apache.eve.schema.bootstrap.BootstrapSchemaLoaderTest
        SystemSchema systemSchema = new SystemSchema();
                                        ^
/mnt/hda3/mswanson/src/eve/jndi-provider/src/test/org/apache/eve/schema/bootstrap/BootstrapSchemaLoaderTest.java:137: 
cannot find symbol
symbol  : class EveSchema
location: class org.apache.eve.schema.bootstrap.BootstrapSchemaLoaderTest
        EveSchema eveSchema = new EveSchema();
        ^
/mnt/hda3/mswanson/src/eve/jndi-provider/src/test/org/apache/eve/schema/bootstrap/BootstrapSchemaLoaderTest.java:137: 
cannot find symbol
symbol  : class EveSchema
location: class org.apache.eve.schema.bootstrap.BootstrapSchemaLoaderTest
        EveSchema eveSchema = new EveSchema();
                                  ^
/mnt/hda3/mswanson/src/eve/jndi-provider/src/test/org/apache/eve/schema/bootstrap/BootstrapSchemaLoaderTest.java:177: 
cannot find symbol
symbol  : class CoreSchema
location: class org.apache.eve.schema.bootstrap.BootstrapSchemaLoaderTest
        CoreSchema coreSchema = new CoreSchema();
        ^
/mnt/hda3/mswanson/src/eve/jndi-provider/src/test/org/apache/eve/schema/bootstrap/BootstrapSchemaLoaderTest.java:177: 
cannot find symbol
symbol  : class CoreSchema
location: class org.apache.eve.schema.bootstrap.BootstrapSchemaLoaderTest
        CoreSchema coreSchema = new CoreSchema();
                                    ^
/mnt/hda3/mswanson/src/eve/jndi-provider/src/test/org/apache/eve/schema/bootstrap/BootstrapSchemaLoaderTest.java:217: 
cannot find symbol
symbol  : class JavaSchema
location: class org.apache.eve.schema.bootstrap.BootstrapSchemaLoaderTest
        JavaSchema javaSchema = new JavaSchema();
        ^
/mnt/hda3/mswanson/src/eve/jndi-provider/src/test/org/apache/eve/schema/bootstrap/BootstrapSchemaLoaderTest.java:217: 
cannot find symbol
symbol  : class JavaSchema
location: class org.apache.eve.schema.bootstrap.BootstrapSchemaLoaderTest
        JavaSchema javaSchema = new JavaSchema();
                                    ^
8 errors

BUILD FAILED
File...... /home/mswanson/.maven/cache/maven-multiproject-plugin-1.3.1/plugin.jelly
Element... maven:reactor
Line...... 217
Column.... 9
Unable to obtain goal [test:compile] 
-- /home/mswanson/.maven/cache/maven-test-plugin-1.6.2/plugin.jelly:52:46: 
<javac> Compile failed; see the compiler error output for details.
Total time: 1 minutes 2 seconds
Finished at: Tue Nov 30 22:46:09 EST 2004


-- 
Free SyncML-capable J2ME & J2SE replacement for Exchange and Outlook
http://www.ScheduleWorld.com/
WAP: http://www.ScheduleWorld.com/sw/WAPToday?id=4000&tz=EST
WebDAV: http://www.ScheduleWorld.com/sw/webDAVDir/4000.ics
VFREEBUSY: http://www.ScheduleWorld.com/sw/freebusy/4000.ifb

Re: compile error (Missing JavaSchema.java, others...)

Posted by Alex Karasulu <ao...@bellsouth.net>.
Mark Swanson wrote:

>On December 1, 2004 12:26 pm, Alex Karasulu wrote:
>  
>
>>Mark,
>>
>>I think maven 1.0 works with 1.4 and 1.5.  I know 1.4 for certain but
>>have not tried it on 1.5. If you were only referring to the VM issues I
>>can help out on that.  Just gimme like 20-30 minutes and I can lend more
>>of a hand.  If you have a chance see if you can log into IRC here
>>irc.freenode.net #directory-dev and we can work on the issue faster. My
>>handle is aok - the only one there at the moment.
>>
>>If we cannot resolve what is happening using debug switches in maven I
>>guess I can replicate your environment. I can setup a VMWare instance
>>with the OS and Java version you are using.
>>    
>>
>
>OK, I'm online. I'm running Linux Redhat 9, Java 5 FCS.
>If you get a moment...
>
>Thank you.
>
>  
>
I'm here online - have not seen ya yet.  Tap me on the sholder if you 
want to start groking the problem live.

Alex

Re: compile error (Missing JavaSchema.java, others...)

Posted by Mark Swanson <ma...@ScheduleWorld.com>.
On December 1, 2004 12:26 pm, Alex Karasulu wrote:
> Mark,
>
> I think maven 1.0 works with 1.4 and 1.5.  I know 1.4 for certain but
> have not tried it on 1.5. If you were only referring to the VM issues I
> can help out on that.  Just gimme like 20-30 minutes and I can lend more
> of a hand.  If you have a chance see if you can log into IRC here
> irc.freenode.net #directory-dev and we can work on the issue faster. My
> handle is aok - the only one there at the moment.
>
> If we cannot resolve what is happening using debug switches in maven I
> guess I can replicate your environment. I can setup a VMWare instance
> with the OS and Java version you are using.

OK, I'm online. I'm running Linux Redhat 9, Java 5 FCS.
If you get a moment...

Thank you.

-- 
Free SyncML-capable J2ME & J2SE replacement for Exchange and Outlook
http://www.ScheduleWorld.com/
WAP: http://www.ScheduleWorld.com/sw/WAPToday?id=4000&tz=EST
WebDAV: http://www.ScheduleWorld.com/sw/webDAVDir/4000.ics
VFREEBUSY: http://www.ScheduleWorld.com/sw/freebusy/4000.ifb

Re: compile error (Missing JavaSchema.java, others...)

Posted by Mark Swanson <ma...@ScheduleWorld.com>.
On December 1, 2004 2:58 pm, Berin Loritsch wrote:
> >>
> >> but the ldap jar still wasn't found.
>
> Hmm.  Don't you have to perform the maven jar:install-snapshot for the
> ldap project in Directory?

Good idea. I tried this but it didn't build. I tried with jdk1.4 and jdk1.5.
(I retrieved the trunk for Directory/ldap)

In both cases I received the compile errors:
(and many more)

java:compile:
    [copy] Copying 1 file to /mnt/hda3/mswanson/src/ldap/common
ANTLR Parser Generator   Version 2.7.2   1989-2003 jGuru.com
panic: Cannot find importVocab file 'DnCommonTokenTypes.txt'



#$%%*&@# internal error: java.lang.SecurityException: exitVM-1
[complain to nearest government official
 or send hate-mail to parrt@jguru.com;
 please send stack trace with report.]

java.lang.SecurityException: exitVM-1
        at 
org.apache.commons.jelly.tags.antlr.NoExitSecurityManager.checkExit(AntlrTag.java:247)
        at java.lang.Runtime.exit(Runtime.java:88)
        at java.lang.System.exit(System.java:715)
        at antlr.Tool.fatalError(Tool.java:462)
        at antlr.Tool.panic(Tool.java:483)
        at 
antlr.ImportVocabTokenManager.<init>(ImportVocabTokenManager.java:39)
        at antlr.DefineGrammarSymbols.endOptions(DefineGrammarSymbols.j


-- 
Free SyncML-capable J2ME & J2SE replacement for Exchange and Outlook
http://www.ScheduleWorld.com/
WAP: http://www.ScheduleWorld.com/sw/WAPToday?id=4000&tz=EST
WebDAV: http://www.ScheduleWorld.com/sw/webDAVDir/4000.ics
VFREEBUSY: http://www.ScheduleWorld.com/sw/freebusy/4000.ifb

Re: compile error (Missing JavaSchema.java, others...)

Posted by Berin Loritsch <bl...@d-haven.org>.
Alex Karasulu wrote:

> Mark,
>
> I think maven 1.0 works with 1.4 and 1.5.  I know 1.4 for certain but 
> have not tried it on 1.5. If you were only referring to the VM issues 
> I can help out on that.  Just gimme like 20-30 minutes and I can lend 
> more of a hand.  If you have a chance see if you can log into IRC here 
> irc.freenode.net #directory-dev and we can work on the issue faster. 
> My handle is aok - the only one there at the moment.

Maven 1.0 works with 1.4 for sure.  The problem is with paths with spaces.

Maven 1.0.1 fixed issues with that.  I discovered and repaired that 
issue (and submitted the fix) when Java 1.5 was first introduced.

If you take the startup script from Maven 1.0.1 and use it for Maven 
1.0--your JAVA_HOME environment variable can be set to anything and it 
will work.

>>> So there are two options here:
>>>
>>> 1). revert back to 1.0
>>> 2). put the maven.remote.repo property into your build.properties
>>>
>>>   
>>
>>
>> Since #1 will not work with jdk1.4 or jdk1.5 I tried #2. #2 did not 
>> work either. I added this line to build.properties (tried 
>> project.properties too)
>>
>> maven.remote.repo=http://cvs.apache.org/repository
>>
>> but the ldap jar still wasn't found.
>

Hmm.  Don't you have to perform the maven jar:install-snapshot for the 
ldap project in Directory?

-- 

"Programming today is a race between software engineers striving to build bigger and better idiot-proof programs, and the Universe trying to produce bigger and better idiots. So far, the Universe is winning."
                - Rich Cook


Re: compile error (Missing JavaSchema.java, others...)

Posted by Alex Karasulu <ao...@bellsouth.net>.
Mark,

I think maven 1.0 works with 1.4 and 1.5.  I know 1.4 for certain but 
have not tried it on 1.5. If you were only referring to the VM issues I 
can help out on that.  Just gimme like 20-30 minutes and I can lend more 
of a hand.  If you have a chance see if you can log into IRC here 
irc.freenode.net #directory-dev and we can work on the issue faster. My 
handle is aok - the only one there at the moment.

If we cannot resolve what is happening using debug switches in maven I 
guess I can replicate your environment. I can setup a VMWare instance 
with the OS and Java version you are using.

Alex


Mark Swanson wrote:

>On December 1, 2004 12:00 pm, Alex Karasulu wrote:
>  
>
>>There is a bug in Maven 1.0.1 where deps are not inherited with POM
>>extention so we went back to using 1.0.  Here take a look at this email:
>>
>>http://nagoya.apache.org/eyebrowse/ReadMsg?listName=directory-dev@incubator
>>.apache.org&msgNo=2470
>>
>>    
>>
>
>>From the message you posted:
>
>  
>
>>fail because the maven.remote.repo property with the 
>>http://cvs.apache.org/repository URL is not inherited and that's where 
>>we keep our non-public dependencies.
>>
>>So there are two options here:
>>
>>1). revert back to 1.0
>>2). put the maven.remote.repo property into your build.properties
>>
>>    
>>
>
>Since #1 will not work with jdk1.4 or jdk1.5 I tried #2. #2 did not work 
>either. I added this line to build.properties (tried project.properties too)
>
>maven.remote.repo=http://cvs.apache.org/repository
>
>but the ldap jar still wasn't found.
>
>Cheers.
>
>
>
>  
>


Re: compile error (Missing JavaSchema.java, others...)

Posted by Mark Swanson <ma...@ScheduleWorld.com>.
On December 1, 2004 12:00 pm, Alex Karasulu wrote:
> There is a bug in Maven 1.0.1 where deps are not inherited with POM
> extention so we went back to using 1.0.  Here take a look at this email:
>
> http://nagoya.apache.org/eyebrowse/ReadMsg?listName=directory-dev@incubator
>.apache.org&msgNo=2470
>

From the message you posted:

>fail because the maven.remote.repo property with the 
>http://cvs.apache.org/repository URL is not inherited and that's where 
>we keep our non-public dependencies.
>
>So there are two options here:
>
>1). revert back to 1.0
>2). put the maven.remote.repo property into your build.properties
>

Since #1 will not work with jdk1.4 or jdk1.5 I tried #2. #2 did not work 
either. I added this line to build.properties (tried project.properties too)

maven.remote.repo=http://cvs.apache.org/repository

but the ldap jar still wasn't found.

Cheers.



-- 
Free SyncML-capable J2ME & J2SE replacement for Exchange and Outlook
http://www.ScheduleWorld.com/
WAP: http://www.ScheduleWorld.com/sw/WAPToday?id=4000&tz=EST
WebDAV: http://www.ScheduleWorld.com/sw/webDAVDir/4000.ics
VFREEBUSY: http://www.ScheduleWorld.com/sw/freebusy/4000.ifb

Re: compile error (Missing JavaSchema.java, others...)

Posted by Alex Karasulu <ao...@bellsouth.net>.
There is a bug in Maven 1.0.1 where deps are not inherited with POM 
extention so we went back to using 1.0.  Here take a look at this email:

http://nagoya.apache.org/eyebrowse/ReadMsg?listName=directory-dev@incubator.apache.org&msgNo=2470

Oh I'll try to get to those java5 errors that did not take after the 
patch.  Sorry for the inconvenience.  This is #2 after the deadlock 
testing I need to do.

Alex


Mark Swanson wrote:

>On December 1, 2004 10:49 am, Alex Karasulu wrote:
>  
>
>>Mark Swanson wrote:
>>    
>>
>>>>I did this; maven clean; build and SystemSchema etc are still missing.
>>>>        
>>>>
>>>I switched to jdk1.4, removed ~/.maven, 'maven clean', 'maven
>>>multiproject:install' and the classes are still missing for me. So the
>>>missing classes problem doesn't seem to have anything to do with java 5.
>>>      
>>>
>>What version of maven are you using?
>>
>>Alex
>>    
>>
>
>[mswanson@lin eve]$ maven -v
> __  __
>|  \/  |__ _Apache__ ___
>| |\/| / _` \ V / -_) ' \  ~ intelligent projects ~
>|_|  |_\__,_|\_/\___|_||_|  v. 1.0
>
>I see there is a new version. I downloaded/installed 1.0.1 and now I get:
>
>Attempting to download ldap-common-SNAPSHOT.jar.
>WARNING: Failed to download ldap-common-SNAPSHOT.jar.
>
>BUILD FAILED
>File...... /home/mswanson/.maven/cache/maven-multiproject-plugin-1.3.1/plugin.jelly
>Element... maven:reactor
>Line...... 217
>Column.... 9
>The build cannot continue because of the following unsatisfied dependency:
>
>ldap-common-SNAPSHOT.jar
>
>Perhaps the maven server is having problems or is down... I'll try later.
>
>Cheers.
>
>--
>Free SyncML-capable J2ME & J2SE replacement for Exchange and Outlook
>http://www.ScheduleWorld.com/
>WAP: http://www.ScheduleWorld.com/sw/WAPToday?id=4000&tz=EST
>WebDAV: http://www.ScheduleWorld.com/sw/webDAVDir/4000.ics
>VFREEBUSY: http://www.ScheduleWorld.com/sw/freebusy/4000.ifb
>
>  
>


Re: compile error (Missing JavaSchema.java, others...)

Posted by Mark Swanson <ma...@ScheduleWorld.com>.
On December 1, 2004 10:49 am, Alex Karasulu wrote:
> Mark Swanson wrote:
> >>I did this; maven clean; build and SystemSchema etc are still missing.
> >
> >I switched to jdk1.4, removed ~/.maven, 'maven clean', 'maven
> >multiproject:install' and the classes are still missing for me. So the
> >missing classes problem doesn't seem to have anything to do with java 5.
>
> What version of maven are you using?
>
> Alex

[mswanson@lin eve]$ maven -v
 __  __
|  \/  |__ _Apache__ ___
| |\/| / _` \ V / -_) ' \  ~ intelligent projects ~
|_|  |_\__,_|\_/\___|_||_|  v. 1.0

I see there is a new version. I downloaded/installed 1.0.1 and now I get:

Attempting to download ldap-common-SNAPSHOT.jar.
WARNING: Failed to download ldap-common-SNAPSHOT.jar.

BUILD FAILED
File...... /home/mswanson/.maven/cache/maven-multiproject-plugin-1.3.1/plugin.jelly
Element... maven:reactor
Line...... 217
Column.... 9
The build cannot continue because of the following unsatisfied dependency:

ldap-common-SNAPSHOT.jar

Perhaps the maven server is having problems or is down... I'll try later.

Cheers.

--
Free SyncML-capable J2ME & J2SE replacement for Exchange and Outlook
http://www.ScheduleWorld.com/
WAP: http://www.ScheduleWorld.com/sw/WAPToday?id=4000&tz=EST
WebDAV: http://www.ScheduleWorld.com/sw/webDAVDir/4000.ics
VFREEBUSY: http://www.ScheduleWorld.com/sw/freebusy/4000.ifb

Re: compile error (Missing JavaSchema.java, others...)

Posted by Alex Karasulu <ao...@bellsouth.net>.
Mark Swanson wrote:

>>I did this; maven clean; build and SystemSchema etc are still missing.
>>    
>>
>
>I switched to jdk1.4, removed ~/.maven, 'maven clean', 'maven 
>multiproject:install' and the classes are still missing for me. So the 
>missing classes problem doesn't seem to have anything to do with java 5.
>
>  
>
What version of maven are you using?

Alex

Re: compile error (Missing JavaSchema.java, others...)

Posted by Mark Swanson <ma...@ScheduleWorld.com>.
>
> I did this; maven clean; build and SystemSchema etc are still missing.

I switched to jdk1.4, removed ~/.maven, 'maven clean', 'maven 
multiproject:install' and the classes are still missing for me. So the 
missing classes problem doesn't seem to have anything to do with java 5.

Cheers.

-- 
Free SyncML-capable J2ME & J2SE replacement for Exchange and Outlook
http://www.ScheduleWorld.com/
WAP: http://www.ScheduleWorld.com/sw/WAPToday?id=4000&tz=EST
WebDAV: http://www.ScheduleWorld.com/sw/webDAVDir/4000.ics
VFREEBUSY: http://www.ScheduleWorld.com/sw/freebusy/4000.ifb

Re: compile error (Missing JavaSchema.java, others...)

Posted by Mark Swanson <ma...@ScheduleWorld.com>.
On December 1, 2004 9:24 am, Berin Loritsch wrote:
>
> Is everything set up to tell the compiler that the sourcecode is 1.4?  I
> think the proper property
> is this:
>
> maven.compile.source=1.4
> maven.compile.target=1.4
>
> Add that to all your project.properties should make everything compile
> properly--even if you have Java 1.5.

I did this; maven clean; build and SystemSchema etc are still missing.

> Question:  what version of Java5 do you have?  Is it a final release or
> one of the betas?
final/FCS.

-- 
Free SyncML-capable J2ME & J2SE replacement for Exchange and Outlook
http://www.ScheduleWorld.com/
WAP: http://www.ScheduleWorld.com/sw/WAPToday?id=4000&tz=EST
WebDAV: http://www.ScheduleWorld.com/sw/webDAVDir/4000.ics
VFREEBUSY: http://www.ScheduleWorld.com/sw/freebusy/4000.ifb

Re: compile error (Missing JavaSchema.java, others...)

Posted by Berin Loritsch <bl...@d-haven.org>.
Mark Swanson wrote:

>On November 30, 2004 11:49 pm, Alex Karasulu wrote:
>  
>
>>No worries these are ok warning.  Do me a favor and svn up your code.  I
>>figure until I apply the patch (which I had a couple problems with)
>>    
>>
>
>Really? did svn create a broken patch?
>
>  
>
>>you're using jdk1.4 for now.  But after the svn up just remove your
>>entire ~/.maven directory.  I think you might have some stale stuff in
>>there.  Trustin just built fine and had this same problem - it cleared
>>up after blowing away ~/.maven.
>>
>>Let me know if this works out.
>>Alex
>>    
>>
>
>I blew away ~/.maven, did a maven clean, and the build still shows all of the 
>same errors with EveSchema,CoreSchema,etc...
>Maybe I should just give up with Java 5 and try with jdk1.4 later.
>
>Cheers.
>

Is everything set up to tell the compiler that the sourcecode is 1.4?  I 
think the proper property
is this:

maven.compile.source=1.4
maven.compile.target=1.4

Add that to all your project.properties should make everything compile 
properly--even if you have Java 1.5.

Question:  what version of Java5 do you have?  Is it a final release or 
one of the betas?

-- 

"Programming today is a race between software engineers striving to build bigger and better idiot-proof programs, and the Universe trying to produce bigger and better idiots. So far, the Universe is winning."
                - Rich Cook


Re: compile error (Missing JavaSchema.java, others...)

Posted by Mark Swanson <ma...@ScheduleWorld.com>.
On November 30, 2004 11:49 pm, Alex Karasulu wrote:
> No worries these are ok warning.  Do me a favor and svn up your code.  I
> figure until I apply the patch (which I had a couple problems with)

Really? did svn create a broken patch?

> you're using jdk1.4 for now.  But after the svn up just remove your
> entire ~/.maven directory.  I think you might have some stale stuff in
> there.  Trustin just built fine and had this same problem - it cleared
> up after blowing away ~/.maven.
>
> Let me know if this works out.
> Alex

I blew away ~/.maven, did a maven clean, and the build still shows all of the 
same errors with EveSchema,CoreSchema,etc...
Maybe I should just give up with Java 5 and try with jdk1.4 later.

Cheers.


-- 
Free SyncML-capable J2ME & J2SE replacement for Exchange and Outlook
http://www.ScheduleWorld.com/
WAP: http://www.ScheduleWorld.com/sw/WAPToday?id=4000&tz=EST
WebDAV: http://www.ScheduleWorld.com/sw/webDAVDir/4000.ics
VFREEBUSY: http://www.ScheduleWorld.com/sw/freebusy/4000.ifb

Re: compile error (Missing JavaSchema.java, others...)

Posted by Alex Karasulu <ao...@bellsouth.net>.
No worries these are ok warning.  Do me a favor and svn up your code.  I 
figure until I apply the patch (which I had a couple problems with) 
you're using jdk1.4 for now.  But after the svn up just remove your 
entire ~/.maven directory.  I think you might have some stale stuff in 
there.  Trustin just built fine and had this same problem - it cleared 
up after blowing away ~/.maven.

Let me know if this works out.
Alex

Mark Swanson wrote:

>On November 30, 2004 11:12 pm, Mark Swanson wrote:
>  
>
>>Hello,
>>
>>Please help me run maven in a way that prevents Maven from running tests -
>>is that possible?
>>
>>(Or, please check in the missing files? Or are these generated from antlr?
>>- no other compile errors happened. I even tried 'maven clean' first..)
>>    
>>
>
>Just a thought: I see warnings:
>    [echo] Compiling 
>to /mnt/hda3/mswanson/src/eve/jndi-provider/target/classes
>warning couldn't find aspectjrt.jar on classpath, checked:
>
>Plugin 'maven-deploy-plugin' in project 'Eve JNDI Provider' is not available
>
>Plugin 'maven-deploy-plugin' in project 'Eve SEDA Protocol Provider' is not 
>available
>
>Plugin 'maven-deploy-plugin' in project 'maven-eve-plugin' is not available
>Plugin 'maven-deploy-plugin' in project 'maven-eve-plugin' is not available
>
>Plugin 'maven-deploy-plugin' in project 'Eve Shared' is not available
>
>So, maybe that gives some indication...
>
>Thanks.
>
>  
>


Re: compile error (Missing JavaSchema.java, others...)

Posted by Mark Swanson <ma...@ScheduleWorld.com>.
On November 30, 2004 11:12 pm, Mark Swanson wrote:
> Hello,
>
> Please help me run maven in a way that prevents Maven from running tests -
> is that possible?
>
> (Or, please check in the missing files? Or are these generated from antlr?
> - no other compile errors happened. I even tried 'maven clean' first..)

Just a thought: I see warnings:
    [echo] Compiling 
to /mnt/hda3/mswanson/src/eve/jndi-provider/target/classes
warning couldn't find aspectjrt.jar on classpath, checked:

Plugin 'maven-deploy-plugin' in project 'Eve JNDI Provider' is not available

Plugin 'maven-deploy-plugin' in project 'Eve SEDA Protocol Provider' is not 
available

Plugin 'maven-deploy-plugin' in project 'maven-eve-plugin' is not available
Plugin 'maven-deploy-plugin' in project 'maven-eve-plugin' is not available

Plugin 'maven-deploy-plugin' in project 'Eve Shared' is not available

So, maybe that gives some indication...

Thanks.

-- 
Free SyncML-capable J2ME & J2SE replacement for Exchange and Outlook
http://www.ScheduleWorld.com/
WAP: http://www.ScheduleWorld.com/sw/WAPToday?id=4000&tz=EST
WebDAV: http://www.ScheduleWorld.com/sw/webDAVDir/4000.ics
VFREEBUSY: http://www.ScheduleWorld.com/sw/freebusy/4000.ifb