You are viewing a plain text version of this content. The canonical link for it is here.
Posted to builds@beam.apache.org by Apache Jenkins Server <je...@builds.apache.org> on 2020/03/06 12:14:31 UTC
Build failed in Jenkins: beam_PostCommit_XVR_Spark #279
See <https://builds.apache.org/job/beam_PostCommit_XVR_Spark/279/display/redirect>
Changes:
------------------------------------------
[...truncated 107.43 KB...]
libyaml-dev is already the newest version (0.1.7-2).
Suggested packages:
distcc
The following NEW packages will be installed:
ccache libsnappy-dev libsnappy1v5
0 upgraded, 3 newly installed, 0 to remove and 0 not upgraded.
Need to get 253 kB of archives.
After this operation, 565 kB of additional disk space will be used.
Get:1 http://deb.debian.org/debian stretch/main amd64 ccache amd64 3.3.4-1 [136 kB]
Get:2 http://deb.debian.org/debian stretch/main amd64 libsnappy1v5 amd64 1.1.3-3 [51.0 kB]
Get:3 http://deb.debian.org/debian stretch/main amd64 libsnappy-dev amd64 1.1.3-3 [65.8 kB]
[91mdebconf: delaying package configuration, since apt-utils is not installed
[0mFetched 253 kB in 0s (3036 kB/s)
Selecting previously unselected package ccache.
(Reading database ...
(Reading database ... 5%(Reading database ... 10%(Reading database ... 15%(Reading database ... 20%(Reading database ... 25%(Reading database ... 30%(Reading database ... 35%(Reading database ... 40%(Reading database ... 45%(Reading database ... 50%(Reading database ... 55%(Reading database ... 60%(Reading database ... 65%
(Reading database ... 70%
(Reading database ... 75%
(Reading database ... 80%
(Reading database ... 85%
(Reading database ... 90%
(Reading database ... 95%
(Reading database ... 100%(Reading database ... 30535 files and directories currently installed.)
Preparing to unpack .../ccache_3.3.4-1_amd64.deb ...
Unpacking ccache (3.3.4-1) ...
Selecting previously unselected package libsnappy1v5:amd64.
Preparing to unpack .../libsnappy1v5_1.1.3-3_amd64.deb ...
Unpacking libsnappy1v5:amd64 (1.1.3-3) ...
Selecting previously unselected package libsnappy-dev:amd64.
Preparing to unpack .../libsnappy-dev_1.1.3-3_amd64.deb ...
Unpacking libsnappy-dev:amd64 (1.1.3-3) ...
Setting up ccache (3.3.4-1) ...
Updating symlinks in /usr/lib/ccache ...
Processing triggers for libc-bin (2.24-11+deb9u4) ...
Setting up libsnappy1v5:amd64 (1.1.3-3) ...
Setting up libsnappy-dev:amd64 (1.1.3-3) ...
Processing triggers for libc-bin (2.24-11+deb9u4) ...
Removing intermediate container 050c1c76bea1
---> 668ed0b2d0d6
Step 5/15 : COPY target/base_image_requirements.txt /tmp/base_image_requirements.txt
---> 67b83557caf2
Step 6/15 : RUN pip install -r /tmp/base_image_requirements.txt && python -c "from google.protobuf.internal import api_implementation; assert api_implementation._default_implementation_type == 'cpp'; print ('Verified fast protobuf used.')" && rm -rf /root/.cache/pip
---> Running in f87f709d64e1
[91mDEPRECATION: Python 2.7 reached the end of its life on January 1st, 2020. Please upgrade your Python as Python 2.7 is no longer maintained. A future version of pip will drop support for Python 2.7. More details about Python 2 support in pip, can be found at https://pip.pypa.io/en/latest/development/release-process/#python-2-support
[0mIgnoring avro-python3: markers 'python_version >= "3.4"' don't match your environment
Collecting avro==1.8.2
Downloading avro-1.8.2.tar.gz (43 kB)
Collecting fastavro==0.21.24
Downloading fastavro-0.21.24-cp27-cp27mu-manylinux1_x86_64.whl (1.0 MB)
Collecting crcmod==1.7
Downloading crcmod-1.7.tar.gz (89 kB)
Collecting dill==0.3.0
Downloading dill-0.3.0.tar.gz (151 kB)
Collecting future==0.17.1
Downloading future-0.17.1.tar.gz (829 kB)
Collecting futures==3.2.0
Downloading futures-3.2.0-py2-none-any.whl (15 kB)
Collecting grpcio==1.22.0
Downloading grpcio-1.22.0-cp27-cp27mu-manylinux1_x86_64.whl (2.2 MB)
Collecting hdfs==2.5.6
Downloading hdfs-2.5.6.tar.gz (41 kB)
Collecting httplib2==0.12.0
Downloading httplib2-0.12.0.tar.gz (218 kB)
Collecting mock==2.0.0
Downloading mock-2.0.0-py2.py3-none-any.whl (56 kB)
Collecting oauth2client==3.0.0
Downloading oauth2client-3.0.0.tar.gz (77 kB)
Collecting protobuf==3.9.0
Downloading protobuf-3.9.0-cp27-cp27mu-manylinux1_x86_64.whl (1.2 MB)
Collecting pyarrow==0.13.0
Downloading pyarrow-0.13.0-cp27-cp27mu-manylinux1_x86_64.whl (14.3 MB)
Collecting pydot==1.4.1
Downloading pydot-1.4.1-py2.py3-none-any.whl (19 kB)
Collecting pytz==2019.1
Downloading pytz-2019.1-py2.py3-none-any.whl (510 kB)
Collecting pyvcf==0.6.8
Downloading PyVCF-0.6.8.tar.gz (34 kB)
Collecting pyyaml==5.1
Downloading PyYAML-5.1.tar.gz (274 kB)
Collecting typing==3.6.6
Downloading typing-3.6.6-py2-none-any.whl (23 kB)
Collecting nose==1.3.7
Downloading nose-1.3.7-py2-none-any.whl (154 kB)
Collecting google-apitools==0.5.28
Downloading google_apitools-0.5.28-py2-none-any.whl (134 kB)
Collecting googledatastore==7.0.2
Downloading googledatastore-7.0.2.tar.gz (13 kB)
Collecting google-cloud-pubsub==0.39.1
Downloading google_cloud_pubsub-0.39.1-py2.py3-none-any.whl (99 kB)
Collecting google-cloud-bigquery==1.24.0
Downloading google_cloud_bigquery-1.24.0-py2.py3-none-any.whl (165 kB)
Collecting proto-google-cloud-datastore-v1==0.90.4
Downloading proto-google-cloud-datastore-v1-0.90.4.tar.gz (20 kB)
Collecting google-cloud-bigtable==0.32.1
Downloading google_cloud_bigtable-0.32.1-py2.py3-none-any.whl (156 kB)
Collecting google-cloud-core==1.0.2
Downloading google_cloud_core-1.0.2-py2.py3-none-any.whl (26 kB)
Collecting google-cloud-datastore==1.7.4
Downloading google_cloud_datastore-1.7.4-py2.py3-none-any.whl (82 kB)
Collecting cython==0.29.10
Downloading Cython-0.29.10-cp27-cp27mu-manylinux1_x86_64.whl (2.0 MB)
Collecting python-snappy==0.5.4
Downloading python-snappy-0.5.4.tar.gz (21 kB)
Collecting numpy==1.16.4
Downloading numpy-1.16.4-cp27-cp27mu-manylinux1_x86_64.whl (17.0 MB)
Collecting scipy==1.2.2
Downloading scipy-1.2.2-cp27-cp27mu-manylinux1_x86_64.whl (24.8 MB)
Collecting pandas==0.24.2
Downloading pandas-0.24.2-cp27-cp27mu-manylinux1_x86_64.whl (10.1 MB)
Collecting protorpc==0.12.0
Downloading protorpc-0.12.0-py2-none-any.whl (134 kB)
Collecting python-gflags==3.0.6
Downloading python-gflags-3.0.6.tar.gz (49 kB)
Collecting tensorflow==2.1.0
Downloading tensorflow-2.1.0-cp27-cp27mu-manylinux2010_x86_64.whl (421.8 MB)
Collecting pymongo==3.8.0
Downloading pymongo-3.8.0-cp27-cp27mu-manylinux1_x86_64.whl (410 kB)
Collecting tenacity>=5.0.2
Downloading tenacity-6.1.0-py2.py3-none-any.whl (24 kB)
Collecting pyhamcrest<2.0,>=1.9
Downloading PyHamcrest-1.10.1.tar.gz (43 kB)
Requirement already satisfied: six>=1.5.2 in /usr/local/lib/python2.7/site-packages (from grpcio==1.22.0->-r /tmp/base_image_requirements.txt (line 33)) (1.14.0)
Collecting enum34>=1.0.4; python_version < "3.4"
Downloading enum34-1.1.9-py2-none-any.whl (11 kB)
Collecting docopt
Downloading docopt-0.6.2.tar.gz (25 kB)
Collecting requests>=2.7.0
Downloading requests-2.23.0-py2.py3-none-any.whl (58 kB)
Collecting pbr>=0.11
Downloading pbr-5.4.4-py2.py3-none-any.whl (110 kB)
Collecting funcsigs>=1; python_version < "3.3"
Downloading funcsigs-1.0.2-py2.py3-none-any.whl (17 kB)
Collecting pyasn1>=0.1.7
Downloading pyasn1-0.4.8-py2.py3-none-any.whl (77 kB)
Collecting pyasn1-modules>=0.0.5
Downloading pyasn1_modules-0.2.8-py2.py3-none-any.whl (155 kB)
Collecting rsa>=3.1.4
Downloading rsa-4.0-py2.py3-none-any.whl (38 kB)
Requirement already satisfied: setuptools in /usr/local/lib/python2.7/site-packages (from protobuf==3.9.0->-r /tmp/base_image_requirements.txt (line 38)) (44.0.0)
Collecting pyparsing>=2.1.4
Downloading pyparsing-2.4.6-py2.py3-none-any.whl (67 kB)
Collecting fasteners>=0.14
Downloading fasteners-0.15-py2.py3-none-any.whl (23 kB)
Collecting grpc-google-iam-v1<0.12dev,>=0.11.4
Downloading grpc-google-iam-v1-0.11.4.tar.gz (12 kB)
Collecting google-api-core[grpc]<2.0.0dev,>=1.6.0
Downloading google_api_core-1.16.0-py2.py3-none-any.whl (70 kB)
Collecting google-auth<2.0dev,>=1.9.0
Downloading google_auth-1.11.2-py2.py3-none-any.whl (76 kB)
Collecting google-resumable-media<0.6dev,>=0.5.0
Downloading google_resumable_media-0.5.0-py2.py3-none-any.whl (38 kB)
Collecting googleapis-common-protos<2.0dev,>=1.5.2
Downloading googleapis-common-protos-1.51.0.tar.gz (35 kB)
Collecting python-dateutil>=2.5.0
Downloading python_dateutil-2.8.1-py2.py3-none-any.whl (227 kB)
Collecting absl-py>=0.7.0
Downloading absl-py-0.9.0.tar.gz (104 kB)
Collecting gast==0.2.2
Downloading gast-0.2.2.tar.gz (10 kB)
Collecting keras-applications>=1.0.8
Downloading Keras_Applications-1.0.8.tar.gz (289 kB)
Collecting astor>=0.6.0
Downloading astor-0.8.1-py2.py3-none-any.whl (27 kB)
Collecting tensorflow-estimator<2.2.0,>=2.1.0rc0
Downloading tensorflow_estimator-2.1.0-py2.py3-none-any.whl (448 kB)
Collecting google-pasta>=0.1.6
Downloading google_pasta-0.1.8-py2-none-any.whl (57 kB)
Requirement already satisfied: wheel; python_version < "3" in /usr/local/lib/python2.7/site-packages (from tensorflow==2.1.0->-r /tmp/base_image_requirements.txt (line 70)) (0.34.2)
Collecting keras-preprocessing>=1.1.0
Downloading Keras_Preprocessing-1.1.0-py2.py3-none-any.whl (41 kB)
Collecting opt-einsum>=2.3.2
Downloading opt_einsum-2.3.2.tar.gz (59 kB)
Collecting backports.weakref>=1.0rc1; python_version < "3.4"
Downloading backports.weakref-1.0.post1-py2.py3-none-any.whl (5.2 kB)
Collecting termcolor>=1.1.0
Downloading termcolor-1.1.0.tar.gz (3.9 kB)
Collecting wrapt>=1.11.1
Downloading wrapt-1.12.0.tar.gz (27 kB)
Collecting tensorboard<2.2.0,>=2.1.0
Downloading tensorboard-2.1.0-py2-none-any.whl (3.8 MB)
Collecting functools32>=3.2.3; python_version < "3"
Downloading functools32-3.2.3-2.tar.gz (31 kB)
Collecting monotonic>=0.6; python_version == "2.7"
Downloading monotonic-1.5-py2.py3-none-any.whl (5.3 kB)
Collecting certifi>=2017.4.17
Downloading certifi-2019.11.28-py2.py3-none-any.whl (156 kB)
Collecting urllib3!=1.25.0,!=1.25.1,<1.26,>=1.21.1
Downloading urllib3-1.25.8-py2.py3-none-any.whl (125 kB)
Collecting idna<3,>=2.5
Downloading idna-2.9-py2.py3-none-any.whl (58 kB)
Collecting chardet<4,>=3.0.2
Downloading chardet-3.0.4-py2.py3-none-any.whl (133 kB)
Collecting cachetools<5.0,>=2.0.0
Downloading cachetools-3.1.1-py2.py3-none-any.whl (11 kB)
Collecting h5py
Downloading h5py-2.10.0-cp27-cp27mu-manylinux1_x86_64.whl (2.8 MB)
Collecting werkzeug>=0.11.15
Downloading Werkzeug-1.0.0-py2.py3-none-any.whl (298 kB)
Collecting google-auth-oauthlib<0.5,>=0.4.1
Downloading google_auth_oauthlib-0.4.1-py2.py3-none-any.whl (18 kB)
Collecting markdown>=2.6.8
Downloading Markdown-3.1.1-py2.py3-none-any.whl (87 kB)
Collecting requests-oauthlib>=0.7.0
Downloading requests_oauthlib-1.3.0-py2.py3-none-any.whl (23 kB)
Collecting oauthlib>=3.0.0
Downloading oauthlib-3.1.0-py2.py3-none-any.whl (147 kB)
[91mERROR: Could not install packages due to an EnvironmentError: [Errno 28] No space left on device
[0mThe command '/bin/sh -c pip install -r /tmp/base_image_requirements.txt && python -c "from google.protobuf.internal import api_implementation; assert api_implementation._default_implementation_type == 'cpp'; print ('Verified fast protobuf used.')" && rm -rf /root/.cache/pip' returned a non-zero code: 1
> Task :sdks:python:container:py2:docker FAILED
> Task :runners:spark:job-server:sparkJobServerCleanup
FAILURE: Build completed with 2 failures.
1: Task failed with an exception.
-----------
* What went wrong:
Execution failed for task ':sdks:python:installGcpTest'.
> Process 'command 'sh'' finished with non-zero exit value 1
* Try:
Run with --stacktrace option to get the stack trace. Run with --info or --debug option to get more log output. Run with --scan to get full insights.
==============================================================================
2: Task failed with an exception.
-----------
* What went wrong:
Execution failed for task ':sdks:python:container:py2:docker'.
> Process 'command 'docker'' finished with non-zero exit value 1
* Try:
Run with --stacktrace option to get the stack trace. Run with --info or --debug option to get more log output. Run with --scan to get full insights.
==============================================================================
* Get more help at https://help.gradle.org
Deprecated Gradle features were used in this build, making it incompatible with Gradle 6.0.
Use '--warning-mode all' to show the individual deprecation warnings.
See https://docs.gradle.org/5.2.1/userguide/command_line_interface.html#sec:command_line_warnings
BUILD FAILED in 6m 42s
98 actionable tasks: 73 executed, 23 from cache, 2 up-to-date
Publishing build scan...
https://gradle.com/s/v364h3trr67ai
Build step 'Invoke Gradle script' changed build result to FAILURE
Build step 'Invoke Gradle script' marked build as failure
---------------------------------------------------------------------
To unsubscribe, e-mail: builds-unsubscribe@beam.apache.org
For additional commands, e-mail: builds-help@beam.apache.org
Jenkins build is back to normal : beam_PostCommit_XVR_Spark #280
Posted by Apache Jenkins Server <je...@builds.apache.org>.
See <https://builds.apache.org/job/beam_PostCommit_XVR_Spark/280/display/redirect?page=changes>
---------------------------------------------------------------------
To unsubscribe, e-mail: builds-unsubscribe@beam.apache.org
For additional commands, e-mail: builds-help@beam.apache.org