You are viewing a plain text version of this content. The canonical link for it is here.
Posted to builds@solr.apache.org by Apache Jenkins Server <je...@builds.apache.org> on 2023/08/23 07:15:06 UTC
[JENKINS] Solr » Solr-Check-9.x - Build # 5240 - Still Failing!
Build: https://ci-builds.apache.org/job/Solr/job/Solr-Check-9.x/5240/
2 tests failed.
FAILED: org.apache.solr.ltr.TestLTRQParserExplain.testRerankedExplainSameBetweenDifferentDocsWithSameFeatures
Error Message:
java.lang.Exception: Test abandoned because suite timeout was reached.
Stack Trace:
java.lang.Exception: Test abandoned because suite timeout was reached.
at __randomizedtesting.SeedInfo.seed([E3BAB2546F781789]:0)
FAILED: org.apache.solr.ltr.TestLTRQParserExplain.classMethod
Error Message:
java.lang.Exception: Suite timeout exceeded (>= 7200000 msec).
Stack Trace:
java.lang.Exception: Suite timeout exceeded (>= 7200000 msec).
at __randomizedtesting.SeedInfo.seed([E3BAB2546F781789]:0)
Build Log:
[...truncated 2103 lines...]
ERROR: The following test(s) have failed:
- org.apache.solr.ltr.TestLTRQParserExplain.testRerankedExplainSameBetweenDifferentDocsWithSameFeatures (:solr:modules:ltr)
Test output: /tmp/src/solr/solr/modules/ltr/build/test-results/test/outputs/OUTPUT-org.apache.solr.ltr.TestLTRQParserExplain.txt
Reproduce with: gradlew :solr:modules:ltr:test --tests "org.apache.solr.ltr.TestLTRQParserExplain.testRerankedExplainSameBetweenDifferentDocsWithSameFeatures" -Ptests.jvms=96 "-Ptests.jvmargs=-XX:TieredStopAtLevel=1 -XX:+UseParallelGC -XX:ActiveProcessorCount=1 -XX:ReservedCodeCacheSize=120m" -Ptests.seed=E3BAB2546F781789 -Ptests.file.encoding=US-ASCII
- org.apache.solr.ltr.TestLTRQParserExplain.classMethod (:solr:modules:ltr)
Test output: /tmp/src/solr/solr/modules/ltr/build/test-results/test/outputs/OUTPUT-org.apache.solr.ltr.TestLTRQParserExplain.txt
Reproduce with: gradlew :solr:modules:ltr:test --tests "org.apache.solr.ltr.TestLTRQParserExplain.classMethod" -Ptests.jvms=96 "-Ptests.jvmargs=-XX:TieredStopAtLevel=1 -XX:+UseParallelGC -XX:ActiveProcessorCount=1 -XX:ReservedCodeCacheSize=120m" -Ptests.seed=E3BAB2546F781789 -Ptests.file.encoding=US-ASCII
FAILURE: Build failed with an exception.
* What went wrong:
Execution failed for task ':solr:modules:ltr:test'.
> There were failing tests. See the results at: file:///tmp/src/solr/solr/modules/ltr/build/test-results/test/
* Try:
> Run with --stacktrace option to get the stack trace.
> Run with --info or --debug option to get more log output.
> Run with --scan to get full insights.
* Get more help at https://help.gradle.org
BUILD FAILED in 2h 1m 57s
670 actionable tasks: 653 executed, 17 up-to-date
[0m[?12l[?25h
------------------------------------------------------------------------
Build Failed: returned 1
Total time: 2h2m27.5s
------------------------------------------------------------------------
+ status=1
+ ./crave pull '**/build/**/test/TEST-*.xml' '**/*.events' 'heapdumps/**' '**/hs_err_pid*'
Error: rsync: [sender] change_dir "/tmp/src/solr/heapdumps" failed: No such file or directory (2)
rsync error: some files/attrs were not transferred (see previous errors) (code 23) at main.c(1684) [Receiver=3.1.3]
rsync: [Receiver] write error: Broken pipe (32)
+ exit 1
Build step 'Execute shell' marked build as failure
Archiving artifacts
Recording test results
[Checks API] No suitable checks publisher found.
Email was triggered for: Failure - Any
Sending email for trigger: Failure - Any
[JENKINS] Solr » Solr-Check-9.x - Build # 5241 - Still Failing!
Posted by Apache Jenkins Server <je...@builds.apache.org>.
Build: https://ci-builds.apache.org/job/Solr/job/Solr-Check-9.x/5241/
1 tests failed.
FAILED: org.apache.solr.cloud.TestLeaderElectionZkExpiry.classMethod
Error Message:
com.carrotsearch.randomizedtesting.ThreadLeakError: 2 threads leaked from SUITE scope at org.apache.solr.cloud.TestLeaderElectionZkExpiry:
1) Thread[id=315, name=zkConnectionManagerCallback-164-thread-1-EventThread, state=BLOCKED, group=TGRP-TestLeaderElectionZkExpiry]
at app//org.apache.solr.common.cloud.ZkStateReader.createClusterStateWatchersAndUpdate(ZkStateReader.java:558)
at app//org.apache.solr.cloud.ZkController.onReconnect(ZkController.java:435)
at app//org.apache.solr.cloud.ZkController.lambda$new$0(ZkController.java:381)
at app//org.apache.solr.cloud.ZkController$$Lambda$522/0x000000084039f840.command(Unknown Source)
at app//org.apache.solr.common.cloud.ConnectionManager$1.update(ConnectionManager.java:199)
at app//org.apache.solr.common.cloud.DefaultConnectionStrategy.reconnect(DefaultConnectionStrategy.java:59)
at app//org.apache.solr.common.cloud.ConnectionManager.process(ConnectionManager.java:179)
at app//org.apache.zookeeper.ClientCnxn$EventThread.processEvent(ClientCnxn.java:563)
at app//org.apache.zookeeper.ClientCnxn$EventThread.run(ClientCnxn.java:538)
2) Thread[id=307, name=zkConnectionManagerCallback-164-thread-1-EventThread, state=BLOCKED, group=TGRP-TestLeaderElectionZkExpiry]
at app//org.apache.solr.common.cloud.ZkStateReader.createClusterStateWatchersAndUpdate(ZkStateReader.java:558)
at app//org.apache.solr.cloud.ZkController.onReconnect(ZkController.java:435)
at app//org.apache.solr.cloud.ZkController.lambda$new$0(ZkController.java:381)
at app//org.apache.solr.cloud.ZkController$$Lambda$522/0x000000084039f840.command(Unknown Source)
at app//org.apache.solr.common.cloud.ConnectionManager$1.update(ConnectionManager.java:199)
at app//org.apache.solr.common.cloud.DefaultConnectionStrategy.reconnect(DefaultConnectionStrategy.java:59)
at app//org.apache.solr.common.cloud.ConnectionManager.process(ConnectionManager.java:179)
at app//org.apache.zookeeper.ClientCnxn$EventThread.processEvent(ClientCnxn.java:563)
at app//org.apache.zookeeper.ClientCnxn$EventThread.run(ClientCnxn.java:538)
Stack Trace:
com.carrotsearch.randomizedtesting.ThreadLeakError: 2 threads leaked from SUITE scope at org.apache.solr.cloud.TestLeaderElectionZkExpiry:
1) Thread[id=315, name=zkConnectionManagerCallback-164-thread-1-EventThread, state=BLOCKED, group=TGRP-TestLeaderElectionZkExpiry]
at app//org.apache.solr.common.cloud.ZkStateReader.createClusterStateWatchersAndUpdate(ZkStateReader.java:558)
at app//org.apache.solr.cloud.ZkController.onReconnect(ZkController.java:435)
at app//org.apache.solr.cloud.ZkController.lambda$new$0(ZkController.java:381)
at app//org.apache.solr.cloud.ZkController$$Lambda$522/0x000000084039f840.command(Unknown Source)
at app//org.apache.solr.common.cloud.ConnectionManager$1.update(ConnectionManager.java:199)
at app//org.apache.solr.common.cloud.DefaultConnectionStrategy.reconnect(DefaultConnectionStrategy.java:59)
at app//org.apache.solr.common.cloud.ConnectionManager.process(ConnectionManager.java:179)
at app//org.apache.zookeeper.ClientCnxn$EventThread.processEvent(ClientCnxn.java:563)
at app//org.apache.zookeeper.ClientCnxn$EventThread.run(ClientCnxn.java:538)
2) Thread[id=307, name=zkConnectionManagerCallback-164-thread-1-EventThread, state=BLOCKED, group=TGRP-TestLeaderElectionZkExpiry]
at app//org.apache.solr.common.cloud.ZkStateReader.createClusterStateWatchersAndUpdate(ZkStateReader.java:558)
at app//org.apache.solr.cloud.ZkController.onReconnect(ZkController.java:435)
at app//org.apache.solr.cloud.ZkController.lambda$new$0(ZkController.java:381)
at app//org.apache.solr.cloud.ZkController$$Lambda$522/0x000000084039f840.command(Unknown Source)
at app//org.apache.solr.common.cloud.ConnectionManager$1.update(ConnectionManager.java:199)
at app//org.apache.solr.common.cloud.DefaultConnectionStrategy.reconnect(DefaultConnectionStrategy.java:59)
at app//org.apache.solr.common.cloud.ConnectionManager.process(ConnectionManager.java:179)
at app//org.apache.zookeeper.ClientCnxn$EventThread.processEvent(ClientCnxn.java:563)
at app//org.apache.zookeeper.ClientCnxn$EventThread.run(ClientCnxn.java:538)
at __randomizedtesting.SeedInfo.seed([853D6FCD4F07A592]:0)
Build Log:
[...truncated 2380 lines...]
ERROR: The following test(s) have failed:
- org.apache.solr.cloud.TestLeaderElectionZkExpiry.classMethod (:solr:core)
Test output: /tmp/src/solr/solr/core/build/test-results/test/outputs/OUTPUT-org.apache.solr.cloud.TestLeaderElectionZkExpiry.txt
Reproduce with: gradlew :solr:core:test --tests "org.apache.solr.cloud.TestLeaderElectionZkExpiry.classMethod" -Ptests.jvms=96 "-Ptests.jvmargs=-XX:TieredStopAtLevel=1 -XX:+UseParallelGC -XX:ActiveProcessorCount=1 -XX:ReservedCodeCacheSize=120m" -Ptests.seed=853D6FCD4F07A592 -Ptests.file.encoding=UTF-8
FAILURE: Build failed with an exception.
* What went wrong:
Execution failed for task ':solr:core:test'.
> There were failing tests. See the results at: file:///tmp/src/solr/solr/core/build/test-results/test/
* Try:
> Run with --stacktrace option to get the stack trace.
> Run with --info or --debug option to get more log output.
> Run with --scan to get full insights.
* Get more help at https://help.gradle.org
BUILD FAILED in 17m 42s
654 actionable tasks: 637 executed, 17 up-to-date
[0m[?12l[?25h
------------------------------------------------------------------------
Build Failed: returned 1
Total time: 18m10s
------------------------------------------------------------------------
+ status=1
+ ./crave pull '**/build/**/test/TEST-*.xml' '**/*.events' 'heapdumps/**' '**/hs_err_pid*'
Error: rsync: [sender] change_dir "/tmp/src/solr/heapdumps" failed: No such file or directory (2)
rsync error: some files/attrs were not transferred (see previous errors) (code 23) at main.c(1675) [Receiver=3.1.2]
rsync: [Receiver] write error: Broken pipe (32)
+ exit 1
Build step 'Execute shell' marked build as failure
Archiving artifacts
Recording test results
[Checks API] No suitable checks publisher found.
Email was triggered for: Failure - Any
Sending email for trigger: Failure - Any