You are viewing a plain text version of this content. The canonical link for it is here.
Posted to builds@solr.apache.org by Apache Jenkins Server <je...@builds.apache.org> on 2024/03/14 16:50:41 UTC
[JENKINS] Solr » Solr-Check-9.x - Build # 356 - Still Unstable!
Build: https://ci-builds.apache.org/job/Solr/job/Solr-Check-9.x/356/
1 tests failed.
FAILED: org.apache.solr.client.solrj.impl.HttpJdkSolrClientTest.classMethod
Error Message:
com.carrotsearch.randomizedtesting.ThreadLeakError: 1 thread leaked from SUITE scope at org.apache.solr.client.solrj.impl.HttpJdkSolrClientTest:
1) Thread[id=1313, name=HttpClient-41-SelectorManager, state=RUNNABLE, group=TGRP-HttpJdkSolrClientTest]
at java.base@11.0.16.1/sun.nio.ch.EPoll.wait(Native Method)
at java.base@11.0.16.1/sun.nio.ch.EPollSelectorImpl.doSelect(EPollSelectorImpl.java:120)
at java.base@11.0.16.1/sun.nio.ch.SelectorImpl.lockAndDoSelect(SelectorImpl.java:124)
at java.base@11.0.16.1/sun.nio.ch.SelectorImpl.select(SelectorImpl.java:136)
at platform/java.net.http@11.0.16.1/jdk.internal.net.http.HttpClientImpl$SelectorManager.run(HttpClientImpl.java:867)
Stack Trace:
com.carrotsearch.randomizedtesting.ThreadLeakError: 1 thread leaked from SUITE scope at org.apache.solr.client.solrj.impl.HttpJdkSolrClientTest:
1) Thread[id=1313, name=HttpClient-41-SelectorManager, state=RUNNABLE, group=TGRP-HttpJdkSolrClientTest]
at java.base@11.0.16.1/sun.nio.ch.EPoll.wait(Native Method)
at java.base@11.0.16.1/sun.nio.ch.EPollSelectorImpl.doSelect(EPollSelectorImpl.java:120)
at java.base@11.0.16.1/sun.nio.ch.SelectorImpl.lockAndDoSelect(SelectorImpl.java:124)
at java.base@11.0.16.1/sun.nio.ch.SelectorImpl.select(SelectorImpl.java:136)
at platform/java.net.http@11.0.16.1/jdk.internal.net.http.HttpClientImpl$SelectorManager.run(HttpClientImpl.java:867)
at __randomizedtesting.SeedInfo.seed([F42F1B0B20A735C2]:0)
Build Log:
[...truncated 1857 lines...]
ERROR: The following test(s) have failed:
- org.apache.solr.client.solrj.impl.HttpJdkSolrClientTest.classMethod (:solr:solrj)
Test output: /home/jenkins/jenkins-slave/workspace/Solr/Solr-Check-9.x/solr/solrj/build/test-results/test/outputs/OUTPUT-org.apache.solr.client.solrj.impl.HttpJdkSolrClientTest.txt
Reproduce with: gradlew :solr:solrj:test --tests "org.apache.solr.client.solrj.impl.HttpJdkSolrClientTest.classMethod" -Ptests.jvms=4 -Ptests.haltonfailure=false "-Ptests.jvmargs=-XX:TieredStopAtLevel=1 -XX:+UseParallelGC -XX:ActiveProcessorCount=1 -XX:ReservedCodeCacheSize=120m" -Ptests.seed=F42F1B0B20A735C2 -Ptests.multiplier=2 -Ptests.badapples=false -Ptests.file.encoding=ISO-8859-1
Deprecated Gradle features were used in this build, making it incompatible with Gradle 9.0.
You can use '--warning-mode all' to show the individual deprecation warnings and determine if they come from your own scripts or plugins.
For more on this, please refer to https://docs.gradle.org/8.4/userguide/command_line_interface.html#sec:command_line_warnings in the Gradle documentation.
BUILD SUCCESSFUL in 1h 4m 44s
693 actionable tasks: 693 executed
Publishing build scan...
https://ge.apache.org/s/tnn3w6a3y6q26
Build step 'Invoke Gradle script' changed build result to SUCCESS
Archiving artifacts
hudson.FilePath$ValidateAntFileMask$1Cancel
at hudson.FilePath$ValidateAntFileMask$1.isCaseSensitive(FilePath.java:3338)
at org.apache.tools.ant.DirectoryScanner.lambda$isIncluded$3(DirectoryScanner.java:1389)
at java.base/java.util.stream.MatchOps$1MatchSink.accept(MatchOps.java:90)
at java.base/java.util.Spliterators$ArraySpliterator.tryAdvance(Spliterators.java:958)
at java.base/java.util.stream.ReferencePipeline.forEachWithCancel(ReferencePipeline.java:127)
at java.base/java.util.stream.AbstractPipeline.copyIntoWithCancel(AbstractPipeline.java:502)
at java.base/java.util.stream.AbstractPipeline.copyInto(AbstractPipeline.java:488)
at java.base/java.util.stream.AbstractPipeline.wrapAndCopyInto(AbstractPipeline.java:474)
at java.base/java.util.stream.MatchOps$MatchOp.evaluateSequential(MatchOps.java:230)
at java.base/java.util.stream.MatchOps$MatchOp.evaluateSequential(MatchOps.java:196)
at java.base/java.util.stream.AbstractPipeline.evaluate(AbstractPipeline.java:234)
at java.base/java.util.stream.ReferencePipeline.anyMatch(ReferencePipeline.java:528)
at org.apache.tools.ant.DirectoryScanner.isIncluded(DirectoryScanner.java:1389)
at org.apache.tools.ant.DirectoryScanner.scandir(DirectoryScanner.java:1256)
at org.apache.tools.ant.DirectoryScanner.scandir(DirectoryScanner.java:1282)
at org.apache.tools.ant.DirectoryScanner.scandir(DirectoryScanner.java:1282)
at org.apache.tools.ant.DirectoryScanner.scandir(DirectoryScanner.java:1282)
at org.apache.tools.ant.DirectoryScanner.scandir(DirectoryScanner.java:1282)
at org.apache.tools.ant.DirectoryScanner.scandir(DirectoryScanner.java:1282)
at org.apache.tools.ant.DirectoryScanner.scandir(DirectoryScanner.java:1198)
at org.apache.tools.ant.DirectoryScanner.scandir(DirectoryScanner.java:1160)
at org.apache.tools.ant.DirectoryScanner.checkIncludePatterns(DirectoryScanner.java:954)
at org.apache.tools.ant.DirectoryScanner.scan(DirectoryScanner.java:912)
at hudson.FilePath$ValidateAntFileMask.hasMatch(FilePath.java:3351)
Caused: hudson.FilePath$FileMaskNoMatchesFoundException: no matches found within 60000
at hudson.FilePath$ValidateAntFileMask.hasMatch(FilePath.java:3356)
at hudson.FilePath$ValidateAntFileMask.invoke(FilePath.java:3234)
at hudson.FilePath$ValidateAntFileMask.invoke(FilePath.java:3212)
at hudson.FilePath$FileCallableWrapper.call(FilePath.java:3616)
Also: hudson.remoting.Channel$CallSiteStackTrace: Remote call to lucene-solr-2
at hudson.remoting.Channel.attachCallSiteStackTrace(Channel.java:1787)
at hudson.remoting.UserRequest$ExceptionResponse.retrieve(UserRequest.java:356)
at hudson.remoting.Channel.call(Channel.java:1003)
at hudson.FilePath.act(FilePath.java:1230)
at hudson.FilePath.act(FilePath.java:1219)
at hudson.FilePath.validateAntFileMask(FilePath.java:3209)
at hudson.tasks.ArtifactArchiver.perform(ArtifactArchiver.java:271)
at hudson.tasks.BuildStepCompatibilityLayer.perform(BuildStepCompatibilityLayer.java:80)
at hudson.tasks.BuildStepMonitor$1.perform(BuildStepMonitor.java:20)
at hudson.model.AbstractBuild$AbstractBuildExecution.perform(AbstractBuild.java:818)
at hudson.model.AbstractBuild$AbstractBuildExecution.performAllBuildSteps(AbstractBuild.java:767)
at hudson.model.Build$BuildExecution.post2(Build.java:179)
at hudson.model.AbstractBuild$AbstractBuildExecution.post(AbstractBuild.java:711)
at hudson.model.Run.execute(Run.java:1864)
at hudson.model.FreeStyleBuild.run(FreeStyleBuild.java:44)
at hudson.model.ResourceController.execute(ResourceController.java:101)
at hudson.model.Executor.run(Executor.java:442)
Caused: hudson.FilePath$TunneledInterruptedException
at hudson.FilePath$FileCallableWrapper.call(FilePath.java:3618)
at hudson.remoting.UserRequest.perform(UserRequest.java:211)
at hudson.remoting.UserRequest.perform(UserRequest.java:54)
at hudson.remoting.Request$2.run(Request.java:377)
at hudson.remoting.InterceptingExecutorService.lambda$wrap$0(InterceptingExecutorService.java:78)
at java.base/java.util.concurrent.FutureTask.run(FutureTask.java:264)
at java.base/java.util.concurrent.ThreadPoolExecutor.runWorker(ThreadPoolExecutor.java:1128)
at java.base/java.util.concurrent.ThreadPoolExecutor$Worker.run(ThreadPoolExecutor.java:628)
at java.base/java.lang.Thread.run(Thread.java:829)
Caused: java.lang.InterruptedException: hudson.FilePath$FileMaskNoMatchesFoundException: no matches found within 60000
at hudson.FilePath.act(FilePath.java:1232)
at hudson.FilePath.act(FilePath.java:1219)
at hudson.FilePath.validateAntFileMask(FilePath.java:3209)
at hudson.tasks.ArtifactArchiver.perform(ArtifactArchiver.java:271)
at hudson.tasks.BuildStepCompatibilityLayer.perform(BuildStepCompatibilityLayer.java:80)
at hudson.tasks.BuildStepMonitor$1.perform(BuildStepMonitor.java:20)
at hudson.model.AbstractBuild$AbstractBuildExecution.perform(AbstractBuild.java:818)
at hudson.model.AbstractBuild$AbstractBuildExecution.performAllBuildSteps(AbstractBuild.java:767)
at hudson.model.Build$BuildExecution.post2(Build.java:179)
at hudson.model.AbstractBuild$AbstractBuildExecution.post(AbstractBuild.java:711)
at hudson.model.Run.execute(Run.java:1864)
at hudson.model.FreeStyleBuild.run(FreeStyleBuild.java:44)
at hudson.model.ResourceController.execute(ResourceController.java:101)
at hudson.model.Executor.run(Executor.java:442)
No artifacts found that match the file pattern "**/*.events,heapdumps/**,**/hs_err_pid*". Configuration error?
Recording test results
[Checks API] No suitable checks publisher found.
Build step 'Publish JUnit test result report' changed build result to UNSTABLE
Email was triggered for: Unstable (Test Failures)
Sending email for trigger: Unstable (Test Failures)
[JENKINS] Solr » Solr-Check-9.x - Build # 358 - Still Unstable!
Posted by Apache Jenkins Server <je...@builds.apache.org>.
Build: https://ci-builds.apache.org/job/Solr/job/Solr-Check-9.x/358/
1 tests failed.
FAILED: org.apache.solr.cloud.DeleteShardTest.test
Error Message:
org.apache.solr.client.solrj.impl.BaseHttpSolrClient$RemoteSolrException: Error from server at https://127.0.0.1:44143/solr: The slice: shard1 is currently active. Only non-active (or custom-hashed) slices can be deleted.
Stack Trace:
org.apache.solr.client.solrj.impl.BaseHttpSolrClient$RemoteSolrException: Error from server at https://127.0.0.1:44143/solr: The slice: shard1 is currently active. Only non-active (or custom-hashed) slices can be deleted.
at __randomizedtesting.SeedInfo.seed([AA9FA432216CC8F0:22CB9BE88F90A508]:0)
at app//org.apache.solr.client.solrj.impl.HttpSolrClient.executeMethod(HttpSolrClient.java:751)
at app//org.apache.solr.client.solrj.impl.HttpSolrClient.request(HttpSolrClient.java:267)
at app//org.apache.solr.client.solrj.impl.HttpSolrClient.request(HttpSolrClient.java:246)
at app//org.apache.solr.client.solrj.impl.LBSolrClient.doRequest(LBSolrClient.java:495)
at app//org.apache.solr.client.solrj.impl.LBSolrClient.request(LBSolrClient.java:458)
at app//org.apache.solr.client.solrj.impl.CloudSolrClient.sendRequest(CloudSolrClient.java:1193)
at app//org.apache.solr.client.solrj.impl.CloudSolrClient.requestWithRetryOnStaleState(CloudSolrClient.java:892)
at app//org.apache.solr.client.solrj.impl.CloudSolrClient.request(CloudSolrClient.java:820)
at app//org.apache.solr.client.solrj.SolrRequest.process(SolrRequest.java:255)
at app//org.apache.solr.client.solrj.SolrRequest.process(SolrRequest.java:270)
at app//org.apache.solr.cloud.DeleteShardTest.test(DeleteShardTest.java:69)
at java.base@11.0.16.1/jdk.internal.reflect.NativeMethodAccessorImpl.invoke0(Native Method)
at java.base@11.0.16.1/jdk.internal.reflect.NativeMethodAccessorImpl.invoke(NativeMethodAccessorImpl.java:62)
at java.base@11.0.16.1/jdk.internal.reflect.DelegatingMethodAccessorImpl.invoke(DelegatingMethodAccessorImpl.java:43)
at java.base@11.0.16.1/java.lang.reflect.Method.invoke(Method.java:566)
at app//com.carrotsearch.randomizedtesting.RandomizedRunner.invoke(RandomizedRunner.java:1758)
at app//com.carrotsearch.randomizedtesting.RandomizedRunner$8.evaluate(RandomizedRunner.java:946)
at app//com.carrotsearch.randomizedtesting.RandomizedRunner$9.evaluate(RandomizedRunner.java:982)
at app//com.carrotsearch.randomizedtesting.RandomizedRunner$10.evaluate(RandomizedRunner.java:996)
at app//com.carrotsearch.randomizedtesting.rules.SystemPropertiesRestoreRule$1.evaluate(SystemPropertiesRestoreRule.java:80)
at app//org.junit.rules.RunRules.evaluate(RunRules.java:20)
at app//org.apache.lucene.tests.util.TestRuleSetupTeardownChained$1.evaluate(TestRuleSetupTeardownChained.java:48)
at app//org.apache.lucene.tests.util.AbstractBeforeAfterRule$1.evaluate(AbstractBeforeAfterRule.java:43)
at app//org.apache.lucene.tests.util.TestRuleThreadAndTestName$1.evaluate(TestRuleThreadAndTestName.java:45)
at app//org.apache.lucene.tests.util.TestRuleIgnoreAfterMaxFailures$1.evaluate(TestRuleIgnoreAfterMaxFailures.java:60)
at app//org.apache.lucene.tests.util.TestRuleMarkFailure$1.evaluate(TestRuleMarkFailure.java:44)
at app//org.junit.rules.RunRules.evaluate(RunRules.java:20)
at app//com.carrotsearch.randomizedtesting.rules.StatementAdapter.evaluate(StatementAdapter.java:36)
at app//com.carrotsearch.randomizedtesting.ThreadLeakControl$StatementRunner.run(ThreadLeakControl.java:390)
at app//com.carrotsearch.randomizedtesting.ThreadLeakControl.forkTimeoutingTask(ThreadLeakControl.java:843)
at app//com.carrotsearch.randomizedtesting.ThreadLeakControl$3.evaluate(ThreadLeakControl.java:490)
at app//com.carrotsearch.randomizedtesting.RandomizedRunner.runSingleTest(RandomizedRunner.java:955)
at app//com.carrotsearch.randomizedtesting.RandomizedRunner$5.evaluate(RandomizedRunner.java:840)
at app//com.carrotsearch.randomizedtesting.RandomizedRunner$6.evaluate(RandomizedRunner.java:891)
at app//com.carrotsearch.randomizedtesting.RandomizedRunner$7.evaluate(RandomizedRunner.java:902)
at app//com.carrotsearch.randomizedtesting.rules.StatementAdapter.evaluate(StatementAdapter.java:36)
at app//com.carrotsearch.randomizedtesting.rules.StatementAdapter.evaluate(StatementAdapter.java:36)
at app//org.apache.lucene.tests.util.AbstractBeforeAfterRule$1.evaluate(AbstractBeforeAfterRule.java:43)
at app//org.apache.lucene.tests.util.AbstractBeforeAfterRule$1.evaluate(AbstractBeforeAfterRule.java:43)
at app//com.carrotsearch.randomizedtesting.rules.SystemPropertiesRestoreRule$1.evaluate(SystemPropertiesRestoreRule.java:80)
at app//org.junit.rules.RunRules.evaluate(RunRules.java:20)
at app//org.apache.lucene.tests.util.AbstractBeforeAfterRule$1.evaluate(AbstractBeforeAfterRule.java:43)
at app//com.carrotsearch.randomizedtesting.rules.StatementAdapter.evaluate(StatementAdapter.java:36)
at app//org.apache.lucene.tests.util.TestRuleStoreClassName$1.evaluate(TestRuleStoreClassName.java:38)
at app//com.carrotsearch.randomizedtesting.rules.NoShadowingOrOverridesOnMethodsRule$1.evaluate(NoShadowingOrOverridesOnMethodsRule.java:40)
at app//com.carrotsearch.randomizedtesting.rules.NoShadowingOrOverridesOnMethodsRule$1.evaluate(NoShadowingOrOverridesOnMethodsRule.java:40)
at app//com.carrotsearch.randomizedtesting.rules.StatementAdapter.evaluate(StatementAdapter.java:36)
at app//com.carrotsearch.randomizedtesting.rules.StatementAdapter.evaluate(StatementAdapter.java:36)
at app//org.apache.lucene.tests.util.TestRuleAssertionsRequired$1.evaluate(TestRuleAssertionsRequired.java:53)
at app//org.apache.lucene.tests.util.AbstractBeforeAfterRule$1.evaluate(AbstractBeforeAfterRule.java:43)
at app//org.apache.lucene.tests.util.TestRuleMarkFailure$1.evaluate(TestRuleMarkFailure.java:44)
at app//org.apache.lucene.tests.util.TestRuleIgnoreAfterMaxFailures$1.evaluate(TestRuleIgnoreAfterMaxFailures.java:60)
at app//org.apache.lucene.tests.util.TestRuleIgnoreTestSuites$1.evaluate(TestRuleIgnoreTestSuites.java:47)
at app//org.junit.rules.RunRules.evaluate(RunRules.java:20)
at app//com.carrotsearch.randomizedtesting.rules.StatementAdapter.evaluate(StatementAdapter.java:36)
at app//com.carrotsearch.randomizedtesting.ThreadLeakControl$StatementRunner.run(ThreadLeakControl.java:390)
at app//com.carrotsearch.randomizedtesting.ThreadLeakControl.lambda$forkTimeoutingTask$0(ThreadLeakControl.java:850)
at java.base@11.0.16.1/java.lang.Thread.run(Thread.java:829)
Build Log:
[...truncated 2253 lines...]
ERROR: The following test(s) have failed:
- org.apache.solr.cloud.DeleteShardTest.test (:solr:core)
Test output: /home/jenkins/jenkins-slave/workspace/Solr/Solr-Check-9.x/solr/core/build/test-results/test/outputs/OUTPUT-org.apache.solr.cloud.DeleteShardTest.txt
Reproduce with: gradlew :solr:core:test --tests "org.apache.solr.cloud.DeleteShardTest.test" -Ptests.jvms=4 -Ptests.haltonfailure=false "-Ptests.jvmargs=-XX:TieredStopAtLevel=1 -XX:+UseParallelGC -XX:ActiveProcessorCount=1 -XX:ReservedCodeCacheSize=120m" -Ptests.seed=AA9FA432216CC8F0 -Ptests.multiplier=2 -Ptests.badapples=false -Ptests.file.encoding=US-ASCII
Deprecated Gradle features were used in this build, making it incompatible with Gradle 9.0.
You can use '--warning-mode all' to show the individual deprecation warnings and determine if they come from your own scripts or plugins.
For more on this, please refer to https://docs.gradle.org/8.4/userguide/command_line_interface.html#sec:command_line_warnings in the Gradle documentation.
BUILD SUCCESSFUL in 1h 9m 27s
693 actionable tasks: 693 executed
Publishing build scan...
https://ge.apache.org/s/67ldrw3bfa3qs
Build step 'Invoke Gradle script' changed build result to SUCCESS
Archiving artifacts
hudson.FilePath$ValidateAntFileMask$1Cancel
at hudson.FilePath$ValidateAntFileMask$1.isCaseSensitive(FilePath.java:3338)
at org.apache.tools.ant.DirectoryScanner.lambda$isIncluded$3(DirectoryScanner.java:1389)
at java.base/java.util.stream.MatchOps$1MatchSink.accept(MatchOps.java:90)
at java.base/java.util.Spliterators$ArraySpliterator.tryAdvance(Spliterators.java:958)
at java.base/java.util.stream.ReferencePipeline.forEachWithCancel(ReferencePipeline.java:127)
at java.base/java.util.stream.AbstractPipeline.copyIntoWithCancel(AbstractPipeline.java:502)
at java.base/java.util.stream.AbstractPipeline.copyInto(AbstractPipeline.java:488)
at java.base/java.util.stream.AbstractPipeline.wrapAndCopyInto(AbstractPipeline.java:474)
at java.base/java.util.stream.MatchOps$MatchOp.evaluateSequential(MatchOps.java:230)
at java.base/java.util.stream.MatchOps$MatchOp.evaluateSequential(MatchOps.java:196)
at java.base/java.util.stream.AbstractPipeline.evaluate(AbstractPipeline.java:234)
at java.base/java.util.stream.ReferencePipeline.anyMatch(ReferencePipeline.java:528)
at org.apache.tools.ant.DirectoryScanner.isIncluded(DirectoryScanner.java:1389)
at org.apache.tools.ant.DirectoryScanner.scandir(DirectoryScanner.java:1256)
at org.apache.tools.ant.DirectoryScanner.scandir(DirectoryScanner.java:1282)
at org.apache.tools.ant.DirectoryScanner.scandir(DirectoryScanner.java:1282)
at org.apache.tools.ant.DirectoryScanner.scandir(DirectoryScanner.java:1282)
at org.apache.tools.ant.DirectoryScanner.scandir(DirectoryScanner.java:1282)
at org.apache.tools.ant.DirectoryScanner.scandir(DirectoryScanner.java:1282)
at org.apache.tools.ant.DirectoryScanner.scandir(DirectoryScanner.java:1282)
at org.apache.tools.ant.DirectoryScanner.scandir(DirectoryScanner.java:1282)
at org.apache.tools.ant.DirectoryScanner.scandir(DirectoryScanner.java:1282)
at org.apache.tools.ant.DirectoryScanner.scandir(DirectoryScanner.java:1282)
at org.apache.tools.ant.DirectoryScanner.scandir(DirectoryScanner.java:1282)
at org.apache.tools.ant.DirectoryScanner.scandir(DirectoryScanner.java:1198)
at org.apache.tools.ant.DirectoryScanner.scandir(DirectoryScanner.java:1160)
at org.apache.tools.ant.DirectoryScanner.checkIncludePatterns(DirectoryScanner.java:954)
at org.apache.tools.ant.DirectoryScanner.scan(DirectoryScanner.java:912)
at hudson.FilePath$ValidateAntFileMask.hasMatch(FilePath.java:3351)
Caused: hudson.FilePath$FileMaskNoMatchesFoundException: no matches found within 60000
at hudson.FilePath$ValidateAntFileMask.hasMatch(FilePath.java:3356)
at hudson.FilePath$ValidateAntFileMask.invoke(FilePath.java:3234)
at hudson.FilePath$ValidateAntFileMask.invoke(FilePath.java:3212)
at hudson.FilePath$FileCallableWrapper.call(FilePath.java:3616)
Also: hudson.remoting.Channel$CallSiteStackTrace: Remote call to lucene-solr-1
at hudson.remoting.Channel.attachCallSiteStackTrace(Channel.java:1787)
at hudson.remoting.UserRequest$ExceptionResponse.retrieve(UserRequest.java:356)
at hudson.remoting.Channel.call(Channel.java:1003)
at hudson.FilePath.act(FilePath.java:1230)
at hudson.FilePath.act(FilePath.java:1219)
at hudson.FilePath.validateAntFileMask(FilePath.java:3209)
at hudson.tasks.ArtifactArchiver.perform(ArtifactArchiver.java:271)
at hudson.tasks.BuildStepCompatibilityLayer.perform(BuildStepCompatibilityLayer.java:80)
at hudson.tasks.BuildStepMonitor$1.perform(BuildStepMonitor.java:20)
at hudson.model.AbstractBuild$AbstractBuildExecution.perform(AbstractBuild.java:818)
at hudson.model.AbstractBuild$AbstractBuildExecution.performAllBuildSteps(AbstractBuild.java:767)
at hudson.model.Build$BuildExecution.post2(Build.java:179)
at hudson.model.AbstractBuild$AbstractBuildExecution.post(AbstractBuild.java:711)
at hudson.model.Run.execute(Run.java:1864)
at hudson.model.FreeStyleBuild.run(FreeStyleBuild.java:44)
at hudson.model.ResourceController.execute(ResourceController.java:101)
at hudson.model.Executor.run(Executor.java:442)
Caused: hudson.FilePath$TunneledInterruptedException
at hudson.FilePath$FileCallableWrapper.call(FilePath.java:3618)
at hudson.remoting.UserRequest.perform(UserRequest.java:211)
at hudson.remoting.UserRequest.perform(UserRequest.java:54)
at hudson.remoting.Request$2.run(Request.java:377)
at hudson.remoting.InterceptingExecutorService.lambda$wrap$0(InterceptingExecutorService.java:78)
at java.base/java.util.concurrent.FutureTask.run(FutureTask.java:264)
at java.base/java.util.concurrent.ThreadPoolExecutor.runWorker(ThreadPoolExecutor.java:1128)
at java.base/java.util.concurrent.ThreadPoolExecutor$Worker.run(ThreadPoolExecutor.java:628)
at java.base/java.lang.Thread.run(Thread.java:829)
Caused: java.lang.InterruptedException: hudson.FilePath$FileMaskNoMatchesFoundException: no matches found within 60000
at hudson.FilePath.act(FilePath.java:1232)
at hudson.FilePath.act(FilePath.java:1219)
at hudson.FilePath.validateAntFileMask(FilePath.java:3209)
at hudson.tasks.ArtifactArchiver.perform(ArtifactArchiver.java:271)
at hudson.tasks.BuildStepCompatibilityLayer.perform(BuildStepCompatibilityLayer.java:80)
at hudson.tasks.BuildStepMonitor$1.perform(BuildStepMonitor.java:20)
at hudson.model.AbstractBuild$AbstractBuildExecution.perform(AbstractBuild.java:818)
at hudson.model.AbstractBuild$AbstractBuildExecution.performAllBuildSteps(AbstractBuild.java:767)
at hudson.model.Build$BuildExecution.post2(Build.java:179)
at hudson.model.AbstractBuild$AbstractBuildExecution.post(AbstractBuild.java:711)
at hudson.model.Run.execute(Run.java:1864)
at hudson.model.FreeStyleBuild.run(FreeStyleBuild.java:44)
at hudson.model.ResourceController.execute(ResourceController.java:101)
at hudson.model.Executor.run(Executor.java:442)
No artifacts found that match the file pattern "**/*.events,heapdumps/**,**/hs_err_pid*". Configuration error?
Recording test results
[Checks API] No suitable checks publisher found.
Build step 'Publish JUnit test result report' changed build result to UNSTABLE
Email was triggered for: Unstable (Test Failures)
Sending email for trigger: Unstable (Test Failures)
[JENKINS] Solr » Solr-Check-9.x - Build # 357 - Still Unstable!
Posted by Apache Jenkins Server <je...@builds.apache.org>.
Build: https://ci-builds.apache.org/job/Solr/job/Solr-Check-9.x/357/
2 tests failed.
FAILED: org.apache.solr.ltr.TestLTRQParserExplain.interleavingModelsWithOriginalRanking_shouldReturnExplainForTheModelPicked
Error Message:
java.lang.Exception: Test abandoned because suite timeout was reached.
Stack Trace:
java.lang.Exception: Test abandoned because suite timeout was reached.
at __randomizedtesting.SeedInfo.seed([739423EE1EDC0FEB]:0)
FAILED: org.apache.solr.ltr.TestLTRQParserExplain.classMethod
Error Message:
java.lang.Exception: Suite timeout exceeded (>= 7200000 msec).
Stack Trace:
java.lang.Exception: Suite timeout exceeded (>= 7200000 msec).
at __randomizedtesting.SeedInfo.seed([739423EE1EDC0FEB]:0)
Build Log:
[...truncated 2151 lines...]
ERROR: The following test(s) have failed:
- org.apache.solr.ltr.TestLTRQParserExplain.interleavingModelsWithOriginalRanking_shouldReturnExplainForTheModelPicked (:solr:modules:ltr)
Test output: /home/jenkins/jenkins-slave/workspace/Solr/Solr-Check-9.x/solr/modules/ltr/build/test-results/test/outputs/OUTPUT-org.apache.solr.ltr.TestLTRQParserExplain.txt
Reproduce with: gradlew :solr:modules:ltr:test --tests "org.apache.solr.ltr.TestLTRQParserExplain.interleavingModelsWithOriginalRanking_shouldReturnExplainForTheModelPicked" -Ptests.jvms=4 -Ptests.haltonfailure=false "-Ptests.jvmargs=-XX:TieredStopAtLevel=1 -XX:+UseParallelGC -XX:ActiveProcessorCount=1 -XX:ReservedCodeCacheSize=120m" -Ptests.seed=739423EE1EDC0FEB -Ptests.multiplier=2 -Ptests.badapples=false -Ptests.file.encoding=UTF-8
- org.apache.solr.ltr.TestLTRQParserExplain.classMethod (:solr:modules:ltr)
Test output: /home/jenkins/jenkins-slave/workspace/Solr/Solr-Check-9.x/solr/modules/ltr/build/test-results/test/outputs/OUTPUT-org.apache.solr.ltr.TestLTRQParserExplain.txt
Reproduce with: gradlew :solr:modules:ltr:test --tests "org.apache.solr.ltr.TestLTRQParserExplain.classMethod" -Ptests.jvms=4 -Ptests.haltonfailure=false "-Ptests.jvmargs=-XX:TieredStopAtLevel=1 -XX:+UseParallelGC -XX:ActiveProcessorCount=1 -XX:ReservedCodeCacheSize=120m" -Ptests.seed=739423EE1EDC0FEB -Ptests.multiplier=2 -Ptests.badapples=false -Ptests.file.encoding=UTF-8
Deprecated Gradle features were used in this build, making it incompatible with Gradle 9.0.
You can use '--warning-mode all' to show the individual deprecation warnings and determine if they come from your own scripts or plugins.
For more on this, please refer to https://docs.gradle.org/8.4/userguide/command_line_interface.html#sec:command_line_warnings in the Gradle documentation.
BUILD SUCCESSFUL in 3h 4m 50s
693 actionable tasks: 693 executed
Publishing build scan...
https://ge.apache.org/s/h7lumiuhtk6jw
Build step 'Invoke Gradle script' changed build result to SUCCESS
Archiving artifacts
hudson.FilePath$ValidateAntFileMask$1Cancel
at hudson.FilePath$ValidateAntFileMask$1.isCaseSensitive(FilePath.java:3338)
at org.apache.tools.ant.DirectoryScanner.lambda$isIncluded$3(DirectoryScanner.java:1389)
at java.base/java.util.stream.MatchOps$1MatchSink.accept(MatchOps.java:90)
at java.base/java.util.Spliterators$ArraySpliterator.tryAdvance(Spliterators.java:958)
at java.base/java.util.stream.ReferencePipeline.forEachWithCancel(ReferencePipeline.java:127)
at java.base/java.util.stream.AbstractPipeline.copyIntoWithCancel(AbstractPipeline.java:502)
at java.base/java.util.stream.AbstractPipeline.copyInto(AbstractPipeline.java:488)
at java.base/java.util.stream.AbstractPipeline.wrapAndCopyInto(AbstractPipeline.java:474)
at java.base/java.util.stream.MatchOps$MatchOp.evaluateSequential(MatchOps.java:230)
at java.base/java.util.stream.MatchOps$MatchOp.evaluateSequential(MatchOps.java:196)
at java.base/java.util.stream.AbstractPipeline.evaluate(AbstractPipeline.java:234)
at java.base/java.util.stream.ReferencePipeline.anyMatch(ReferencePipeline.java:528)
at org.apache.tools.ant.DirectoryScanner.isIncluded(DirectoryScanner.java:1389)
at org.apache.tools.ant.DirectoryScanner.scandir(DirectoryScanner.java:1256)
at org.apache.tools.ant.DirectoryScanner.scandir(DirectoryScanner.java:1282)
at org.apache.tools.ant.DirectoryScanner.scandir(DirectoryScanner.java:1282)
at org.apache.tools.ant.DirectoryScanner.scandir(DirectoryScanner.java:1282)
at org.apache.tools.ant.DirectoryScanner.scandir(DirectoryScanner.java:1282)
at org.apache.tools.ant.DirectoryScanner.scandir(DirectoryScanner.java:1282)
at org.apache.tools.ant.DirectoryScanner.scandir(DirectoryScanner.java:1198)
at org.apache.tools.ant.DirectoryScanner.scandir(DirectoryScanner.java:1160)
at org.apache.tools.ant.DirectoryScanner.checkIncludePatterns(DirectoryScanner.java:954)
at org.apache.tools.ant.DirectoryScanner.scan(DirectoryScanner.java:912)
at hudson.FilePath$ValidateAntFileMask.hasMatch(FilePath.java:3351)
Caused: hudson.FilePath$FileMaskNoMatchesFoundException: no matches found within 60000
at hudson.FilePath$ValidateAntFileMask.hasMatch(FilePath.java:3356)
at hudson.FilePath$ValidateAntFileMask.invoke(FilePath.java:3234)
at hudson.FilePath$ValidateAntFileMask.invoke(FilePath.java:3212)
at hudson.FilePath$FileCallableWrapper.call(FilePath.java:3616)
Also: hudson.remoting.Channel$CallSiteStackTrace: Remote call to lucene-solr-2
at hudson.remoting.Channel.attachCallSiteStackTrace(Channel.java:1787)
at hudson.remoting.UserRequest$ExceptionResponse.retrieve(UserRequest.java:356)
at hudson.remoting.Channel.call(Channel.java:1003)
at hudson.FilePath.act(FilePath.java:1230)
at hudson.FilePath.act(FilePath.java:1219)
at hudson.FilePath.validateAntFileMask(FilePath.java:3209)
at hudson.tasks.ArtifactArchiver.perform(ArtifactArchiver.java:271)
at hudson.tasks.BuildStepCompatibilityLayer.perform(BuildStepCompatibilityLayer.java:80)
at hudson.tasks.BuildStepMonitor$1.perform(BuildStepMonitor.java:20)
at hudson.model.AbstractBuild$AbstractBuildExecution.perform(AbstractBuild.java:818)
at hudson.model.AbstractBuild$AbstractBuildExecution.performAllBuildSteps(AbstractBuild.java:767)
at hudson.model.Build$BuildExecution.post2(Build.java:179)
at hudson.model.AbstractBuild$AbstractBuildExecution.post(AbstractBuild.java:711)
at hudson.model.Run.execute(Run.java:1864)
at hudson.model.FreeStyleBuild.run(FreeStyleBuild.java:44)
at hudson.model.ResourceController.execute(ResourceController.java:101)
at hudson.model.Executor.run(Executor.java:442)
Caused: hudson.FilePath$TunneledInterruptedException
at hudson.FilePath$FileCallableWrapper.call(FilePath.java:3618)
at hudson.remoting.UserRequest.perform(UserRequest.java:211)
at hudson.remoting.UserRequest.perform(UserRequest.java:54)
at hudson.remoting.Request$2.run(Request.java:377)
at hudson.remoting.InterceptingExecutorService.lambda$wrap$0(InterceptingExecutorService.java:78)
at java.base/java.util.concurrent.FutureTask.run(FutureTask.java:264)
at java.base/java.util.concurrent.ThreadPoolExecutor.runWorker(ThreadPoolExecutor.java:1128)
at java.base/java.util.concurrent.ThreadPoolExecutor$Worker.run(ThreadPoolExecutor.java:628)
at java.base/java.lang.Thread.run(Thread.java:829)
Caused: java.lang.InterruptedException: hudson.FilePath$FileMaskNoMatchesFoundException: no matches found within 60000
at hudson.FilePath.act(FilePath.java:1232)
at hudson.FilePath.act(FilePath.java:1219)
at hudson.FilePath.validateAntFileMask(FilePath.java:3209)
at hudson.tasks.ArtifactArchiver.perform(ArtifactArchiver.java:271)
at hudson.tasks.BuildStepCompatibilityLayer.perform(BuildStepCompatibilityLayer.java:80)
at hudson.tasks.BuildStepMonitor$1.perform(BuildStepMonitor.java:20)
at hudson.model.AbstractBuild$AbstractBuildExecution.perform(AbstractBuild.java:818)
at hudson.model.AbstractBuild$AbstractBuildExecution.performAllBuildSteps(AbstractBuild.java:767)
at hudson.model.Build$BuildExecution.post2(Build.java:179)
at hudson.model.AbstractBuild$AbstractBuildExecution.post(AbstractBuild.java:711)
at hudson.model.Run.execute(Run.java:1864)
at hudson.model.FreeStyleBuild.run(FreeStyleBuild.java:44)
at hudson.model.ResourceController.execute(ResourceController.java:101)
at hudson.model.Executor.run(Executor.java:442)
No artifacts found that match the file pattern "**/*.events,heapdumps/**,**/hs_err_pid*". Configuration error?
Recording test results
[Checks API] No suitable checks publisher found.
Build step 'Publish JUnit test result report' changed build result to UNSTABLE
Email was triggered for: Unstable (Test Failures)
Sending email for trigger: Unstable (Test Failures)