You are viewing a plain text version of this content. The canonical link for it is here.
Posted to dev@zookeeper.apache.org by Apache Jenkins Server <je...@builds.apache.org> on 2014/04/12 11:23:58 UTC
ZooKeeper-trunk-solaris - Build # 876 - Failure
See https://builds.apache.org/job/ZooKeeper-trunk-solaris/876/
###################################################################################
########################## LAST 60 LINES OF THE CONSOLE ###########################
[...truncated 223280 lines...]
[junit] 2014-04-12 09:23:02,965 [myid:] - INFO [main:FourLetterWordMain@43] - connecting to 127.0.0.1 11221
[junit] 2014-04-12 09:23:02,965 [myid:] - INFO [main:JMXEnv@142] - ensureOnly:[]
[junit] 2014-04-12 09:23:02,967 [myid:] - INFO [main:ClientBase@443] - STARTING server
[junit] 2014-04-12 09:23:02,967 [myid:] - INFO [main:ClientBase@364] - CREATING server instance 127.0.0.1:11221
[junit] 2014-04-12 09:23:02,967 [myid:] - INFO [main:NIOServerCnxnFactory@670] - Configuring NIO connection handler with 10s sessionless connection timeout, 2 selector thread(s), 16 worker threads, and 64 kB direct buffers.
[junit] 2014-04-12 09:23:02,968 [myid:] - INFO [main:NIOServerCnxnFactory@683] - binding to port 0.0.0.0/0.0.0.0:11221
[junit] 2014-04-12 09:23:02,969 [myid:] - INFO [main:ClientBase@339] - STARTING server instance 127.0.0.1:11221
[junit] 2014-04-12 09:23:02,969 [myid:] - INFO [main:ZooKeeperServer@766] - minSessionTimeout set to 6000
[junit] 2014-04-12 09:23:02,969 [myid:] - INFO [main:ZooKeeperServer@775] - maxSessionTimeout set to 60000
[junit] 2014-04-12 09:23:02,969 [myid:] - INFO [main:ZooKeeperServer@149] - Created server with tickTime 3000 minSessionTimeout 6000 maxSessionTimeout 60000 datadir /zonestorage/hudson_solaris/home/hudson/hudson-slave/workspace/ZooKeeper-trunk-solaris/trunk/build/test/tmp/test5646707726278424042.junit.dir/version-2 snapdir /zonestorage/hudson_solaris/home/hudson/hudson-slave/workspace/ZooKeeper-trunk-solaris/trunk/build/test/tmp/test5646707726278424042.junit.dir/version-2
[junit] 2014-04-12 09:23:02,970 [myid:] - INFO [main:FileSnap@83] - Reading snapshot /zonestorage/hudson_solaris/home/hudson/hudson-slave/workspace/ZooKeeper-trunk-solaris/trunk/build/test/tmp/test5646707726278424042.junit.dir/version-2/snapshot.b
[junit] 2014-04-12 09:23:02,972 [myid:] - INFO [main:FileTxnSnapLog@298] - Snapshotting: 0xb to /zonestorage/hudson_solaris/home/hudson/hudson-slave/workspace/ZooKeeper-trunk-solaris/trunk/build/test/tmp/test5646707726278424042.junit.dir/version-2/snapshot.b
[junit] 2014-04-12 09:23:02,974 [myid:] - INFO [main:FourLetterWordMain@43] - connecting to 127.0.0.1 11221
[junit] 2014-04-12 09:23:02,974 [myid:] - INFO [NIOServerCxnFactory.AcceptThread:0.0.0.0/0.0.0.0:11221:NIOServerCnxnFactory$AcceptThread@296] - Accepted socket connection from /127.0.0.1:62932
[junit] 2014-04-12 09:23:02,975 [myid:] - INFO [NIOWorkerThread-1:NIOServerCnxn@835] - Processing stat command from /127.0.0.1:62932
[junit] 2014-04-12 09:23:02,975 [myid:] - INFO [NIOWorkerThread-1:NIOServerCnxn$StatCommand@684] - Stat command output
[junit] 2014-04-12 09:23:02,976 [myid:] - INFO [NIOWorkerThread-1:NIOServerCnxn@1006] - Closed socket connection for client /127.0.0.1:62932 (no session established for client)
[junit] 2014-04-12 09:23:02,976 [myid:] - INFO [main:JMXEnv@224] - ensureParent:[InMemoryDataTree, StandaloneServer_port]
[junit] 2014-04-12 09:23:02,977 [myid:] - INFO [main:JMXEnv@241] - expect:InMemoryDataTree
[junit] 2014-04-12 09:23:02,977 [myid:] - INFO [main:JMXEnv@245] - found:InMemoryDataTree org.apache.ZooKeeperService:name0=StandaloneServer_port-1,name1=InMemoryDataTree
[junit] 2014-04-12 09:23:02,977 [myid:] - INFO [main:JMXEnv@241] - expect:StandaloneServer_port
[junit] 2014-04-12 09:23:02,978 [myid:] - INFO [main:JMXEnv@245] - found:StandaloneServer_port org.apache.ZooKeeperService:name0=StandaloneServer_port-1
[junit] 2014-04-12 09:23:02,978 [myid:] - INFO [main:JUnit4ZKTestRunner$LoggedInvokeMethod@55] - Memory used 13672
[junit] 2014-04-12 09:23:02,978 [myid:] - INFO [main:JUnit4ZKTestRunner$LoggedInvokeMethod@60] - Number of threads 24
[junit] 2014-04-12 09:23:02,978 [myid:] - INFO [main:JUnit4ZKTestRunner$LoggedInvokeMethod@65] - FINISHED TEST METHOD testQuota
[junit] 2014-04-12 09:23:02,978 [myid:] - INFO [main:ClientBase@520] - tearDown starting
[junit] 2014-04-12 09:23:03,005 [myid:] - INFO [SessionTracker:SessionTrackerImpl@135] - SessionTrackerImpl exited loop!
[junit] 2014-04-12 09:23:03,005 [myid:] - INFO [SessionTracker:SessionTrackerImpl@135] - SessionTrackerImpl exited loop!
[junit] 2014-04-12 09:23:03,046 [myid:] - INFO [main-EventThread:ClientCnxn$EventThread@529] - EventThread shut down
[junit] 2014-04-12 09:23:03,046 [myid:] - INFO [main:ZooKeeper@959] - Session: 0x145553f4b6f0000 closed
[junit] 2014-04-12 09:23:03,046 [myid:] - INFO [main:ClientBase@490] - STOPPING server
[junit] 2014-04-12 09:23:03,046 [myid:] - INFO [NIOServerCxnFactory.SelectorThread-1:NIOServerCnxnFactory$SelectorThread@420] - selector thread exitted run method
[junit] 2014-04-12 09:23:03,046 [myid:] - INFO [NIOServerCxnFactory.AcceptThread:0.0.0.0/0.0.0.0:11221:NIOServerCnxnFactory$AcceptThread@219] - accept thread exitted run method
[junit] 2014-04-12 09:23:03,047 [myid:] - INFO [NIOServerCxnFactory.SelectorThread-0:NIOServerCnxnFactory$SelectorThread@420] - selector thread exitted run method
[junit] 2014-04-12 09:23:03,047 [myid:] - INFO [main:ZooKeeperServer@428] - shutting down
[junit] 2014-04-12 09:23:03,047 [myid:] - INFO [main:SessionTrackerImpl@184] - Shutting down
[junit] 2014-04-12 09:23:03,047 [myid:] - INFO [main:PrepRequestProcessor@980] - Shutting down
[junit] 2014-04-12 09:23:03,048 [myid:] - INFO [main:SyncRequestProcessor@191] - Shutting down
[junit] 2014-04-12 09:23:03,048 [myid:] - INFO [ProcessThread(sid:0 cport:-1)::PrepRequestProcessor@155] - PrepRequestProcessor exited loop!
[junit] 2014-04-12 09:23:03,048 [myid:] - INFO [SyncThread:0:SyncRequestProcessor@169] - SyncRequestProcessor exited!
[junit] 2014-04-12 09:23:03,048 [myid:] - INFO [main:FinalRequestProcessor@454] - shutdown of request processor complete
[junit] 2014-04-12 09:23:03,049 [myid:] - INFO [main:FourLetterWordMain@43] - connecting to 127.0.0.1 11221
[junit] 2014-04-12 09:23:03,049 [myid:] - INFO [main:JMXEnv@142] - ensureOnly:[]
[junit] 2014-04-12 09:23:03,052 [myid:] - INFO [main:ClientBase@545] - fdcount after test is: 45 at start it was 31
[junit] 2014-04-12 09:23:03,053 [myid:] - INFO [main:ClientBase@547] - sleeping for 20 secs
[junit] 2014-04-12 09:23:03,054 [myid:] - INFO [main:ZKTestCase$1@61] - SUCCEEDED testQuota
[junit] 2014-04-12 09:23:03,054 [myid:] - INFO [main:ZKTestCase$1@56] - FINISHED testQuota
[junit] Tests run: 1, Failures: 0, Errors: 0, Time elapsed: 0.842 sec
BUILD FAILED
/zonestorage/hudson_solaris/home/hudson/hudson-slave/workspace/ZooKeeper-trunk-solaris/trunk/build.xml:1337: Tests failed!
Total time: 47 minutes 22 seconds
Build step 'Invoke Ant' marked build as failure
[locks-and-latches] Releasing all the locks
[locks-and-latches] All the locks released
Recording test results
Email was triggered for: Failure
Sending email for trigger: Failure
###################################################################################
############################## FAILED TESTS (if any) ##############################
2 tests failed.
REGRESSION: org.apache.zookeeper.server.quorum.StandaloneDisabledTest.startSingleServerTest
Error Message:
Server 0 is not up
Stack Trace:
junit.framework.AssertionFailedError: Server 0 is not up
at org.apache.zookeeper.server.quorum.StandaloneDisabledTest.startServer(StandaloneDisabledTest.java:159)
at org.apache.zookeeper.server.quorum.StandaloneDisabledTest.startSingleServerTest(StandaloneDisabledTest.java:62)
at org.apache.zookeeper.JUnit4ZKTestRunner$LoggedInvokeMethod.evaluate(JUnit4ZKTestRunner.java:52)
REGRESSION: org.apache.zookeeper.test.LETest.testLE
Error Message:
Threads didn't join
Stack Trace:
junit.framework.AssertionFailedError: Threads didn't join
at org.apache.zookeeper.test.LETest.testLE(LETest.java:123)
at org.apache.zookeeper.JUnit4ZKTestRunner$LoggedInvokeMethod.evaluate(JUnit4ZKTestRunner.java:52)
ZooKeeper-trunk-solaris - Build # 877 - Still Failing
Posted by Apache Jenkins Server <je...@builds.apache.org>.
See https://builds.apache.org/job/ZooKeeper-trunk-solaris/877/
###################################################################################
########################## LAST 60 LINES OF THE CONSOLE ###########################
[...truncated 151 lines...]
[ivy:retrieve] found junit#junit;4.9 in maven2
[ivy:retrieve] found org.hamcrest#hamcrest-core;1.1 in maven2
[ivy:retrieve] found org.mockito#mockito-all;1.8.2 in maven2
[ivy:retrieve] found checkstyle#checkstyle;5.0 in maven2
[ivy:retrieve] found antlr#antlr;2.7.6 in maven2
[ivy:retrieve] found commons-beanutils#commons-beanutils-core;1.7.0 in maven2
[ivy:retrieve] found commons-collections#commons-collections;2.0 in maven2
[ivy:retrieve] found commons-cli#commons-cli;1.0 in maven2
[ivy:retrieve] found commons-lang#commons-lang;1.0 in maven2
[ivy:retrieve] found commons-logging#commons-logging;1.0.3 in maven2
[ivy:retrieve] found com.google.collections#google-collections;0.9 in maven2
[ivy:retrieve] :: resolution report :: resolve 2778ms :: artifacts dl 587ms
[ivy:retrieve] :: evicted modules:
[ivy:retrieve] commons-logging#commons-logging;1.0 by [commons-logging#commons-logging;1.0.3] in [test]
[ivy:retrieve] junit#junit;3.7 by [junit#junit;4.9] in [test]
---------------------------------------------------------------------
| | modules || artifacts |
| conf | number| search|dwnlded|evicted|| number|dwnlded|
---------------------------------------------------------------------
| test | 13 | 0 | 0 | 2 || 11 | 0 |
---------------------------------------------------------------------
[ivy:retrieve] :: retrieving :: org.apache.zookeeper#zookeeper
[ivy:retrieve] confs: [test]
[ivy:retrieve] 11 artifacts copied, 0 already retrieved (3601kB/1244ms)
compile-test:
[mkdir] Created dir: /zonestorage/hudson_solaris/home/hudson/hudson-slave/workspace/ZooKeeper-trunk-solaris/trunk/build/test/classes
[javac] Compiling 153 source files to /zonestorage/hudson_solaris/home/hudson/hudson-slave/workspace/ZooKeeper-trunk-solaris/trunk/build/test/classes
[javac] Note: Some input files use or override a deprecated API.
[javac] Note: Recompile with -Xlint:deprecation for details.
[javac] Note: Some input files use unchecked or unsafe operations.
[javac] Note: Recompile with -Xlint:unchecked for details.
[javac] Compiling 11 source files to /zonestorage/hudson_solaris/home/hudson/hudson-slave/workspace/ZooKeeper-trunk-solaris/trunk/build/test/classes
test-init:
[mkdir] Created dir: /zonestorage/hudson_solaris/home/hudson/hudson-slave/workspace/ZooKeeper-trunk-solaris/trunk/build/test/logs
[mkdir] Created dir: /zonestorage/hudson_solaris/home/hudson/hudson-slave/workspace/ZooKeeper-trunk-solaris/trunk/build/test/tmp
[mkdir] Created dir: /zonestorage/hudson_solaris/home/hudson/hudson-slave/workspace/ZooKeeper-trunk-solaris/trunk/build/test/data
[mkdir] Created dir: /zonestorage/hudson_solaris/home/hudson/hudson-slave/workspace/ZooKeeper-trunk-solaris/trunk/build/test/data/invalidsnap
[copy] Copying 8 files to /zonestorage/hudson_solaris/home/hudson/hudson-slave/workspace/ZooKeeper-trunk-solaris/trunk/build/test/data/invalidsnap
[mkdir] Created dir: /zonestorage/hudson_solaris/home/hudson/hudson-slave/workspace/ZooKeeper-trunk-solaris/trunk/build/test/data/buffersize
[copy] Copying 7 files to /zonestorage/hudson_solaris/home/hudson/hudson-slave/workspace/ZooKeeper-trunk-solaris/trunk/build/test/data/buffersize
test-category:
junit.run:
[junit] Running org.apache.zookeeper.ClientReconnectTest
[junit] Tests run: 1, Failures: 0, Errors: 1, Time elapsed: 0 sec
BUILD FAILED
/zonestorage/hudson_solaris/home/hudson/hudson-slave/workspace/ZooKeeper-trunk-solaris/trunk/build.xml:1306: Process fork failed.
Total time: 2 minutes 36 seconds
Build step 'Invoke Ant' marked build as failure
[locks-and-latches] Releasing all the locks
[locks-and-latches] All the locks released
Recording test results
Email was triggered for: Failure
Sending email for trigger: Failure
###################################################################################
############################## FAILED TESTS (if any) ##############################
1 tests failed.
FAILED: org.apache.zookeeper.ClientReconnectTest.unknown
Error Message:
Forked Java VM exited abnormally. Please note the time in the report does not reflect the time until the VM exit.
Stack Trace:
junit.framework.AssertionFailedError: Forked Java VM exited abnormally. Please note the time in the report does not reflect the time until the VM exit.