You are viewing a plain text version of this content. The canonical link for it is here.
Posted to builds@beam.apache.org by Apache Jenkins Server <je...@builds.apache.org> on 2021/03/14 06:16:05 UTC
Build failed in Jenkins: beam_PostCommit_PortableJar_Flink #3381
See <https://ci-beam.apache.org/job/beam_PostCommit_PortableJar_Flink/3381/display/redirect>
Changes:
------------------------------------------
[...truncated 407.96 KB...]
Mar 14, 2021 6:15:59 AM org.apache.flink.runtime.taskexecutor.TaskExecutor unregisterTaskAndNotifyFinalState
INFO: Un-registering task and sending final execution state FINISHED to JobManager for task Partition (1/1)#0 50d1fef1cc6a9737ec625326c0e574a6.
Mar 14, 2021 6:15:59 AM org.apache.flink.runtime.taskexecutor.TaskExecutor unregisterTaskAndNotifyFinalState
INFO: Un-registering task and sending final execution state FINISHED to JobManager for task CHAIN MapPartition (MapPartition at [6]{Create, Map(<lambda at <string>:23>), assert_that}) -> FlatMap (FlatMap at ExtractOutput[0]) (1/1)#0 edc131cfa93fc24bd52e21743a9552ce.
Mar 14, 2021 6:15:59 AM org.apache.flink.runtime.taskmanager.Task transitionState
INFO: CHAIN Filter (UnionFixFilter) -> Map (Key Extractor) -> GroupCombine (GroupCombine at GroupCombine: assert_that/Group/GroupByKey) -> Map (Key Extractor) (1/1)#0 (fbbb2569d78eff8703a747386751cfc5) switched from RUNNING to FINISHED.
Mar 14, 2021 6:15:59 AM org.apache.flink.runtime.taskmanager.Task doRun
INFO: Freeing task resources for CHAIN Filter (UnionFixFilter) -> Map (Key Extractor) -> GroupCombine (GroupCombine at GroupCombine: assert_that/Group/GroupByKey) -> Map (Key Extractor) (1/1)#0 (fbbb2569d78eff8703a747386751cfc5).
Mar 14, 2021 6:15:59 AM org.apache.flink.runtime.taskexecutor.TaskExecutor unregisterTaskAndNotifyFinalState
INFO: Un-registering task and sending final execution state FINISHED to JobManager for task CHAIN Filter (UnionFixFilter) -> Map (Key Extractor) -> GroupCombine (GroupCombine at GroupCombine: assert_that/Group/GroupByKey) -> Map (Key Extractor) (1/1)#0 fbbb2569d78eff8703a747386751cfc5.
Mar 14, 2021 6:15:59 AM org.apache.flink.runtime.taskmanager.Task transitionState
INFO: GroupReduce (GroupReduce at assert_that/Group/GroupByKey) (1/1)#0 (ee6a5cf783bacc9d1db55c0f7c2af2eb) switched from RUNNING to FINISHED.
Mar 14, 2021 6:15:59 AM org.apache.flink.runtime.taskmanager.Task doRun
INFO: Freeing task resources for GroupReduce (GroupReduce at assert_that/Group/GroupByKey) (1/1)#0 (ee6a5cf783bacc9d1db55c0f7c2af2eb).
Mar 14, 2021 6:15:59 AM org.apache.flink.runtime.taskexecutor.TaskExecutor unregisterTaskAndNotifyFinalState
INFO: Un-registering task and sending final execution state FINISHED to JobManager for task GroupReduce (GroupReduce at assert_that/Group/GroupByKey) (1/1)#0 ee6a5cf783bacc9d1db55c0f7c2af2eb.
Mar 14, 2021 6:15:59 AM org.apache.flink.runtime.executiongraph.Execution transitionState
INFO: CHAIN MapPartition (MapPartition at [4]assert_that/{Create, Group}) -> FlatMap (FlatMap at ExtractOutput[0]) (1/1) (f2c9030aa555151dcb2651bedb9bf601) switched from RUNNING to FINISHED.
Mar 14, 2021 6:15:59 AM org.apache.flink.runtime.executiongraph.Execution transitionState
INFO: CHAIN MapPartition (MapPartition at [1]Create/FlatMap(<lambda at core.py:2971>)) -> FlatMap (FlatMap at ExtractOutput[0]) (1/1) (340f104f2bdd4cfa07c643327c1543e6) switched from RUNNING to FINISHED.
Mar 14, 2021 6:15:59 AM org.apache.flink.runtime.executiongraph.Execution transitionState
INFO: Partition (1/1) (50d1fef1cc6a9737ec625326c0e574a6) switched from RUNNING to FINISHED.
Mar 14, 2021 6:15:59 AM org.apache.flink.runtime.executiongraph.Execution transitionState
INFO: CHAIN MapPartition (MapPartition at [6]{Create, Map(<lambda at <string>:23>), assert_that}) -> FlatMap (FlatMap at ExtractOutput[0]) (1/1) (edc131cfa93fc24bd52e21743a9552ce) switched from RUNNING to FINISHED.
Mar 14, 2021 6:15:59 AM org.apache.flink.runtime.executiongraph.Execution transitionState
INFO: CHAIN Filter (UnionFixFilter) -> Map (Key Extractor) -> GroupCombine (GroupCombine at GroupCombine: assert_that/Group/GroupByKey) -> Map (Key Extractor) (1/1) (fbbb2569d78eff8703a747386751cfc5) switched from RUNNING to FINISHED.
Mar 14, 2021 6:15:59 AM org.apache.flink.runtime.executiongraph.Execution transitionState
INFO: GroupReduce (GroupReduce at assert_that/Group/GroupByKey) (1/1) (ee6a5cf783bacc9d1db55c0f7c2af2eb) switched from RUNNING to FINISHED.
Mar 14, 2021 6:15:59 AM org.apache.beam.runners.fnexecution.control.DefaultJobBundleFactory$WrappedSdkHarnessClient unref
INFO: Closing environment urn: "beam:env:docker:v1"
payload: "\n$apache/beam_python3.7_sdk:2.30.0.dev"
capabilities: "beam:coder:bytes:v1"
capabilities: "beam:coder:string_utf8:v1"
capabilities: "beam:coder:kv:v1"
capabilities: "beam:coder:bool:v1"
capabilities: "beam:coder:varint:v1"
capabilities: "beam:coder:double:v1"
capabilities: "beam:coder:iterable:v1"
capabilities: "beam:coder:timer:v1"
capabilities: "beam:coder:interval_window:v1"
capabilities: "beam:coder:length_prefix:v1"
capabilities: "beam:coder:global_window:v1"
capabilities: "beam:coder:windowed_value:v1"
capabilities: "beam:coder:param_windowed_value:v1"
capabilities: "beam:coder:state_backed_iterable:v1"
capabilities: "beam:coder:row:v1"
capabilities: "beam:coder:sharded_key:v1"
capabilities: "beam:protocol:progress_reporting:v0"
capabilities: "beam:protocol:harness_monitoring_infos:v1"
capabilities: "beam:protocol:worker_status:v1"
capabilities: "beam:combinefn:packed_python:v1"
capabilities: "beam:version:sdk_base:apache/beam_python3.7_sdk:2.30.0.dev"
capabilities: "beam:transform:sdf_truncate_sized_restrictions:v1"
capabilities: "beam:transform:to_string:v1"
dependencies {
type_urn: "beam:artifact:type:file:v1"
type_payload: "\n\253\001classpath://BEAM-PIPELINE/pipeline/artifacts/job-1ce00735-78f6-4893-804e-aa2beefb8e01/6286fcc1a22bfd9add3919e9024dc68eb5cb53972e641ba6d140bcb7bd8d8ba0-pickled_main_session"
role_urn: "beam:artifact:role:staging_to:v1"
role_payload: "\n\024pickled_main_session"
}
Mar 14, 2021 6:15:59 AM org.apache.beam.runners.fnexecution.logging.GrpcLoggingService close
INFO: 1 Beam Fn Logging clients still connected during shutdown.
Mar 14, 2021 6:15:59 AM org.apache.beam.sdk.fn.data.BeamFnDataGrpcMultiplexer$InboundObserver onCompleted
WARNING: Hanged up for unknown endpoint.
Mar 14, 2021 6:15:59 AM org.apache.beam.sdk.fn.data.BeamFnDataGrpcMultiplexer$InboundObserver onCompleted
WARNING: Hanged up for unknown endpoint.
Mar 14, 2021 6:16:00 AM org.apache.beam.runners.fnexecution.environment.DockerContainerEnvironment close
INFO: Closing Docker container e01540434fab746a73009538b5e81c95784cdd3457c08728927945b0f00cb01f. Logs:
2021/03/14 06:15:58 Provision info:
pipeline_options:{fields:{key:"beam:option:allow_non_deterministic_key_coders:v1" value:{bool_value:false}} fields:{key:"beam:option:app_name:v1" value:{null_value:NULL_VALUE}} fields:{key:"beam:option:artifact_port:v1" value:{string_value:"0"}} fields:{key:"beam:option:beam_services:v1" value:{struct_value:{}}} fields:{key:"beam:option:dataflow_endpoint:v1" value:{string_value:"https://dataflow.googleapis.com"}} fields:{key:"beam:option:direct_num_workers:v1" value:{string_value:"1"}} fields:{key:"beam:option:direct_runner_bundle_repeat:v1" value:{string_value:"0"}} fields:{key:"beam:option:direct_runner_use_stacked_bundle:v1" value:{bool_value:true}} fields:{key:"beam:option:direct_running_mode:v1" value:{string_value:"in_memory"}} fields:{key:"beam:option:dry_run:v1" value:{bool_value:false}} fields:{key:"beam:option:enable_streaming_engine:v1" value:{bool_value:false}} fields:{key:"beam:option:environment_cache_millis:v1" value:{string_value:"0"}} fields:{key:"beam:option:environment_options:v1" value:{list_value:{values:{string_value:"docker_container_image=apache/beam_python3.7_sdk:2.30.0.dev"}}}} fields:{key:"beam:option:environment_type:v1" value:{string_value:"DOCKER"}} fields:{key:"beam:option:expansion_port:v1" value:{string_value:"0"}} fields:{key:"beam:option:experiments:v1" value:{list_value:{values:{string_value:"beam_fn_api"}}}} fields:{key:"beam:option:flink_job_server_jar:v1" value:{string_value:"<https://ci-beam.apache.org/job/beam_PostCommit_PortableJar_Flink/ws/src/runners/flink/1.12/job-server/build/libs/beam-runners-flink-1.12-job-server-2.30.0-SNAPSHOT.jar"}}> fields:{key:"beam:option:flink_master:v1" value:{string_value:"[auto]"}} fields:{key:"beam:option:flink_submit_uber_jar:v1" value:{bool_value:true}} fields:{key:"beam:option:flink_version:v1" value:{string_value:"1.12"}} fields:{key:"beam:option:hdfs_full_urls:v1" value:{bool_value:false}} fields:{key:"beam:option:job_name:v1" value:{string_value:"BeamApp-jenkins-0314061538-4faa2378"}} fields:{key:"beam:option:job_port:v1" value:{string_value:"0"}} fields:{key:"beam:option:job_server_java_launcher:v1" value:{string_value:"java"}} fields:{key:"beam:option:job_server_jvm_properties:v1" value:{list_value:{}}} fields:{key:"beam:option:job_server_timeout:v1" value:{string_value:"60"}} fields:{key:"beam:option:no_auth:v1" value:{bool_value:false}} fields:{key:"beam:option:options_id:v1" value:{number_value:1}} fields:{key:"beam:option:parallelism:v1" value:{string_value:"1"}} fields:{key:"beam:option:performance_runtime_type_check:v1" value:{bool_value:false}} fields:{key:"beam:option:pipeline_type_check:v1" value:{bool_value:true}} fields:{key:"beam:option:profile_cpu:v1" value:{bool_value:false}} fields:{key:"beam:option:profile_memory:v1" value:{bool_value:false}} fields:{key:"beam:option:profile_sample_rate:v1" value:{number_value:1}} fields:{key:"beam:option:runtime_type_check:v1" value:{bool_value:false}} fields:{key:"beam:option:s3_disable_ssl:v1" value:{bool_value:false}} fields:{key:"beam:option:save_main_session:v1" value:{bool_value:true}} fields:{key:"beam:option:sdk_location:v1" value:{string_value:"container"}} fields:{key:"beam:option:sdk_worker_parallelism:v1" value:{string_value:"1"}} fields:{key:"beam:option:spark_master_url:v1" value:{string_value:"local[4]"}} fields:{key:"beam:option:spark_submit_uber_jar:v1" value:{bool_value:false}} fields:{key:"beam:option:streaming:v1" value:{bool_value:false}} fields:{key:"beam:option:type_check_additional:v1" value:{string_value:""}} fields:{key:"beam:option:type_check_strictness:v1" value:{string_value:"DEFAULT_TO_ANY"}} fields:{key:"beam:option:update:v1" value:{bool_value:false}}} retrieval_token:"__no_artifacts_staged__" logging_endpoint:{url:"localhost:44043"} artifact_endpoint:{url:"localhost:44871"} control_endpoint:{url:"localhost:34451"} dependencies:{type_urn:"beam:artifact:type:file:v1" type_payload:"\n\xab\x01classpath://BEAM-PIPELINE/pipeline/artifacts/job-1ce00735-78f6-4893-804e-aa2beefb8e01/6286fcc1a22bfd9add3919e9024dc68eb5cb53972e641ba6d140bcb7bd8d8ba0-pickled_main_session" role_urn:"beam:artifact:role:staging_to:v1" role_payload:"\n\x14pickled_main_session"}
2021/03/14 06:15:58 Initializing python harness: /opt/apache/beam/boot --id=1-1 --provision_endpoint=localhost:44329
2021/03/14 06:15:58 Found artifact: pickled_main_session
2021/03/14 06:15:58 Installing setup packages ...
2021/03/14 06:15:58 Executing: python -m apache_beam.runners.worker.sdk_worker_main
2021/03/14 06:16:00 Python exited: <nil>
Mar 14, 2021 6:16:00 AM org.apache.beam.runners.fnexecution.control.DefaultJobBundleFactory$WrappedSdkHarnessClient close
WARNING: Error cleaning up servers urn: "beam:env:docker:v1"
payload: "\n$apache/beam_python3.7_sdk:2.30.0.dev"
capabilities: "beam:coder:bytes:v1"
capabilities: "beam:coder:string_utf8:v1"
capabilities: "beam:coder:kv:v1"
capabilities: "beam:coder:bool:v1"
capabilities: "beam:coder:varint:v1"
capabilities: "beam:coder:double:v1"
capabilities: "beam:coder:iterable:v1"
capabilities: "beam:coder:timer:v1"
capabilities: "beam:coder:interval_window:v1"
capabilities: "beam:coder:length_prefix:v1"
capabilities: "beam:coder:global_window:v1"
capabilities: "beam:coder:windowed_value:v1"
capabilities: "beam:coder:param_windowed_value:v1"
capabilities: "beam:coder:state_backed_iterable:v1"
capabilities: "beam:coder:row:v1"
capabilities: "beam:coder:sharded_key:v1"
capabilities: "beam:protocol:progress_reporting:v0"
capabilities: "beam:protocol:harness_monitoring_infos:v1"
capabilities: "beam:protocol:worker_status:v1"
capabilities: "beam:combinefn:packed_python:v1"
capabilities: "beam:version:sdk_base:apache/beam_python3.7_sdk:2.30.0.dev"
capabilities: "beam:transform:sdf_truncate_sized_restrictions:v1"
capabilities: "beam:transform:to_string:v1"
dependencies {
type_urn: "beam:artifact:type:file:v1"
type_payload: "\n\253\001classpath://BEAM-PIPELINE/pipeline/artifacts/job-1ce00735-78f6-4893-804e-aa2beefb8e01/6286fcc1a22bfd9add3919e9024dc68eb5cb53972e641ba6d140bcb7bd8d8ba0-pickled_main_session"
role_urn: "beam:artifact:role:staging_to:v1"
role_payload: "\n\024pickled_main_session"
}
java.io.IOException: Received exit code 1 for command 'docker kill e01540434fab746a73009538b5e81c95784cdd3457c08728927945b0f00cb01f'. stderr: Error response from daemon: Cannot kill container: e01540434fab746a73009538b5e81c95784cdd3457c08728927945b0f00cb01f: Container e01540434fab746a73009538b5e81c95784cdd3457c08728927945b0f00cb01f is not running
at org.apache.beam.runners.fnexecution.environment.DockerCommand.runShortCommand(DockerCommand.java:237)
at org.apache.beam.runners.fnexecution.environment.DockerCommand.runShortCommand(DockerCommand.java:171)
at org.apache.beam.runners.fnexecution.environment.DockerCommand.killContainer(DockerCommand.java:151)
at org.apache.beam.runners.fnexecution.environment.DockerContainerEnvironment.close(DockerContainerEnvironment.java:93)
at org.apache.beam.runners.fnexecution.control.DefaultJobBundleFactory$WrappedSdkHarnessClient.$closeResource(DefaultJobBundleFactory.java:642)
at org.apache.beam.runners.fnexecution.control.DefaultJobBundleFactory$WrappedSdkHarnessClient.close(DefaultJobBundleFactory.java:642)
at org.apache.beam.runners.fnexecution.control.DefaultJobBundleFactory$WrappedSdkHarnessClient.unref(DefaultJobBundleFactory.java:658)
at org.apache.beam.runners.fnexecution.control.DefaultJobBundleFactory$WrappedSdkHarnessClient.access$400(DefaultJobBundleFactory.java:589)
at org.apache.beam.runners.fnexecution.control.DefaultJobBundleFactory.lambda$createEnvironmentCaches$3(DefaultJobBundleFactory.java:212)
at org.apache.beam.vendor.guava.v26_0_jre.com.google.common.cache.LocalCache.processPendingNotifications(LocalCache.java:1809)
at org.apache.beam.vendor.guava.v26_0_jre.com.google.common.cache.LocalCache$Segment.runUnlockedCleanup(LocalCache.java:3462)
at org.apache.beam.vendor.guava.v26_0_jre.com.google.common.cache.LocalCache$Segment.postWriteCleanup(LocalCache.java:3438)
at org.apache.beam.vendor.guava.v26_0_jre.com.google.common.cache.LocalCache$Segment.clear(LocalCache.java:3215)
at org.apache.beam.vendor.guava.v26_0_jre.com.google.common.cache.LocalCache.clear(LocalCache.java:4270)
at org.apache.beam.vendor.guava.v26_0_jre.com.google.common.cache.LocalCache$LocalManualCache.invalidateAll(LocalCache.java:4909)
at org.apache.beam.runners.fnexecution.control.DefaultJobBundleFactory.close(DefaultJobBundleFactory.java:319)
at org.apache.beam.runners.fnexecution.control.DefaultExecutableStageContext.close(DefaultExecutableStageContext.java:43)
at org.apache.beam.runners.fnexecution.control.ReferenceCountingExecutableStageContextFactory$WrappedContext.closeActual(ReferenceCountingExecutableStageContextFactory.java:212)
at org.apache.beam.runners.fnexecution.control.ReferenceCountingExecutableStageContextFactory$WrappedContext.access$200(ReferenceCountingExecutableStageContextFactory.java:188)
at org.apache.beam.runners.fnexecution.control.ReferenceCountingExecutableStageContextFactory.release(ReferenceCountingExecutableStageContextFactory.java:177)
at org.apache.beam.runners.fnexecution.control.ReferenceCountingExecutableStageContextFactory.scheduleRelease(ReferenceCountingExecutableStageContextFactory.java:136)
at org.apache.beam.runners.fnexecution.control.ReferenceCountingExecutableStageContextFactory.access$300(ReferenceCountingExecutableStageContextFactory.java:48)
at org.apache.beam.runners.fnexecution.control.ReferenceCountingExecutableStageContextFactory$WrappedContext.close(ReferenceCountingExecutableStageContextFactory.java:208)
at org.apache.beam.runners.flink.translation.functions.FlinkExecutableStageFunction.$closeResource(FlinkExecutableStageFunction.java:268)
at org.apache.beam.runners.flink.translation.functions.FlinkExecutableStageFunction.close(FlinkExecutableStageFunction.java:373)
at org.apache.flink.api.common.functions.util.FunctionUtils.closeFunction(FunctionUtils.java:41)
at org.apache.flink.runtime.operators.BatchTask.run(BatchTask.java:519)
at org.apache.flink.runtime.operators.BatchTask.invoke(BatchTask.java:357)
at org.apache.flink.runtime.taskmanager.Task.doRun(Task.java:755)
at org.apache.flink.runtime.taskmanager.Task.run(Task.java:570)
at java.lang.Thread.run(Thread.java:748)
Mar 14, 2021 6:16:00 AM org.apache.flink.runtime.taskmanager.Task transitionState
INFO: MapPartition (MapPartition at [3]assert_that/{Group, Unkey, Match}) (1/1)#0 (a41b8cc3eefd716691a89a7ff33016fe) switched from RUNNING to FINISHED.
Mar 14, 2021 6:16:00 AM org.apache.flink.runtime.taskmanager.Task doRun
INFO: Freeing task resources for MapPartition (MapPartition at [3]assert_that/{Group, Unkey, Match}) (1/1)#0 (a41b8cc3eefd716691a89a7ff33016fe).
Mar 14, 2021 6:16:00 AM org.apache.flink.runtime.taskmanager.Task transitionState
INFO: DataSink (DiscardingOutput) (1/1)#0 (971b95b528e415dfe919d7ba7f4819c0) switched from RUNNING to FINISHED.
Mar 14, 2021 6:16:00 AM org.apache.flink.runtime.taskmanager.Task doRun
INFO: Freeing task resources for DataSink (DiscardingOutput) (1/1)#0 (971b95b528e415dfe919d7ba7f4819c0).
Mar 14, 2021 6:16:00 AM org.apache.flink.runtime.taskexecutor.TaskExecutor unregisterTaskAndNotifyFinalState
INFO: Un-registering task and sending final execution state FINISHED to JobManager for task MapPartition (MapPartition at [3]assert_that/{Group, Unkey, Match}) (1/1)#0 a41b8cc3eefd716691a89a7ff33016fe.
Mar 14, 2021 6:16:00 AM org.apache.flink.runtime.taskexecutor.TaskExecutor unregisterTaskAndNotifyFinalState
INFO: Un-registering task and sending final execution state FINISHED to JobManager for task DataSink (DiscardingOutput) (1/1)#0 971b95b528e415dfe919d7ba7f4819c0.
Mar 14, 2021 6:16:00 AM org.apache.flink.runtime.executiongraph.Execution transitionState
INFO: MapPartition (MapPartition at [3]assert_that/{Group, Unkey, Match}) (1/1) (a41b8cc3eefd716691a89a7ff33016fe) switched from RUNNING to FINISHED.
Mar 14, 2021 6:16:00 AM org.apache.flink.runtime.executiongraph.Execution transitionState
INFO: DataSink (DiscardingOutput) (1/1) (971b95b528e415dfe919d7ba7f4819c0) switched from RUNNING to FINISHED.
Mar 14, 2021 6:16:00 AM org.apache.flink.runtime.executiongraph.ExecutionGraph transitionState
INFO: Job BeamApp-jenkins-0314061538-4faa2378 (947b795f1289583747d9e286e67c688e) switched from state RUNNING to FINISHED.
Mar 14, 2021 6:16:01 AM org.apache.flink.runtime.dispatcher.Dispatcher jobReachedGloballyTerminalState
INFO: Job 947b795f1289583747d9e286e67c688e reached globally terminal state FINISHED.
Mar 14, 2021 6:16:01 AM org.apache.flink.runtime.jobmaster.JobMaster onStop
INFO: Stopping the JobMaster for job BeamApp-jenkins-0314061538-4faa2378(947b795f1289583747d9e286e67c688e).
Mar 14, 2021 6:16:01 AM org.apache.flink.runtime.jobmaster.slotpool.SlotPoolImpl suspend
INFO: Suspending SlotPool.
Mar 14, 2021 6:16:01 AM org.apache.flink.runtime.jobmaster.JobMaster dissolveResourceManagerConnection
INFO: Close ResourceManager connection 296fd5d1cec90b1f2d4abd46dd155da5: Stopping JobMaster for job BeamApp-jenkins-0314061538-4faa2378(947b795f1289583747d9e286e67c688e)..
Mar 14, 2021 6:16:01 AM org.apache.flink.runtime.taskexecutor.slot.TaskSlotTableImpl freeSlotInternal
INFO: Free slot TaskSlot(index:0, state:ACTIVE, resource profile: ResourceProfile{managedMemory=128.000mb (134217728 bytes), networkMemory=64.000mb (67108864 bytes)}, allocationId: 1d0c282764d682dcd430c89e4e2bd105, jobId: 947b795f1289583747d9e286e67c688e).
Mar 14, 2021 6:16:01 AM org.apache.flink.runtime.jobmaster.slotpool.SlotPoolImpl close
INFO: Stopping SlotPool.
Mar 14, 2021 6:16:01 AM org.apache.flink.runtime.resourcemanager.ResourceManager closeJobManagerConnection
INFO: Disconnect job manager be785c7b94cabd84168da18b021b483a@akka://flink/user/rpc/jobmanager_3 for job 947b795f1289583747d9e286e67c688e from the resource manager.
Mar 14, 2021 6:16:01 AM org.apache.flink.runtime.taskexecutor.DefaultJobLeaderService removeJob
INFO: Remove job 947b795f1289583747d9e286e67c688e from job leader monitoring.
Mar 14, 2021 6:16:01 AM org.apache.flink.runtime.taskexecutor.TaskExecutor disconnectJobManagerConnection
INFO: Close JobManager connection for job 947b795f1289583747d9e286e67c688e.
Mar 14, 2021 6:16:01 AM org.apache.beam.vendor.grpc.v1p26p0.io.netty.util.concurrent.DefaultPromise safeExecute
SEVERE: Failed to submit a listener notification task. Event loop shut down?
java.lang.IllegalAccessError: tried to access class org.apache.beam.vendor.grpc.v1p26p0.io.netty.util.concurrent.GlobalEventExecutor$2 from class org.apache.beam.vendor.grpc.v1p26p0.io.netty.util.concurrent.GlobalEventExecutor
at org.apache.beam.vendor.grpc.v1p26p0.io.netty.util.concurrent.GlobalEventExecutor.startThread(GlobalEventExecutor.java:227)
at org.apache.beam.vendor.grpc.v1p26p0.io.netty.util.concurrent.GlobalEventExecutor.execute(GlobalEventExecutor.java:215)
at org.apache.beam.vendor.grpc.v1p26p0.io.netty.util.concurrent.DefaultPromise.safeExecute(DefaultPromise.java:841)
at org.apache.beam.vendor.grpc.v1p26p0.io.netty.util.concurrent.DefaultPromise.notifyListeners(DefaultPromise.java:498)
at org.apache.beam.vendor.grpc.v1p26p0.io.netty.util.concurrent.DefaultPromise.setValue0(DefaultPromise.java:615)
at org.apache.beam.vendor.grpc.v1p26p0.io.netty.util.concurrent.DefaultPromise.setSuccess0(DefaultPromise.java:604)
at org.apache.beam.vendor.grpc.v1p26p0.io.netty.util.concurrent.DefaultPromise.setSuccess(DefaultPromise.java:96)
at org.apache.beam.vendor.grpc.v1p26p0.io.netty.util.concurrent.SingleThreadEventExecutor$6.run(SingleThreadEventExecutor.java:1089)
at org.apache.beam.vendor.grpc.v1p26p0.io.netty.util.internal.ThreadExecutorMap$2.run(ThreadExecutorMap.java:74)
at org.apache.beam.vendor.grpc.v1p26p0.io.netty.util.concurrent.FastThreadLocalRunnable.run(FastThreadLocalRunnable.java:30)
at java.lang.Thread.run(Thread.java:748)
INFO:apache_beam.runners.portability.portable_runner:Job state changed to DONE
kill %1 || echo "Failed to shut down Flink mini cluster"
rm -rf "$ENV_DIR"
if [[ "$TEST_EXIT_CODE" -eq 0 ]]; then
echo ">>> SUCCESS"
else
echo ">>> FAILURE"
fi
exit $TEST_EXIT_CODE
FAILURE: Build completed with 2 failures.
1: Task failed with an exception.
-----------
* Where:
Script '<https://ci-beam.apache.org/job/beam_PostCommit_PortableJar_Flink/ws/src/sdks/python/test-suites/portable/common.gradle'> line: 210
* What went wrong:
Execution failed for task ':sdks:python:test-suites:portable:py37:testJavaJarCreatorFlinkRunner'.
> Process 'command 'sh'' finished with non-zero exit value 1
* Try:
Run with --stacktrace option to get the stack trace. Run with --info or --debug option to get more log output. Run with --scan to get full insights.
==============================================================================
2: Task failed with an exception.
-----------
* Where:
Script '<https://ci-beam.apache.org/job/beam_PostCommit_PortableJar_Flink/ws/src/sdks/python/test-suites/portable/common.gradle'> line: 210
* What went wrong:
Execution failed for task ':sdks:python:test-suites:portable:py36:testJavaJarCreatorFlinkRunner'.
> Process 'command 'sh'' finished with non-zero exit value 1
* Try:
Run with --stacktrace option to get the stack trace. Run with --info or --debug option to get more log output. Run with --scan to get full insights.
==============================================================================
* Get more help at https://help.gradle.org
Deprecated Gradle features were used in this build, making it incompatible with Gradle 7.0.
Use '--warning-mode all' to show the individual deprecation warnings.
See https://docs.gradle.org/6.8/userguide/command_line_interface.html#sec:command_line_warnings
BUILD FAILED in 15m 35s
151 actionable tasks: 109 executed, 39 from cache, 3 up-to-date
Gradle was unable to watch the file system for changes. The inotify watches limit is too low.
Publishing build scan...
https://gradle.com/s/4umcog6ofza52
Build step 'Invoke Gradle script' changed build result to FAILURE
Build step 'Invoke Gradle script' marked build as failure
---------------------------------------------------------------------
To unsubscribe, e-mail: builds-unsubscribe@beam.apache.org
For additional commands, e-mail: builds-help@beam.apache.org
Jenkins build is back to normal : beam_PostCommit_PortableJar_Flink
#3383
Posted by Apache Jenkins Server <je...@builds.apache.org>.
See <https://ci-beam.apache.org/job/beam_PostCommit_PortableJar_Flink/3383/display/redirect>
---------------------------------------------------------------------
To unsubscribe, e-mail: builds-unsubscribe@beam.apache.org
For additional commands, e-mail: builds-help@beam.apache.org
Build failed in Jenkins: beam_PostCommit_PortableJar_Flink #3382
Posted by Apache Jenkins Server <je...@builds.apache.org>.
See <https://ci-beam.apache.org/job/beam_PostCommit_PortableJar_Flink/3382/display/redirect>
Changes:
------------------------------------------
[...truncated 413.88 KB...]
Mar 14, 2021 12:19:12 PM org.apache.flink.runtime.taskexecutor.TaskExecutor unregisterTaskAndNotifyFinalState
INFO: Un-registering task and sending final execution state FINISHED to JobManager for task DataSource (Impulse) (1/1)#0 e368098f816a74e2a6611401019a02e9.
Mar 14, 2021 12:19:12 PM org.apache.flink.runtime.taskexecutor.TaskExecutor unregisterTaskAndNotifyFinalState
INFO: Un-registering task and sending final execution state FINISHED to JobManager for task DataSource (Impulse) (1/1)#0 a59c7b96cd273a695ec142cffcb45ff1.
Mar 14, 2021 12:19:12 PM org.apache.flink.runtime.executiongraph.Execution transitionState
INFO: DataSource (Impulse) (1/1) (e368098f816a74e2a6611401019a02e9) switched from RUNNING to FINISHED.
Mar 14, 2021 12:19:12 PM org.apache.flink.runtime.executiongraph.Execution transitionState
INFO: DataSource (Impulse) (1/1) (a59c7b96cd273a695ec142cffcb45ff1) switched from RUNNING to FINISHED.
Mar 14, 2021 12:19:12 PM org.apache.flink.runtime.io.network.partition.consumer.SingleInputGate convertRecoveredInputChannels
INFO: Converting recovered input channels (1 channels)
Mar 14, 2021 12:19:12 PM org.apache.flink.runtime.io.network.partition.consumer.SingleInputGate convertRecoveredInputChannels
INFO: Converting recovered input channels (1 channels)
Mar 14, 2021 12:19:14 PM org.apache.beam.runners.fnexecution.environment.DockerCommand runImage
WARNING: Unable to pull docker image apache/beam_python3.6_sdk:2.30.0.dev, cause: Received exit code 1 for command 'docker pull apache/beam_python3.6_sdk:2.30.0.dev'. stderr: Error response from daemon: manifest for apache/beam_python3.6_sdk:2.30.0.dev not found
Mar 14, 2021 12:19:21 PM org.apache.beam.runners.fnexecution.logging.GrpcLoggingService logging
INFO: Beam Fn Logging client connected.
Mar 14, 2021 12:19:21 PM org.apache.beam.runners.fnexecution.logging.Slf4jLogWriter log
INFO: Logging handler created.
Mar 14, 2021 12:19:21 PM org.apache.beam.runners.fnexecution.logging.Slf4jLogWriter log
INFO: semi_persistent_directory: /tmp
Mar 14, 2021 12:19:21 PM org.apache.beam.runners.fnexecution.logging.Slf4jLogWriter log
INFO: Status HTTP server running at localhost:39187
Mar 14, 2021 12:19:21 PM org.apache.beam.runners.fnexecution.logging.Slf4jLogWriter log
WARNING: Discarding unparseable args: ['--app_name=None', '--direct_runner_use_stacked_bundle', '--job_server_timeout=60', '--options_id=1', '--parallelism=1', '--pipeline_type_check']
Mar 14, 2021 12:19:21 PM org.apache.beam.runners.fnexecution.logging.Slf4jLogWriter log
INFO: Python sdk harness started with pipeline_options: {'job_name': 'BeamApp-jenkins-0314121905-5b288b90', 'experiments': ['beam_fn_api'], 'save_main_session': True, 'sdk_location': 'container', 'environment_type': 'DOCKER', 'environment_options': ['docker_container_image=apache/beam_python3.6_sdk:2.30.0.dev'], 'sdk_worker_parallelism': '1', 'environment_cache_millis': '0', 'flink_job_server_jar': '<https://ci-beam.apache.org/job/beam_PostCommit_PortableJar_Flink/ws/src/runners/flink/1.12/job-server/build/libs/beam-runners-flink-1.12-job-server-2.30.0-SNAPSHOT.jar',> 'flink_submit_uber_jar': True}
Mar 14, 2021 12:19:21 PM org.apache.beam.runners.fnexecution.logging.Slf4jLogWriter log
INFO: Creating state cache with size 0
Mar 14, 2021 12:19:21 PM org.apache.beam.runners.fnexecution.logging.Slf4jLogWriter log
INFO: Creating insecure control channel for localhost:44827.
Mar 14, 2021 12:19:21 PM org.apache.beam.runners.fnexecution.logging.Slf4jLogWriter log
INFO: Control channel established.
Mar 14, 2021 12:19:21 PM org.apache.beam.runners.fnexecution.control.FnApiControlClientPoolService control
INFO: Beam Fn Control client connected with id 1-1
Mar 14, 2021 12:19:21 PM org.apache.beam.runners.fnexecution.logging.Slf4jLogWriter log
INFO: Initializing SDKHarness with unbounded number of workers.
Mar 14, 2021 12:19:21 PM org.apache.beam.runners.fnexecution.control.FnApiControlClientPoolService getProcessBundleDescriptor
INFO: getProcessBundleDescriptor request with id 1-4
Mar 14, 2021 12:19:21 PM org.apache.beam.runners.fnexecution.control.FnApiControlClientPoolService getProcessBundleDescriptor
INFO: getProcessBundleDescriptor request with id 1-2
Mar 14, 2021 12:19:21 PM org.apache.beam.runners.fnexecution.control.FnApiControlClientPoolService getProcessBundleDescriptor
INFO: getProcessBundleDescriptor request with id 1-5
Mar 14, 2021 12:19:21 PM org.apache.beam.runners.fnexecution.logging.Slf4jLogWriter log
INFO: Creating insecure state channel for localhost:33879.
Mar 14, 2021 12:19:21 PM org.apache.beam.runners.fnexecution.logging.Slf4jLogWriter log
INFO: State channel established.
Mar 14, 2021 12:19:21 PM org.apache.beam.runners.fnexecution.control.FnApiControlClientPoolService getProcessBundleDescriptor
INFO: getProcessBundleDescriptor request with id 1-3
Mar 14, 2021 12:19:21 PM org.apache.beam.runners.fnexecution.logging.Slf4jLogWriter log
INFO: Creating client data channel for localhost:35017
Mar 14, 2021 12:19:21 PM org.apache.beam.runners.fnexecution.data.GrpcDataService data
INFO: Beam Fn Data client connected.
Mar 14, 2021 12:19:21 PM org.apache.flink.runtime.io.network.partition.consumer.SingleInputGate convertRecoveredInputChannels
INFO: Converting recovered input channels (1 channels)
Mar 14, 2021 12:19:21 PM org.apache.flink.runtime.io.network.partition.consumer.SingleInputGate convertRecoveredInputChannels
INFO: Converting recovered input channels (1 channels)
Mar 14, 2021 12:19:21 PM org.apache.flink.runtime.io.network.partition.consumer.SingleInputGate convertRecoveredInputChannels
INFO: Converting recovered input channels (1 channels)
Mar 14, 2021 12:19:21 PM org.apache.flink.runtime.io.network.partition.consumer.SingleInputGate convertRecoveredInputChannels
INFO: Converting recovered input channels (1 channels)
Mar 14, 2021 12:19:21 PM org.apache.flink.runtime.taskmanager.Task transitionState
INFO: CHAIN MapPartition (MapPartition at [1]Create/FlatMap(<lambda at core.py:2971>)) -> FlatMap (FlatMap at ExtractOutput[0]) (1/1)#0 (a7555337b012ecad27d3859b75f1ed03) switched from RUNNING to FINISHED.
Mar 14, 2021 12:19:21 PM org.apache.flink.runtime.taskmanager.Task transitionState
INFO: CHAIN MapPartition (MapPartition at [4]assert_that/{Create, Group}) -> FlatMap (FlatMap at ExtractOutput[0]) (1/1)#0 (cd91e9d54e99bc43e3698490ba3859ad) switched from RUNNING to FINISHED.
Mar 14, 2021 12:19:21 PM org.apache.flink.runtime.taskmanager.Task transitionState
INFO: Partition (1/1)#0 (b4321b16a76da2e986bc3aaba7d45f99) switched from RUNNING to FINISHED.
Mar 14, 2021 12:19:21 PM org.apache.flink.runtime.taskmanager.Task doRun
INFO: Freeing task resources for CHAIN MapPartition (MapPartition at [1]Create/FlatMap(<lambda at core.py:2971>)) -> FlatMap (FlatMap at ExtractOutput[0]) (1/1)#0 (a7555337b012ecad27d3859b75f1ed03).
Mar 14, 2021 12:19:21 PM org.apache.flink.runtime.taskmanager.Task doRun
INFO: Freeing task resources for Partition (1/1)#0 (b4321b16a76da2e986bc3aaba7d45f99).
Mar 14, 2021 12:19:21 PM org.apache.flink.runtime.taskexecutor.TaskExecutor unregisterTaskAndNotifyFinalState
INFO: Un-registering task and sending final execution state FINISHED to JobManager for task CHAIN MapPartition (MapPartition at [1]Create/FlatMap(<lambda at core.py:2971>)) -> FlatMap (FlatMap at ExtractOutput[0]) (1/1)#0 a7555337b012ecad27d3859b75f1ed03.
Mar 14, 2021 12:19:21 PM org.apache.flink.runtime.taskmanager.Task doRun
INFO: Freeing task resources for CHAIN MapPartition (MapPartition at [4]assert_that/{Create, Group}) -> FlatMap (FlatMap at ExtractOutput[0]) (1/1)#0 (cd91e9d54e99bc43e3698490ba3859ad).
Mar 14, 2021 12:19:22 PM org.apache.flink.runtime.taskmanager.Task transitionState
INFO: CHAIN MapPartition (MapPartition at [6]{Create, Map(<lambda at <string>:23>), assert_that}) -> FlatMap (FlatMap at ExtractOutput[0]) (1/1)#0 (b25c48e01bfe6136d529bb15359ebbe3) switched from RUNNING to FINISHED.
Mar 14, 2021 12:19:22 PM org.apache.flink.runtime.taskmanager.Task doRun
INFO: Freeing task resources for CHAIN MapPartition (MapPartition at [6]{Create, Map(<lambda at <string>:23>), assert_that}) -> FlatMap (FlatMap at ExtractOutput[0]) (1/1)#0 (b25c48e01bfe6136d529bb15359ebbe3).
Mar 14, 2021 12:19:22 PM org.apache.flink.runtime.taskexecutor.TaskExecutor unregisterTaskAndNotifyFinalState
INFO: Un-registering task and sending final execution state FINISHED to JobManager for task Partition (1/1)#0 b4321b16a76da2e986bc3aaba7d45f99.
Mar 14, 2021 12:19:22 PM org.apache.flink.runtime.taskexecutor.TaskExecutor unregisterTaskAndNotifyFinalState
INFO: Un-registering task and sending final execution state FINISHED to JobManager for task CHAIN MapPartition (MapPartition at [4]assert_that/{Create, Group}) -> FlatMap (FlatMap at ExtractOutput[0]) (1/1)#0 cd91e9d54e99bc43e3698490ba3859ad.
Mar 14, 2021 12:19:22 PM org.apache.flink.runtime.taskexecutor.TaskExecutor unregisterTaskAndNotifyFinalState
INFO: Un-registering task and sending final execution state FINISHED to JobManager for task CHAIN MapPartition (MapPartition at [6]{Create, Map(<lambda at <string>:23>), assert_that}) -> FlatMap (FlatMap at ExtractOutput[0]) (1/1)#0 b25c48e01bfe6136d529bb15359ebbe3.
Mar 14, 2021 12:19:22 PM org.apache.flink.runtime.taskmanager.Task transitionState
INFO: CHAIN Filter (UnionFixFilter) -> Map (Key Extractor) -> GroupCombine (GroupCombine at GroupCombine: assert_that/Group/GroupByKey) -> Map (Key Extractor) (1/1)#0 (ed16536978842ba4081da7f55c41954a) switched from RUNNING to FINISHED.
Mar 14, 2021 12:19:22 PM org.apache.flink.runtime.taskmanager.Task doRun
INFO: Freeing task resources for CHAIN Filter (UnionFixFilter) -> Map (Key Extractor) -> GroupCombine (GroupCombine at GroupCombine: assert_that/Group/GroupByKey) -> Map (Key Extractor) (1/1)#0 (ed16536978842ba4081da7f55c41954a).
Mar 14, 2021 12:19:22 PM org.apache.flink.runtime.taskexecutor.TaskExecutor unregisterTaskAndNotifyFinalState
INFO: Un-registering task and sending final execution state FINISHED to JobManager for task CHAIN Filter (UnionFixFilter) -> Map (Key Extractor) -> GroupCombine (GroupCombine at GroupCombine: assert_that/Group/GroupByKey) -> Map (Key Extractor) (1/1)#0 ed16536978842ba4081da7f55c41954a.
Mar 14, 2021 12:19:22 PM org.apache.flink.runtime.taskmanager.Task transitionState
INFO: GroupReduce (GroupReduce at assert_that/Group/GroupByKey) (1/1)#0 (66344c2627ca4ae812b876b7985148c8) switched from RUNNING to FINISHED.
Mar 14, 2021 12:19:22 PM org.apache.flink.runtime.taskmanager.Task doRun
INFO: Freeing task resources for GroupReduce (GroupReduce at assert_that/Group/GroupByKey) (1/1)#0 (66344c2627ca4ae812b876b7985148c8).
Mar 14, 2021 12:19:22 PM org.apache.flink.runtime.taskexecutor.TaskExecutor unregisterTaskAndNotifyFinalState
INFO: Un-registering task and sending final execution state FINISHED to JobManager for task GroupReduce (GroupReduce at assert_that/Group/GroupByKey) (1/1)#0 66344c2627ca4ae812b876b7985148c8.
Mar 14, 2021 12:19:22 PM org.apache.flink.runtime.executiongraph.Execution transitionState
INFO: CHAIN MapPartition (MapPartition at [1]Create/FlatMap(<lambda at core.py:2971>)) -> FlatMap (FlatMap at ExtractOutput[0]) (1/1) (a7555337b012ecad27d3859b75f1ed03) switched from RUNNING to FINISHED.
Mar 14, 2021 12:19:22 PM org.apache.flink.runtime.executiongraph.Execution transitionState
INFO: Partition (1/1) (b4321b16a76da2e986bc3aaba7d45f99) switched from RUNNING to FINISHED.
Mar 14, 2021 12:19:22 PM org.apache.flink.runtime.executiongraph.Execution transitionState
INFO: CHAIN MapPartition (MapPartition at [4]assert_that/{Create, Group}) -> FlatMap (FlatMap at ExtractOutput[0]) (1/1) (cd91e9d54e99bc43e3698490ba3859ad) switched from RUNNING to FINISHED.
Mar 14, 2021 12:19:22 PM org.apache.flink.runtime.executiongraph.Execution transitionState
INFO: CHAIN MapPartition (MapPartition at [6]{Create, Map(<lambda at <string>:23>), assert_that}) -> FlatMap (FlatMap at ExtractOutput[0]) (1/1) (b25c48e01bfe6136d529bb15359ebbe3) switched from RUNNING to FINISHED.
Mar 14, 2021 12:19:22 PM org.apache.flink.runtime.executiongraph.Execution transitionState
INFO: CHAIN Filter (UnionFixFilter) -> Map (Key Extractor) -> GroupCombine (GroupCombine at GroupCombine: assert_that/Group/GroupByKey) -> Map (Key Extractor) (1/1) (ed16536978842ba4081da7f55c41954a) switched from RUNNING to FINISHED.
Mar 14, 2021 12:19:22 PM org.apache.flink.runtime.executiongraph.Execution transitionState
INFO: GroupReduce (GroupReduce at assert_that/Group/GroupByKey) (1/1) (66344c2627ca4ae812b876b7985148c8) switched from RUNNING to FINISHED.
Mar 14, 2021 12:19:22 PM org.apache.beam.runners.fnexecution.control.DefaultJobBundleFactory$WrappedSdkHarnessClient unref
INFO: Closing environment urn: "beam:env:docker:v1"
payload: "\n$apache/beam_python3.6_sdk:2.30.0.dev"
capabilities: "beam:coder:bytes:v1"
capabilities: "beam:coder:string_utf8:v1"
capabilities: "beam:coder:kv:v1"
capabilities: "beam:coder:bool:v1"
capabilities: "beam:coder:varint:v1"
capabilities: "beam:coder:double:v1"
capabilities: "beam:coder:iterable:v1"
capabilities: "beam:coder:timer:v1"
capabilities: "beam:coder:interval_window:v1"
capabilities: "beam:coder:length_prefix:v1"
capabilities: "beam:coder:global_window:v1"
capabilities: "beam:coder:windowed_value:v1"
capabilities: "beam:coder:param_windowed_value:v1"
capabilities: "beam:coder:state_backed_iterable:v1"
capabilities: "beam:coder:row:v1"
capabilities: "beam:coder:sharded_key:v1"
capabilities: "beam:protocol:progress_reporting:v0"
capabilities: "beam:protocol:harness_monitoring_infos:v1"
capabilities: "beam:protocol:worker_status:v1"
capabilities: "beam:combinefn:packed_python:v1"
capabilities: "beam:version:sdk_base:apache/beam_python3.6_sdk:2.30.0.dev"
capabilities: "beam:transform:sdf_truncate_sized_restrictions:v1"
capabilities: "beam:transform:to_string:v1"
dependencies {
type_urn: "beam:artifact:type:file:v1"
type_payload: "\n\253\001classpath://BEAM-PIPELINE/pipeline/artifacts/job-6e933967-e81d-49f4-87d7-64e828b4d838/221dc81a1f8b587700091760321b2a492f3e0f25a337da69be7b07c5e475ce1e-pickled_main_session"
role_urn: "beam:artifact:role:staging_to:v1"
role_payload: "\n\024pickled_main_session"
}
Mar 14, 2021 12:19:22 PM org.apache.beam.runners.fnexecution.logging.GrpcLoggingService close
INFO: 1 Beam Fn Logging clients still connected during shutdown.
Mar 14, 2021 12:19:22 PM org.apache.beam.sdk.fn.data.BeamFnDataGrpcMultiplexer$InboundObserver onCompleted
WARNING: Hanged up for unknown endpoint.
Mar 14, 2021 12:19:22 PM org.apache.beam.sdk.fn.data.BeamFnDataGrpcMultiplexer$InboundObserver onCompleted
WARNING: Hanged up for unknown endpoint.
Mar 14, 2021 12:19:22 PM org.apache.beam.runners.fnexecution.environment.DockerContainerEnvironment close
INFO: Closing Docker container e88e12e84a43c11406fec25a14e2c1dbd5131e5d4e013cb9d6b04ac072f0f68f. Logs:
2021/03/14 12:19:20 Provision info:
pipeline_options:{fields:{key:"beam:option:allow_non_deterministic_key_coders:v1" value:{bool_value:false}} fields:{key:"beam:option:app_name:v1" value:{null_value:NULL_VALUE}} fields:{key:"beam:option:artifact_port:v1" value:{string_value:"0"}} fields:{key:"beam:option:beam_services:v1" value:{struct_value:{}}} fields:{key:"beam:option:dataflow_endpoint:v1" value:{string_value:"https://dataflow.googleapis.com"}} fields:{key:"beam:option:direct_num_workers:v1" value:{string_value:"1"}} fields:{key:"beam:option:direct_runner_bundle_repeat:v1" value:{string_value:"0"}} fields:{key:"beam:option:direct_runner_use_stacked_bundle:v1" value:{bool_value:true}} fields:{key:"beam:option:direct_running_mode:v1" value:{string_value:"in_memory"}} fields:{key:"beam:option:dry_run:v1" value:{bool_value:false}} fields:{key:"beam:option:enable_streaming_engine:v1" value:{bool_value:false}} fields:{key:"beam:option:environment_cache_millis:v1" value:{string_value:"0"}} fields:{key:"beam:option:environment_options:v1" value:{list_value:{values:{string_value:"docker_container_image=apache/beam_python3.6_sdk:2.30.0.dev"}}}} fields:{key:"beam:option:environment_type:v1" value:{string_value:"DOCKER"}} fields:{key:"beam:option:expansion_port:v1" value:{string_value:"0"}} fields:{key:"beam:option:experiments:v1" value:{list_value:{values:{string_value:"beam_fn_api"}}}} fields:{key:"beam:option:flink_job_server_jar:v1" value:{string_value:"<https://ci-beam.apache.org/job/beam_PostCommit_PortableJar_Flink/ws/src/runners/flink/1.12/job-server/build/libs/beam-runners-flink-1.12-job-server-2.30.0-SNAPSHOT.jar"}}> fields:{key:"beam:option:flink_master:v1" value:{string_value:"[auto]"}} fields:{key:"beam:option:flink_submit_uber_jar:v1" value:{bool_value:true}} fields:{key:"beam:option:flink_version:v1" value:{string_value:"1.12"}} fields:{key:"beam:option:hdfs_full_urls:v1" value:{bool_value:false}} fields:{key:"beam:option:job_name:v1" value:{string_value:"BeamApp-jenkins-0314121905-5b288b90"}} fields:{key:"beam:option:job_port:v1" value:{string_value:"0"}} fields:{key:"beam:option:job_server_java_launcher:v1" value:{string_value:"java"}} fields:{key:"beam:option:job_server_jvm_properties:v1" value:{list_value:{}}} fields:{key:"beam:option:job_server_timeout:v1" value:{string_value:"60"}} fields:{key:"beam:option:no_auth:v1" value:{bool_value:false}} fields:{key:"beam:option:options_id:v1" value:{number_value:1}} fields:{key:"beam:option:parallelism:v1" value:{string_value:"1"}} fields:{key:"beam:option:performance_runtime_type_check:v1" value:{bool_value:false}} fields:{key:"beam:option:pipeline_type_check:v1" value:{bool_value:true}} fields:{key:"beam:option:profile_cpu:v1" value:{bool_value:false}} fields:{key:"beam:option:profile_memory:v1" value:{bool_value:false}} fields:{key:"beam:option:profile_sample_rate:v1" value:{number_value:1}} fields:{key:"beam:option:runtime_type_check:v1" value:{bool_value:false}} fields:{key:"beam:option:s3_disable_ssl:v1" value:{bool_value:false}} fields:{key:"beam:option:save_main_session:v1" value:{bool_value:true}} fields:{key:"beam:option:sdk_location:v1" value:{string_value:"container"}} fields:{key:"beam:option:sdk_worker_parallelism:v1" value:{string_value:"1"}} fields:{key:"beam:option:spark_master_url:v1" value:{string_value:"local[4]"}} fields:{key:"beam:option:spark_submit_uber_jar:v1" value:{bool_value:false}} fields:{key:"beam:option:streaming:v1" value:{bool_value:false}} fields:{key:"beam:option:type_check_additional:v1" value:{string_value:""}} fields:{key:"beam:option:type_check_strictness:v1" value:{string_value:"DEFAULT_TO_ANY"}} fields:{key:"beam:option:update:v1" value:{bool_value:false}}} retrieval_token:"__no_artifacts_staged__" logging_endpoint:{url:"localhost:44685"} artifact_endpoint:{url:"localhost:33461"} control_endpoint:{url:"localhost:44827"} dependencies:{type_urn:"beam:artifact:type:file:v1" type_payload:"\n\xab\x01classpath://BEAM-PIPELINE/pipeline/artifacts/job-6e933967-e81d-49f4-87d7-64e828b4d838/221dc81a1f8b587700091760321b2a492f3e0f25a337da69be7b07c5e475ce1e-pickled_main_session" role_urn:"beam:artifact:role:staging_to:v1" role_payload:"\n\x14pickled_main_session"}
2021/03/14 12:19:20 Initializing python harness: /opt/apache/beam/boot --id=1-1 --provision_endpoint=localhost:42185
2021/03/14 12:19:20 Found artifact: pickled_main_session
2021/03/14 12:19:20 Installing setup packages ...
2021/03/14 12:19:20 Executing: python -m apache_beam.runners.worker.sdk_worker_main
2021/03/14 12:19:22 Python exited: <nil>
Mar 14, 2021 12:19:25 PM org.apache.flink.runtime.taskmanager.Task transitionState
INFO: MapPartition (MapPartition at [3]assert_that/{Group, Unkey, Match}) (1/1)#0 (273f5ed09cb397ea79c704b67ff42464) switched from RUNNING to FINISHED.
Mar 14, 2021 12:19:25 PM org.apache.flink.runtime.taskmanager.Task doRun
INFO: Freeing task resources for MapPartition (MapPartition at [3]assert_that/{Group, Unkey, Match}) (1/1)#0 (273f5ed09cb397ea79c704b67ff42464).
Mar 14, 2021 12:19:25 PM org.apache.flink.runtime.taskmanager.Task transitionState
INFO: DataSink (DiscardingOutput) (1/1)#0 (16b4bbcb557242677dbb822fca649a40) switched from RUNNING to FINISHED.
Mar 14, 2021 12:19:25 PM org.apache.flink.runtime.taskmanager.Task doRun
INFO: Freeing task resources for DataSink (DiscardingOutput) (1/1)#0 (16b4bbcb557242677dbb822fca649a40).
Mar 14, 2021 12:19:25 PM org.apache.flink.runtime.taskexecutor.TaskExecutor unregisterTaskAndNotifyFinalState
INFO: Un-registering task and sending final execution state FINISHED to JobManager for task DataSink (DiscardingOutput) (1/1)#0 16b4bbcb557242677dbb822fca649a40.
Mar 14, 2021 12:19:25 PM org.apache.flink.runtime.taskexecutor.TaskExecutor unregisterTaskAndNotifyFinalState
INFO: Un-registering task and sending final execution state FINISHED to JobManager for task MapPartition (MapPartition at [3]assert_that/{Group, Unkey, Match}) (1/1)#0 273f5ed09cb397ea79c704b67ff42464.
Mar 14, 2021 12:19:25 PM org.apache.flink.runtime.executiongraph.Execution transitionState
INFO: DataSink (DiscardingOutput) (1/1) (16b4bbcb557242677dbb822fca649a40) switched from RUNNING to FINISHED.
Mar 14, 2021 12:19:25 PM org.apache.flink.runtime.executiongraph.Execution transitionState
INFO: MapPartition (MapPartition at [3]assert_that/{Group, Unkey, Match}) (1/1) (273f5ed09cb397ea79c704b67ff42464) switched from RUNNING to FINISHED.
Mar 14, 2021 12:19:25 PM org.apache.flink.runtime.executiongraph.ExecutionGraph transitionState
INFO: Job BeamApp-jenkins-0314121905-5b288b90 (d1246cfccdb3320368c6c09152637cde) switched from state RUNNING to FINISHED.
Mar 14, 2021 12:19:25 PM org.apache.flink.runtime.dispatcher.Dispatcher jobReachedGloballyTerminalState
INFO: Job d1246cfccdb3320368c6c09152637cde reached globally terminal state FINISHED.
Mar 14, 2021 12:19:25 PM org.apache.flink.runtime.jobmaster.JobMaster onStop
INFO: Stopping the JobMaster for job BeamApp-jenkins-0314121905-5b288b90(d1246cfccdb3320368c6c09152637cde).
Mar 14, 2021 12:19:25 PM org.apache.flink.runtime.jobmaster.slotpool.SlotPoolImpl suspend
INFO: Suspending SlotPool.
Mar 14, 2021 12:19:25 PM org.apache.flink.runtime.jobmaster.JobMaster dissolveResourceManagerConnection
INFO: Close ResourceManager connection ffef13010bbf9ccfb61abaf7898ab519: Stopping JobMaster for job BeamApp-jenkins-0314121905-5b288b90(d1246cfccdb3320368c6c09152637cde)..
Mar 14, 2021 12:19:25 PM org.apache.flink.runtime.jobmaster.slotpool.SlotPoolImpl close
INFO: Stopping SlotPool.
Mar 14, 2021 12:19:25 PM org.apache.flink.runtime.resourcemanager.ResourceManager closeJobManagerConnection
INFO: Disconnect job manager 8555f20a2fb88381ee6babb8bce94f3a@akka://flink/user/rpc/jobmanager_3 for job d1246cfccdb3320368c6c09152637cde from the resource manager.
Mar 14, 2021 12:19:25 PM org.apache.flink.runtime.taskexecutor.slot.TaskSlotTableImpl freeSlotInternal
INFO: Free slot TaskSlot(index:0, state:ACTIVE, resource profile: ResourceProfile{managedMemory=128.000mb (134217728 bytes), networkMemory=64.000mb (67108864 bytes)}, allocationId: 3a75fcbd05128d116f3c6d67bb4a4441, jobId: d1246cfccdb3320368c6c09152637cde).
Mar 14, 2021 12:19:25 PM org.apache.flink.runtime.taskexecutor.DefaultJobLeaderService removeJob
INFO: Remove job d1246cfccdb3320368c6c09152637cde from job leader monitoring.
Mar 14, 2021 12:19:25 PM org.apache.flink.runtime.taskexecutor.TaskExecutor disconnectJobManagerConnection
INFO: Close JobManager connection for job d1246cfccdb3320368c6c09152637cde.
INFO:apache_beam.runners.portability.portable_runner:Job state changed to DONE
kill %1 || echo "Failed to shut down Flink mini cluster"
rm -rf "$ENV_DIR"
if [[ "$TEST_EXIT_CODE" -eq 0 ]]; then
echo ">>> SUCCESS"
else
echo ">>> FAILURE"
fi
exit $TEST_EXIT_CODE
>>> SUCCESS
FAILURE: Build completed with 2 failures.
1: Task failed with an exception.
-----------
* Where:
Script '<https://ci-beam.apache.org/job/beam_PostCommit_PortableJar_Flink/ws/src/sdks/python/test-suites/portable/common.gradle'> line: 210
* What went wrong:
Execution failed for task ':sdks:python:test-suites:portable:py36:testJavaJarCreatorFlinkRunner'.
> Process 'command 'sh'' finished with non-zero exit value 1
* Try:
Run with --stacktrace option to get the stack trace. Run with --info or --debug option to get more log output. Run with --scan to get full insights.
==============================================================================
2: Task failed with an exception.
-----------
* Where:
Script '<https://ci-beam.apache.org/job/beam_PostCommit_PortableJar_Flink/ws/src/sdks/python/test-suites/portable/common.gradle'> line: 210
* What went wrong:
Execution failed for task ':sdks:python:test-suites:portable:py37:testJavaJarCreatorFlinkRunner'.
> Process 'command 'sh'' finished with non-zero exit value 1
* Try:
Run with --stacktrace option to get the stack trace. Run with --info or --debug option to get more log output. Run with --scan to get full insights.
==============================================================================
* Get more help at https://help.gradle.org
Deprecated Gradle features were used in this build, making it incompatible with Gradle 7.0.
Use '--warning-mode all' to show the individual deprecation warnings.
See https://docs.gradle.org/6.8/userguide/command_line_interface.html#sec:command_line_warnings
BUILD FAILED in 19m 1s
151 actionable tasks: 109 executed, 39 from cache, 3 up-to-date
Gradle was unable to watch the file system for changes. The inotify watches limit is too low.
Publishing build scan...
https://gradle.com/s/rkfa3fuv3oqyw
Build step 'Invoke Gradle script' changed build result to FAILURE
Build step 'Invoke Gradle script' marked build as failure
---------------------------------------------------------------------
To unsubscribe, e-mail: builds-unsubscribe@beam.apache.org
For additional commands, e-mail: builds-help@beam.apache.org