You are viewing a plain text version of this content. The canonical link for it is here.
Posted to dev@lucene.apache.org by Policeman Jenkins Server <je...@thetaphi.de> on 2018/11/25 23:03:39 UTC

[JENKINS] Lucene-Solr-master-MacOSX (64bit/jdk-9) - Build # 4948 - Still Unstable!

Build: https://jenkins.thetaphi.de/job/Lucene-Solr-master-MacOSX/4948/
Java: 64bit/jdk-9 -XX:-UseCompressedOops -XX:+UseSerialGC

1 tests failed.
FAILED:  org.apache.solr.cloud.autoscaling.sim.TestSimPolicyCloud.testCreateCollectionAddReplica

Error Message:
Timeout waiting for collection to become active Live Nodes: [127.0.0.1:10001_solr, 127.0.0.1:10004_solr, 127.0.0.1:10000_solr, 127.0.0.1:10002_solr, 127.0.0.1:10003_solr] Last available state: DocCollection(testCreateCollectionAddReplica//clusterstate.json/20)={   "replicationFactor":"1",   "pullReplicas":"0",   "router":{"name":"compositeId"},   "maxShardsPerNode":"1",   "autoAddReplicas":"false",   "nrtReplicas":"1",   "tlogReplicas":"0",   "autoCreated":"true",   "policy":"c1",   "shards":{"shard1":{       "replicas":{"core_node1":{           "core":"testCreateCollectionAddReplica_shard1_replica_n1",           "SEARCHER.searcher.maxDoc":0,           "SEARCHER.searcher.deletedDocs":0,           "INDEX.sizeInBytes":10240,           "node_name":"127.0.0.1:10001_solr",           "state":"active",           "type":"NRT",           "INDEX.sizeInGB":9.5367431640625E-6,           "SEARCHER.searcher.numDocs":0}},       "range":"80000000-7fffffff",       "state":"active"}}}

Stack Trace:
java.lang.AssertionError: Timeout waiting for collection to become active
Live Nodes: [127.0.0.1:10001_solr, 127.0.0.1:10004_solr, 127.0.0.1:10000_solr, 127.0.0.1:10002_solr, 127.0.0.1:10003_solr]
Last available state: DocCollection(testCreateCollectionAddReplica//clusterstate.json/20)={
  "replicationFactor":"1",
  "pullReplicas":"0",
  "router":{"name":"compositeId"},
  "maxShardsPerNode":"1",
  "autoAddReplicas":"false",
  "nrtReplicas":"1",
  "tlogReplicas":"0",
  "autoCreated":"true",
  "policy":"c1",
  "shards":{"shard1":{
      "replicas":{"core_node1":{
          "core":"testCreateCollectionAddReplica_shard1_replica_n1",
          "SEARCHER.searcher.maxDoc":0,
          "SEARCHER.searcher.deletedDocs":0,
          "INDEX.sizeInBytes":10240,
          "node_name":"127.0.0.1:10001_solr",
          "state":"active",
          "type":"NRT",
          "INDEX.sizeInGB":9.5367431640625E-6,
          "SEARCHER.searcher.numDocs":0}},
      "range":"80000000-7fffffff",
      "state":"active"}}}
	at __randomizedtesting.SeedInfo.seed([ACA94112DC23343A:2C89243CCD60DC9C]:0)
	at org.apache.solr.cloud.CloudTestUtils.waitForState(CloudTestUtils.java:70)
	at org.apache.solr.cloud.autoscaling.sim.TestSimPolicyCloud.testCreateCollectionAddReplica(TestSimPolicyCloud.java:123)
	at java.base/jdk.internal.reflect.NativeMethodAccessorImpl.invoke0(Native Method)
	at java.base/jdk.internal.reflect.NativeMethodAccessorImpl.invoke(NativeMethodAccessorImpl.java:62)
	at java.base/jdk.internal.reflect.DelegatingMethodAccessorImpl.invoke(DelegatingMethodAccessorImpl.java:43)
	at java.base/java.lang.reflect.Method.invoke(Method.java:564)
	at com.carrotsearch.randomizedtesting.RandomizedRunner.invoke(RandomizedRunner.java:1742)
	at com.carrotsearch.randomizedtesting.RandomizedRunner$8.evaluate(RandomizedRunner.java:935)
	at com.carrotsearch.randomizedtesting.RandomizedRunner$9.evaluate(RandomizedRunner.java:971)
	at com.carrotsearch.randomizedtesting.RandomizedRunner$10.evaluate(RandomizedRunner.java:985)
	at org.junit.rules.ExpectedException$ExpectedExceptionStatement.evaluate(ExpectedException.java:110)
	at com.carrotsearch.randomizedtesting.rules.SystemPropertiesRestoreRule$1.evaluate(SystemPropertiesRestoreRule.java:57)
	at org.apache.lucene.util.TestRuleSetupTeardownChained$1.evaluate(TestRuleSetupTeardownChained.java:49)
	at org.apache.lucene.util.AbstractBeforeAfterRule$1.evaluate(AbstractBeforeAfterRule.java:45)
	at org.apache.lucene.util.TestRuleThreadAndTestName$1.evaluate(TestRuleThreadAndTestName.java:48)
	at org.apache.lucene.util.TestRuleIgnoreAfterMaxFailures$1.evaluate(TestRuleIgnoreAfterMaxFailures.java:64)
	at org.apache.lucene.util.TestRuleMarkFailure$1.evaluate(TestRuleMarkFailure.java:47)
	at com.carrotsearch.randomizedtesting.rules.StatementAdapter.evaluate(StatementAdapter.java:36)
	at com.carrotsearch.randomizedtesting.ThreadLeakControl$StatementRunner.run(ThreadLeakControl.java:368)
	at com.carrotsearch.randomizedtesting.ThreadLeakControl.forkTimeoutingTask(ThreadLeakControl.java:817)
	at com.carrotsearch.randomizedtesting.ThreadLeakControl$3.evaluate(ThreadLeakControl.java:468)
	at com.carrotsearch.randomizedtesting.RandomizedRunner.runSingleTest(RandomizedRunner.java:944)
	at com.carrotsearch.randomizedtesting.RandomizedRunner$5.evaluate(RandomizedRunner.java:830)
	at com.carrotsearch.randomizedtesting.RandomizedRunner$6.evaluate(RandomizedRunner.java:880)
	at com.carrotsearch.randomizedtesting.RandomizedRunner$7.evaluate(RandomizedRunner.java:891)
	at com.carrotsearch.randomizedtesting.rules.StatementAdapter.evaluate(StatementAdapter.java:36)
	at com.carrotsearch.randomizedtesting.rules.SystemPropertiesRestoreRule$1.evaluate(SystemPropertiesRestoreRule.java:57)
	at org.apache.lucene.util.AbstractBeforeAfterRule$1.evaluate(AbstractBeforeAfterRule.java:45)
	at com.carrotsearch.randomizedtesting.rules.StatementAdapter.evaluate(StatementAdapter.java:36)
	at org.apache.lucene.util.TestRuleStoreClassName$1.evaluate(TestRuleStoreClassName.java:41)
	at com.carrotsearch.randomizedtesting.rules.NoShadowingOrOverridesOnMethodsRule$1.evaluate(NoShadowingOrOverridesOnMethodsRule.java:40)
	at com.carrotsearch.randomizedtesting.rules.NoShadowingOrOverridesOnMethodsRule$1.evaluate(NoShadowingOrOverridesOnMethodsRule.java:40)
	at com.carrotsearch.randomizedtesting.rules.StatementAdapter.evaluate(StatementAdapter.java:36)
	at com.carrotsearch.randomizedtesting.rules.StatementAdapter.evaluate(StatementAdapter.java:36)
	at org.apache.lucene.util.TestRuleAssertionsRequired$1.evaluate(TestRuleAssertionsRequired.java:53)
	at org.apache.lucene.util.TestRuleMarkFailure$1.evaluate(TestRuleMarkFailure.java:47)
	at org.apache.lucene.util.TestRuleIgnoreAfterMaxFailures$1.evaluate(TestRuleIgnoreAfterMaxFailures.java:64)
	at org.apache.lucene.util.TestRuleIgnoreTestSuites$1.evaluate(TestRuleIgnoreTestSuites.java:54)
	at com.carrotsearch.randomizedtesting.rules.StatementAdapter.evaluate(StatementAdapter.java:36)
	at com.carrotsearch.randomizedtesting.ThreadLeakControl$StatementRunner.run(ThreadLeakControl.java:368)
	at java.base/java.lang.Thread.run(Thread.java:844)
Caused by: java.util.concurrent.TimeoutException: last ClusterState: znodeVersion: 21
live nodes:[127.0.0.1:10001_solr, 127.0.0.1:10004_solr, 127.0.0.1:10000_solr, 127.0.0.1:10002_solr, 127.0.0.1:10003_solr]
collections:{testCreateCollectionAddReplica=DocCollection(testCreateCollectionAddReplica//clusterstate.json/20)={
  "replicationFactor":"1",
  "pullReplicas":"0",
  "router":{"name":"compositeId"},
  "maxShardsPerNode":"1",
  "autoAddReplicas":"false",
  "nrtReplicas":"1",
  "tlogReplicas":"0",
  "autoCreated":"true",
  "policy":"c1",
  "shards":{"shard1":{
      "replicas":{"core_node1":{
          "core":"testCreateCollectionAddReplica_shard1_replica_n1",
          "SEARCHER.searcher.maxDoc":0,
          "SEARCHER.searcher.deletedDocs":0,
          "INDEX.sizeInBytes":10240,
          "node_name":"127.0.0.1:10001_solr",
          "state":"active",
          "type":"NRT",
          "INDEX.sizeInGB":9.5367431640625E-6,
          "SEARCHER.searcher.numDocs":0}},
      "range":"80000000-7fffffff",
      "state":"active"}}}}, last coll state: DocCollection(testCreateCollectionAddReplica//clusterstate.json/20)={
  "replicationFactor":"1",
  "pullReplicas":"0",
  "router":{"name":"compositeId"},
  "maxShardsPerNode":"1",
  "autoAddReplicas":"false",
  "nrtReplicas":"1",
  "tlogReplicas":"0",
  "autoCreated":"true",
  "policy":"c1",
  "shards":{"shard1":{
      "replicas":{"core_node1":{
          "core":"testCreateCollectionAddReplica_shard1_replica_n1",
          "SEARCHER.searcher.maxDoc":0,
          "SEARCHER.searcher.deletedDocs":0,
          "INDEX.sizeInBytes":10240,
          "node_name":"127.0.0.1:10001_solr",
          "state":"active",
          "type":"NRT",
          "INDEX.sizeInGB":9.5367431640625E-6,
          "SEARCHER.searcher.numDocs":0}},
      "range":"80000000-7fffffff",
      "state":"active"}}}
	at org.apache.solr.cloud.CloudTestUtils.waitForState(CloudTestUtils.java:112)
	at org.apache.solr.cloud.CloudTestUtils.waitForState(CloudTestUtils.java:64)
	... 40 more




Build Log:
[...truncated 13122 lines...]
   [junit4] Suite: org.apache.solr.cloud.autoscaling.sim.TestSimPolicyCloud
   [junit4]   2> 608487 INFO  (SUITE-TestSimPolicyCloud-seed#[ACA94112DC23343A]-worker) [    ] o.a.s.SolrTestCaseJ4 SecureRandom sanity checks: test.solr.allowed.securerandom=null & java.security.egd=file:/dev/./urandom
   [junit4]   2> Creating dataDir: /Users/jenkins/workspace/Lucene-Solr-master-MacOSX/solr/build/solr-core/test/J1/temp/solr.cloud.autoscaling.sim.TestSimPolicyCloud_ACA94112DC23343A-001/init-core-data-001
   [junit4]   2> 608488 WARN  (SUITE-TestSimPolicyCloud-seed#[ACA94112DC23343A]-worker) [    ] o.a.s.SolrTestCaseJ4 startTrackingSearchers: numOpens=5 numCloses=5
   [junit4]   2> 608488 INFO  (SUITE-TestSimPolicyCloud-seed#[ACA94112DC23343A]-worker) [    ] o.a.s.SolrTestCaseJ4 Using PointFields (NUMERIC_POINTS_SYSPROP=true) w/NUMERIC_DOCVALUES_SYSPROP=true
   [junit4]   2> 608489 INFO  (SUITE-TestSimPolicyCloud-seed#[ACA94112DC23343A]-worker) [    ] o.a.s.SolrTestCaseJ4 Randomized ssl (false) and clientAuth (false) via: @org.apache.solr.util.RandomizeSSL(reason="", value=0.0/0.0, ssl=0.0/0.0, clientAuth=0.0/0.0) w/ MAC_OS_X supressed clientAuth
   [junit4]   2> 608491 DEBUG (SUITE-TestSimPolicyCloud-seed#[ACA94112DC23343A]-worker) [    ] o.a.s.c.a.s.SimClusterStateProvider --- new Overseer leader: 127.0.0.1:10000_solr
   [junit4]   2> 608491 DEBUG (Simulated OverseerAutoScalingTriggerThread) [    ] o.a.s.c.a.OverseerTriggerThread Adding .auto_add_replicas and .scheduled_maintenance triggers
   [junit4]   2> 608491 DEBUG (Simulated OverseerAutoScalingTriggerThread) [    ] o.a.s.c.a.OverseerTriggerThread Refreshing /autoscaling.json with znode version 0
   [junit4]   2> 608491 DEBUG (SUITE-TestSimPolicyCloud-seed#[ACA94112DC23343A]-worker) [    ] o.a.s.c.a.s.SimClusterStateProvider ** creating new collection states, currentVersion=0
   [junit4]   2> 608491 DEBUG (SUITE-TestSimPolicyCloud-seed#[ACA94112DC23343A]-worker) [    ] o.a.s.c.a.s.SimClusterStateProvider ** saved cluster state version 0
   [junit4]   2> 608491 INFO  (SUITE-TestSimPolicyCloud-seed#[ACA94112DC23343A]-worker) [    ] o.a.s.h.a.MetricsHistoryHandler No .system collection, keeping metrics history in memory.
   [junit4]   2> 608492 DEBUG (Simulated OverseerAutoScalingTriggerThread) [    ] o.a.s.c.a.OverseerTriggerThread Current znodeVersion 0, lastZnodeVersion -1
   [junit4]   2> 608492 DEBUG (Simulated OverseerAutoScalingTriggerThread) [    ] o.a.s.c.a.OverseerTriggerThread Processed trigger updates upto znodeVersion 0
   [junit4]   2> 608492 DEBUG (Simulated OverseerAutoScalingTriggerThread) [    ] o.a.s.c.a.NodeLostTrigger NodeLostTrigger .auto_add_replicas - Initial livenodes: [127.0.0.1:10001_solr, 127.0.0.1:10004_solr, 127.0.0.1:10000_solr, 127.0.0.1:10002_solr, 127.0.0.1:10003_solr]
   [junit4]   2> 608492 DEBUG (Simulated OverseerAutoScalingTriggerThread) [    ] o.a.s.c.a.OverseerTriggerThread -- clean old nodeAdded markers
   [junit4]   2> 608492 DEBUG (Simulated OverseerAutoScalingTriggerThread) [    ] o.a.s.c.a.OverseerTriggerThread Current znodeVersion 0, lastZnodeVersion 0
   [junit4]   2> 608492 DEBUG (ScheduledTrigger-3774-thread-2) [    ] o.a.s.c.a.NodeLostTrigger Running NodeLostTrigger: .auto_add_replicas with currently live nodes: 5
   [junit4]   2> 608495 INFO  (TEST-TestSimPolicyCloud.testDataProvider-seed#[ACA94112DC23343A]) [    ] o.a.s.SolrTestCaseJ4 ###Starting testDataProvider
   [junit4]   2> 608495 DEBUG (TEST-TestSimPolicyCloud.testDataProvider-seed#[ACA94112DC23343A]) [    ] o.a.s.c.a.OverseerTriggerThread Refreshing /autoscaling.json with znode version 1
   [junit4]   2> 608495 DEBUG (Simulated OverseerAutoScalingTriggerThread) [    ] o.a.s.c.a.OverseerTriggerThread Processed trigger updates upto znodeVersion 1
   [junit4]   2> 608495 DEBUG (Simulated OverseerAutoScalingTriggerThread) [    ] o.a.s.c.a.OverseerTriggerThread -- clean old nodeLost markers
   [junit4]   2> 608496 INFO  (TEST-TestSimPolicyCloud.testDataProvider-seed#[ACA94112DC23343A]) [    ] o.a.s.c.a.s.SimCloudManager === Restarting OverseerTriggerThread and clearing object cache...
   [junit4]   2> 608496 DEBUG (Simulated OverseerAutoScalingTriggerThread) [    ] o.a.s.c.a.OverseerTriggerThread -- clean old nodeAdded markers
   [junit4]   2> 608496 DEBUG (TEST-TestSimPolicyCloud.testDataProvider-seed#[ACA94112DC23343A]) [    ] o.a.s.c.a.ScheduledTriggers Shutting down scheduled thread pool executor now
   [junit4]   2> 608497 DEBUG (TEST-TestSimPolicyCloud.testDataProvider-seed#[ACA94112DC23343A]) [    ] o.a.s.c.a.ScheduledTriggers Shutting down action executor now
   [junit4]   2> 608497 DEBUG (TEST-TestSimPolicyCloud.testDataProvider-seed#[ACA94112DC23343A]) [    ] o.a.s.c.a.ScheduledTriggers Awaiting termination for action executor
   [junit4]   2> 608497 DEBUG (TEST-TestSimPolicyCloud.testDataProvider-seed#[ACA94112DC23343A]) [    ] o.a.s.c.a.ScheduledTriggers Awaiting termination for scheduled thread pool executor
   [junit4]   2> 608496 WARN  (Simulated OverseerAutoScalingTriggerThread) [    ] o.a.s.c.a.OverseerTriggerThread Interrupted
   [junit4]   2> java.lang.InterruptedException: null
   [junit4]   2> 	at java.util.concurrent.locks.AbstractQueuedSynchronizer.acquireInterruptibly(AbstractQueuedSynchronizer.java:1247) ~[?:?]
   [junit4]   2> 	at java.util.concurrent.locks.ReentrantLock.lockInterruptibly(ReentrantLock.java:317) ~[?:?]
   [junit4]   2> 	at org.apache.solr.cloud.autoscaling.OverseerTriggerThread.run(OverseerTriggerThread.java:177) [java/:?]
   [junit4]   2> 	at java.lang.Thread.run(Thread.java:844) [?:?]
   [junit4]   2> 608497 DEBUG (TEST-TestSimPolicyCloud.testDataProvider-seed#[ACA94112DC23343A]) [    ] o.a.s.c.a.ScheduledTriggers ScheduledTriggers closed completely
   [junit4]   2> 608497 DEBUG (TEST-TestSimPolicyCloud.testDataProvider-seed#[ACA94112DC23343A]) [    ] o.a.s.c.a.OverseerTriggerThread OverseerTriggerThread has been closed explicitly
   [junit4]   2> 608498 DEBUG (Simulated OverseerAutoScalingTriggerThread) [    ] o.a.s.c.a.OverseerTriggerThread Adding .auto_add_replicas and .scheduled_maintenance triggers
   [junit4]   2> 608498 DEBUG (Simulated OverseerAutoScalingTriggerThread) [    ] o.a.s.c.a.OverseerTriggerThread Refreshing /autoscaling.json with znode version 2
   [junit4]   2> 608498 DEBUG (Simulated OverseerAutoScalingTriggerThread) [    ] o.a.s.c.a.OverseerTriggerThread Current znodeVersion 2, lastZnodeVersion -1
   [junit4]   2> 608498 DEBUG (Simulated OverseerAutoScalingTriggerThread) [    ] o.a.s.c.a.OverseerTriggerThread Processed trigger updates upto znodeVersion 2
   [junit4]   2> 608498 DEBUG (Simulated OverseerAutoScalingTriggerThread) [    ] o.a.s.c.a.NodeLostTrigger NodeLostTrigger .auto_add_replicas - Initial livenodes: [127.0.0.1:10001_solr, 127.0.0.1:10004_solr, 127.0.0.1:10000_solr, 127.0.0.1:10002_solr, 127.0.0.1:10003_solr]
   [junit4]   2> 608498 DEBUG (Simulated OverseerAutoScalingTriggerThread) [    ] o.a.s.c.a.OverseerTriggerThread -- clean old nodeAdded markers
   [junit4]   2> 608498 DEBUG (Simulated OverseerAutoScalingTriggerThread) [    ] o.a.s.c.a.OverseerTriggerThread Current znodeVersion 2, lastZnodeVersion 2
   [junit4]   2> 608499 DEBUG (ScheduledTrigger-3779-thread-2) [    ] o.a.s.c.a.NodeLostTrigger Running NodeLostTrigger: .auto_add_replicas with currently live nodes: 5
   [junit4]   2> 608524 DEBUG (ScheduledTrigger-3779-thread-3) [    ] o.a.s.c.a.NodeLostTrigger Running NodeLostTrigger: .auto_add_replicas with currently live nodes: 5
   [junit4]   2> 608551 DEBUG (ScheduledTrigger-3779-thread-4) [    ] o.a.s.c.a.NodeLostTrigger Running NodeLostTrigger: .auto_add_replicas with currently live nodes: 5
   [junit4]   2> 608572 DEBUG (ScheduledTrigger-3779-thread-3) [    ] o.a.s.c.a.NodeLostTrigger Running NodeLostTrigger: .auto_add_replicas with currently live nodes: 5
   [junit4]   2> 608593 DEBUG (ScheduledTrigger-3779-thread-4) [    ] o.a.s.c.a.NodeLostTrigger Running NodeLostTrigger: .auto_add_replicas with currently live nodes: 5
   [junit4]   2> 608618 DEBUG (ScheduledTrigger-3779-thread-3) [    ] o.a.s.c.a.NodeLostTrigger Running NodeLostTrigger: .auto_add_replicas with currently live nodes: 5
   [junit4]   2> 608639 DEBUG (ScheduledTrigger-3779-thread-1) [    ] o.a.s.c.a.NodeLostTrigger Running NodeLostTrigger: .auto_add_replicas with currently live nodes: 5
   [junit4]   2> 608665 DEBUG (ScheduledTrigger-3779-thread-3) [    ] o.a.s.c.a.NodeLostTrigger Running NodeLostTrigger: .auto_add_replicas with currently live nodes: 5
   [junit4]   2> 608695 DEBUG (ScheduledTrigger-3779-thread-2) [    ] o.a.s.c.a.NodeLostTrigger Running NodeLostTrigger: .auto_add_replicas with currently live nodes: 5
   [junit4]   2> 608700 DEBUG (simCloudManagerPool-3778-thread-1) [    ] o.a.s.c.a.s.SimClusterStateProvider -- simCreateCollection policiesTest, currentVersion=1
   [junit4]   2> 608701 DEBUG (simCloudManagerPool-3778-thread-1) [    ] o.a.s.c.a.s.SimClusterStateProvider ** creating new collection states, currentVersion=1
   [junit4]   2> 608701 DEBUG (simCloudManagerPool-3778-thread-1) [    ] o.a.s.c.a.s.SimClusterStateProvider ** saved cluster state version 1
   [junit4]   2> 608718 DEBUG (simCloudManagerPool-3778-thread-1) [    ] o.a.s.c.a.s.SimClusterStateProvider ** creating new collection states, currentVersion=2
   [junit4]   2> 608718 DEBUG (simCloudManagerPool-3778-thread-1) [    ] o.a.s.c.a.s.SimClusterStateProvider ** saved cluster state version 2
   [junit4]   2> 608720 DEBUG (ScheduledTrigger-3779-thread-1) [    ] o.a.s.c.a.NodeLostTrigger Running NodeLostTrigger: .auto_add_replicas with currently live nodes: 5
   [junit4]   2> 608721 DEBUG (simCloudManagerPool-3778-thread-1) [    ] o.a.s.c.a.s.SimClusterStateProvider -- finished createCollection policiesTest, currentVersion=3
   [junit4]   2> 608734 DEBUG (simCloudManagerPool-3778-thread-2) [    ] o.a.s.c.a.s.SimClusterStateProvider ** creating new collection states, currentVersion=3
   [junit4]   2> 608735 DEBUG (simCloudManagerPool-3778-thread-2) [    ] o.a.s.c.a.s.SimClusterStateProvider ** saved cluster state version 3
   [junit4]   2> 608736 DEBUG (simCloudManagerPool-3778-thread-4) [    ] o.a.s.c.a.s.SimClusterStateProvider -- elected new leader for policiesTest / shard1 (currentVersion=4): {"core_node1":{
   [junit4]   2>     "core":"policiesTest_shard1_replica_n1",
   [junit4]   2>     "shard":"shard1",
   [junit4]   2>     "collection":"policiesTest",
   [junit4]   2>     "node_name":"127.0.0.1:10003_solr",
   [junit4]   2>     "type":"NRT",
   [junit4]   2>     "leader":"true",
   [junit4]   2>     "SEARCHER.searcher.maxDoc":0,
   [junit4]   2>     "SEARCHER.searcher.deletedDocs":0,
   [junit4]   2>     "INDEX.sizeInBytes":10240,
   [junit4]   2>     "state":"active",
   [junit4]   2>     "INDEX.sizeInGB":9.5367431640625E-6,
   [junit4]   2>     "SEARCHER.searcher.numDocs":0}}
   [junit4]   2> 608751 DEBUG (simCloudManagerPool-3778-thread-3) [    ] o.a.s.c.a.s.SimClusterStateProvider ** creating new collection states, currentVersion=4
   [junit4]   2> 608751 DEBUG (ScheduledTrigger-3779-thread-2) [    ] o.a.s.c.a.NodeLostTrigger Running NodeLostTrigger: .auto_add_replicas with currently live nodes: 5
   [junit4]   2> 608752 DEBUG (simCloudManagerPool-3778-thread-3) [    ] o.a.s.c.a.s.SimClusterStateProvider ** saved cluster state version 4
   [junit4]   2> 608752 DEBUG (TEST-TestSimPolicyCloud.testDataProvider-seed#[ACA94112DC23343A]) [    ] o.a.s.c.a.s.SimClusterStateProvider ** creating new collection states, currentVersion=5
   [junit4]   2> 608752 DEBUG (TEST-TestSimPolicyCloud.testDataProvider-seed#[ACA94112DC23343A]) [    ] o.a.s.c.a.s.SimClusterStateProvider ** saved cluster state version 5
   [junit4]   2> 608773 DEBUG (ScheduledTrigger-3779-thread-4) [    ] o.a.s.c.a.NodeLostTrigger Running NodeLostTrigger: .auto_add_replicas with currently live nodes: 5
   [junit4]   2> 608786 INFO  (TEST-TestSimPolicyCloud.testDataProvider-seed#[ACA94112DC23343A]) [    ] o.a.s.SolrTestCaseJ4 ###Ending testDataProvider
   [junit4]   2> 608787 DEBUG (TEST-TestSimPolicyCloud.testDataProvider-seed#[ACA94112DC23343A]) [    ] o.a.s.c.a.s.SimClusterStateProvider ** creating new collection states, currentVersion=6
   [junit4]   2> 608787 DEBUG (TEST-TestSimPolicyCloud.testDataProvider-seed#[ACA94112DC23343A]) [    ] o.a.s.c.a.s.SimClusterStateProvider ** saved cluster state version 6
   [junit4]   2> 608794 DEBUG (ScheduledTrigger-3779-thread-1) [    ] o.a.s.c.a.NodeLostTrigger Running NodeLostTrigger: .auto_add_replicas with currently live nodes: 5
   [junit4]   2> 608815 DEBUG (ScheduledTrigger-3779-thread-4) [    ] o.a.s.c.a.NodeLostTrigger Running NodeLostTrigger: .auto_add_replicas with currently live nodes: 5
   [junit4]   2> 608829 INFO  (TEST-TestSimPolicyCloud.testDataProvider-seed#[ACA94112DC23343A]) [    ] o.a.s.c.a.s.SimSolrCloudTestCase #######################################
   [junit4]   2> ############ CLUSTER STATE ############
   [junit4]   2> #######################################
   [junit4]   2> ## Live nodes:		5
   [junit4]   2> ## Empty nodes:	3
   [junit4]   2> ## Dead nodes:		0
   [junit4]   2> ## Collections:
   [junit4]   2> ##  * policiesTest
   [junit4]   2> ##    shardsTotal	1
   [junit4]   2> ##    shardsState	{active=1}
   [junit4]   2> ##      shardsWithoutLeader	0
   [junit4]   2> ##    totalReplicas	2
   [junit4]   2> ##      activeReplicas	2
   [junit4]   2> ##      inactiveReplicas	0
   [junit4]   2> ##    totalActiveDocs	0
   [junit4]   2> ##      bufferedDocs	0
   [junit4]   2> ##      maxActiveSliceDocs	0
   [junit4]   2> ##      minActiveSliceDocs	0
   [junit4]   2> ##      avgActiveSliceDocs	0
   [junit4]   2> ##    totalInactiveDocs	0
   [junit4]   2> ##      maxInactiveSliceDocs	0
   [junit4]   2> ##      minInactiveSliceDocs	0
   [junit4]   2> ##      avgInactiveSliceDocs	NaN
   [junit4]   2> ##    totalActiveBytes	10,240
   [junit4]   2> ##      maxActiveSliceBytes	10,240
   [junit4]   2> ##      minActiveSliceBytes	10,240
   [junit4]   2> ##      avgActiveSliceBytes	10,240
   [junit4]   2> ##    totalInactiveBytes	0
   [junit4]   2> ##      maxInactiveSliceBytes	0
   [junit4]   2> ##      minInactiveSliceBytes	0
   [junit4]   2> ##      avgInactiveSliceBytes	NaN
   [junit4]   2> ##    totalActiveDeletedDocs	0
   [junit4]   2> ## Max replicas per node:	1
   [junit4]   2> ## Min replicas per node:	0
   [junit4]   2> ## Total replicas:		2
   [junit4]   2> ## * policiesTest		2
   [junit4]   2> ##		- active           2
   [junit4]   2> ######### Solr op counts ##########
   [junit4]   2> ##		- ADDROLE            1
   [junit4]   2> ##		- CREATE             1
   [junit4]   2> ######### Autoscaling event counts ###########
   [junit4]   2> 
   [junit4] IGNOR/A 0.00s J1 | TestSimPolicyCloud.testCreateCollectionAddShardUsingPolicy
   [junit4]    > Assumption #1: 'badapple' test group is disabled (@BadApple(bugUrl="https://issues.apache.org/jira/browse/SOLR-12028"))
   [junit4]   2> 608833 INFO  (TEST-TestSimPolicyCloud.testDataProviderPerReplicaDetails-seed#[ACA94112DC23343A]) [    ] o.a.s.SolrTestCaseJ4 ###Starting testDataProviderPerReplicaDetails
   [junit4]   2> 608833 DEBUG (TEST-TestSimPolicyCloud.testDataProviderPerReplicaDetails-seed#[ACA94112DC23343A]) [    ] o.a.s.c.a.OverseerTriggerThread Refreshing /autoscaling.json with znode version 3
   [junit4]   2> 608833 DEBUG (Simulated OverseerAutoScalingTriggerThread) [    ] o.a.s.c.a.OverseerTriggerThread Processed trigger updates upto znodeVersion 3
   [junit4]   2> 608833 INFO  (TEST-TestSimPolicyCloud.testDataProviderPerReplicaDetails-seed#[ACA94112DC23343A]) [    ] o.a.s.c.a.s.SimCloudManager === Restarting OverseerTriggerThread and clearing object cache...
   [junit4]   2> 608834 DEBUG (Simulated OverseerAutoScalingTriggerThread) [    ] o.a.s.c.a.OverseerTriggerThread -- clean old nodeLost markers
   [junit4]   2> 608834 DEBUG (Simulated OverseerAutoScalingTriggerThread) [    ] o.a.s.c.a.OverseerTriggerThread -- clean old nodeAdded markers
   [junit4]   2> 608834 DEBUG (TEST-TestSimPolicyCloud.testDataProviderPerReplicaDetails-seed#[ACA94112DC23343A]) [    ] o.a.s.c.a.ScheduledTriggers Shutting down scheduled thread pool executor now
   [junit4]   2> 608834 DEBUG (TEST-TestSimPolicyCloud.testDataProviderPerReplicaDetails-seed#[ACA94112DC23343A]) [    ] o.a.s.c.a.ScheduledTriggers Shutting down action executor now
   [junit4]   2> 608834 WARN  (Simulated OverseerAutoScalingTriggerThread) [    ] o.a.s.c.a.OverseerTriggerThread Interrupted
   [junit4]   2> java.lang.InterruptedException: null
   [junit4]   2> 	at java.util.concurrent.locks.AbstractQueuedSynchronizer.acquireInterruptibly(AbstractQueuedSynchronizer.java:1247) ~[?:?]
   [junit4]   2> 	at java.util.concurrent.locks.ReentrantLock.lockInterruptibly(ReentrantLock.java:317) ~[?:?]
   [junit4]   2> 	at org.apache.solr.cloud.autoscaling.OverseerTriggerThread.run(OverseerTriggerThread.java:177) [java/:?]
   [junit4]   2> 	at java.lang.Thread.run(Thread.java:844) [?:?]
   [junit4]   2> 608834 DEBUG (TEST-TestSimPolicyCloud.testDataProviderPerReplicaDetails-seed#[ACA94112DC23343A]) [    ] o.a.s.c.a.ScheduledTriggers Awaiting termination for action executor
   [junit4]   2> 608834 DEBUG (TEST-TestSimPolicyCloud.testDataProviderPerReplicaDetails-seed#[ACA94112DC23343A]) [    ] o.a.s.c.a.ScheduledTriggers Awaiting termination for scheduled thread pool executor
   [junit4]   2> 608834 DEBUG (TEST-TestSimPolicyCloud.testDataProviderPerReplicaDetails-seed#[ACA94112DC23343A]) [    ] o.a.s.c.a.ScheduledTriggers ScheduledTriggers closed completely
   [junit4]   2> 608834 DEBUG (TEST-TestSimPolicyCloud.testDataProviderPerReplicaDetails-seed#[ACA94112DC23343A]) [    ] o.a.s.c.a.OverseerTriggerThread OverseerTriggerThread has been closed explicitly
   [junit4]   2> 608835 DEBUG (Simulated OverseerAutoScalingTriggerThread) [    ] o.a.s.c.a.OverseerTriggerThread Adding .auto_add_replicas and .scheduled_maintenance triggers
   [junit4]   2> 608836 DEBUG (Simulated OverseerAutoScalingTriggerThread) [    ] o.a.s.c.a.OverseerTriggerThread Refreshing /autoscaling.json with znode version 4
   [junit4]   2> 608836 DEBUG (Simulated OverseerAutoScalingTriggerThread) [    ] o.a.s.c.a.OverseerTriggerThread Current znodeVersion 4, lastZnodeVersion -1
   [junit4]   2> 608836 DEBUG (Simulated OverseerAutoScalingTriggerThread) [    ] o.a.s.c.a.OverseerTriggerThread Processed trigger updates upto znodeVersion 4
   [junit4]   2> 608836 DEBUG (Simulated OverseerAutoScalingTriggerThread) [    ] o.a.s.c.a.NodeLostTrigger NodeLostTrigger .auto_add_replicas - Initial livenodes: [127.0.0.1:10001_solr, 127.0.0.1:10004_solr, 127.0.0.1:10000_solr, 127.0.0.1:10002_solr, 127.0.0.1:10003_solr]
   [junit4]   2> 608836 DEBUG (Simulated OverseerAutoScalingTriggerThread) [    ] o.a.s.c.a.OverseerTriggerThread -- clean old nodeAdded markers
   [junit4]   2> 608837 DEBUG (Simulated OverseerAutoScalingTriggerThread) [    ] o.a.s.c.a.OverseerTriggerThread Current znodeVersion 4, lastZnodeVersion 4
   [junit4]   2> 608837 DEBUG (ScheduledTrigger-3782-thread-2) [    ] o.a.s.c.a.NodeLostTrigger Running NodeLostTrigger: .auto_add_replicas with currently live nodes: 5
   [junit4]   2> 608857 DEBUG (ScheduledTrigger-3782-thread-2) [    ] o.a.s.c.a.NodeLostTrigger Running NodeLostTrigger: .auto_add_replicas with currently live nodes: 5
   [junit4]   2> 608887 DEBUG (ScheduledTrigger-3782-thread-2) [    ] o.a.s.c.a.NodeLostTrigger Running NodeLostTrigger: .auto_add_replicas with currently live nodes: 5
   [junit4]   2> 608917 DEBUG (ScheduledTrigger-3782-thread-2) [    ] o.a.s.c.a.NodeLostTrigger Running NodeLostTrigger: .auto_add_replicas with currently live nodes: 5
   [junit4]   2> 608947 DEBUG (ScheduledTrigger-3782-thread-4) [    ] o.a.s.c.a.NodeLostTrigger Running NodeLostTrigger: .auto_add_replicas with currently live nodes: 5
   [junit4]   2> 608977 DEBUG (ScheduledTrigger-3782-thread-3) [    ] o.a.s.c.a.NodeLostTrigger Running NodeLostTrigger: .auto_add_replicas with currently live nodes: 5
   [junit4]   2> 609011 DEBUG (ScheduledTrigger-3782-thread-4) [    ] o.a.s.c.a.NodeLostTrigger Running NodeLostTrigger: .auto_add_replicas with currently live nodes: 5
   [junit4]   2> 609037 DEBUG (ScheduledTrigger-3782-thread-2) [    ] o.a.s.c.a.NodeLostTrigger Running NodeLostTrigger: .auto_add_replicas with currently live nodes: 5
   [junit4]   2> 609038 DEBUG (simCloudManagerPool-3781-thread-1) [    ] o.a.s.c.a.s.SimClusterStateProvider -- simCreateCollection perReplicaDataColl, currentVersion=7
   [junit4]   2> 609038 DEBUG (simCloudManagerPool-3781-thread-1) [    ] o.a.s.c.a.s.SimClusterStateProvider ** creating new collection states, currentVersion=7
   [junit4]   2> 609038 DEBUG (simCloudManagerPool-3781-thread-1) [    ] o.a.s.c.a.s.SimClusterStateProvider ** saved cluster state version 7
   [junit4]   2> 609053 DEBUG (simCloudManagerPool-3781-thread-1) [    ] o.a.s.c.a.s.SimClusterStateProvider ** creating new collection states, currentVersion=8
   [junit4]   2> 609053 DEBUG (simCloudManagerPool-3781-thread-1) [    ] o.a.s.c.a.s.SimClusterStateProvider ** saved cluster state version 8
   [junit4]   2> 609056 DEBUG (simCloudManagerPool-3781-thread-1) [    ] o.a.s.c.a.s.SimClusterStateProvider -- finished createCollection perReplicaDataColl, currentVersion=9
   [junit4]   2> 609067 DEBUG (simCloudManagerPool-3781-thread-2) [    ] o.a.s.c.a.s.SimClusterStateProvider ** creating new collection states, currentVersion=9
   [junit4]   2> 609067 DEBUG (ScheduledTrigger-3782-thread-4) [    ] o.a.s.c.a.NodeLostTrigger Running NodeLostTrigger: .auto_add_replicas with currently live nodes: 5
   [junit4]   2> 609067 DEBUG (simCloudManagerPool-3781-thread-2) [    ] o.a.s.c.a.s.SimClusterStateProvider ** saved cluster state version 9
   [junit4]   2> 609068 DEBUG (simCloudManagerPool-3781-thread-7) [    ] o.a.s.c.a.s.SimClusterStateProvider -- elected new leader for perReplicaDataColl / shard1 (currentVersion=10): {"core_node1":{
   [junit4]   2>     "core":"perReplicaDataColl_shard1_replica_n1",
   [junit4]   2>     "shard":"shard1",
   [junit4]   2>     "collection":"perReplicaDataColl",
   [junit4]   2>     "node_name":"127.0.0.1:10003_solr",
   [junit4]   2>     "type":"NRT",
   [junit4]   2>     "leader":"true",
   [junit4]   2>     "SEARCHER.searcher.maxDoc":0,
   [junit4]   2>     "SEARCHER.searcher.deletedDocs":0,
   [junit4]   2>     "INDEX.sizeInBytes":10240,
   [junit4]   2>     "state":"active",
   [junit4]   2>     "INDEX.sizeInGB":9.5367431640625E-6,
   [junit4]   2>     "SEARCHER.searcher.numDocs":0}}
   [junit4]   2> 609082 DEBUG (simCloudManagerPool-3781-thread-3) [    ] o.a.s.c.a.s.SimClusterStateProvider ** creating new collection states, currentVersion=10
   [junit4]   2> 609082 DEBUG (simCloudManagerPool-3781-thread-3) [    ] o.a.s.c.a.s.SimClusterStateProvider ** saved cluster state version 10
   [junit4]   2> 609097 DEBUG (ScheduledTrigger-3782-thread-3) [    ] o.a.s.c.a.NodeLostTrigger Running NodeLostTrigger: .auto_add_replicas with currently live nodes: 5
   [junit4]   2> 609097 DEBUG (simCloudManagerPool-3781-thread-4) [    ] o.a.s.c.a.s.SimClusterStateProvider ** creating new collection states, currentVersion=11
   [junit4]   2> 609097 DEBUG (simCloudManagerPool-3781-thread-4) [    ] o.a.s.c.a.s.SimClusterStateProvider ** saved cluster state version 11
   [junit4]   2> 609113 DEBUG (simCloudManagerPool-3781-thread-5) [    ] o.a.s.c.a.s.SimClusterStateProvider ** creating new collection states, currentVersion=12
   [junit4]   2> 609113 DEBUG (simCloudManagerPool-3781-thread-5) [    ] o.a.s.c.a.s.SimClusterStateProvider ** saved cluster state version 12
   [junit4]   2> 609113 DEBUG (TEST-TestSimPolicyCloud.testDataProviderPerReplicaDetails-seed#[ACA94112DC23343A]) [    ] o.a.s.c.a.s.SimClusterStateProvider ** creating new collection states, currentVersion=13
   [junit4]   2> 609114 DEBUG (TEST-TestSimPolicyCloud.testDataProviderPerReplicaDetails-seed#[ACA94112DC23343A]) [    ] o.a.s.c.a.s.SimClusterStateProvider ** saved cluster state version 13
   [junit4]   2> 609119 DEBUG (ScheduledTrigger-3782-thread-4) [    ] o.a.s.c.a.NodeLostTrigger Running NodeLostTrigger: .auto_add_replicas with currently live nodes: 5
   [junit4]   2> 609129 DEBUG (simCloudManagerPool-3781-thread-6) [    ] o.a.s.c.a.s.SimClusterStateProvider ** creating new collection states, currentVersion=14
   [junit4]   2> 609129 DEBUG (simCloudManagerPool-3781-thread-6) [    ] o.a.s.c.a.s.SimClusterStateProvider ** saved cluster state version 14
   [junit4]   2> 609139 DEBUG (ScheduledTrigger-3782-thread-2) [    ] o.a.s.c.a.NodeLostTrigger Running NodeLostTrigger: .auto_add_replicas with currently live nodes: 5
   [junit4]   2> 609170 DEBUG (ScheduledTrigger-3782-thread-3) [    ] o.a.s.c.a.NodeLostTrigger Running NodeLostTrigger: .auto_add_replicas with currently live nodes: 5
   [junit4]   2> 609192 DEBUG (ScheduledTrigger-3782-thread-1) [    ] o.a.s.c.a.NodeLostTrigger Running NodeLostTrigger: .auto_add_replicas with currently live nodes: 5
   [junit4]   2> 609223 DEBUG (ScheduledTrigger-3782-thread-2) [    ] o.a.s.c.a.NodeLostTrigger Running NodeLostTrigger: .auto_add_replicas with currently live nodes: 5
   [junit4]   2> 609253 DEBUG (ScheduledTrigger-3782-thread-1) [    ] o.a.s.c.a.NodeLostTrigger Running NodeLostTrigger: .auto_add_replicas with currently live nodes: 5
   [junit4]   2> 609254 INFO  (TEST-TestSimPolicyCloud.testDataProviderPerReplicaDetails-seed#[ACA94112DC23343A]) [    ] o.a.s.SolrTestCaseJ4 ###Ending testDataProviderPerReplicaDetails
   [junit4]   2> 609254 DEBUG (TEST-TestSimPolicyCloud.testDataProviderPerReplicaDetails-seed#[ACA94112DC23343A]) [    ] o.a.s.c.a.s.SimClusterStateProvider ** creating new collection states, currentVersion=15
   [junit4]   2> 609254 DEBUG (TEST-TestSimPolicyCloud.testDataProviderPerReplicaDetails-seed#[ACA94112DC23343A]) [    ] o.a.s.c.a.s.SimClusterStateProvider ** saved cluster state version 15
   [junit4]   2> 609254 INFO  (TEST-TestSimPolicyCloud.testDataProviderPerReplicaDetails-seed#[ACA94112DC23343A]) [    ] o.a.s.c.a.s.SimSolrCloudTestCase #######################################
   [junit4]   2> ############ CLUSTER STATE ############
   [junit4]   2> #######################################
   [junit4]   2> ## Live nodes:		5
   [junit4]   2> ## Empty nodes:	5
   [junit4]   2> ## Dead nodes:		0
   [junit4]   2> ## Collections:
   [junit4]   2> ## Max replicas per node:	0
   [junit4]   2> ## Min replicas per node:	0
   [junit4]   2> ## Total replicas:		0
   [junit4]   2> ######### Solr op counts ##########
   [junit4]   2> ##		- CREATE             1
   [junit4]   2> ##		- DELETE             1
   [junit4]   2> ######### Autoscaling event counts ###########
   [junit4]   2> 
   [junit4]   2> 609257 INFO  (TEST-TestSimPolicyCloud.testCreateCollectionAddReplica-seed#[ACA94112DC23343A]) [    ] o.a.s.SolrTestCaseJ4 ###Starting testCreateCollectionAddReplica
   [junit4]   2> 609257 DEBUG (TEST-TestSimPolicyCloud.testCreateCollectionAddReplica-seed#[ACA94112DC23343A]) [    ] o.a.s.c.a.OverseerTriggerThread Refreshing /autoscaling.json with znode version 5
   [junit4]   2> 609257 DEBUG (Simulated OverseerAutoScalingTriggerThread) [    ] o.a.s.c.a.OverseerTriggerThread Processed trigger updates upto znodeVersion 5
   [junit4]   2> 609258 DEBUG (Simulated OverseerAutoScalingTriggerThread) [    ] o.a.s.c.a.OverseerTriggerThread -- clean old nodeLost markers
   [junit4]   2> 609258 INFO  (TEST-TestSimPolicyCloud.testCreateCollectionAddReplica-seed#[ACA94112DC23343A]) [    ] o.a.s.c.a.s.SimCloudManager === Restarting OverseerTriggerThread and clearing object cache...
   [junit4]   2> 609258 DEBUG (Simulated OverseerAutoScalingTriggerThread) [    ] o.a.s.c.a.OverseerTriggerThread -- clean old nodeAdded markers
   [junit4]   2> 609258 DEBUG (TEST-TestSimPolicyCloud.testCreateCollectionAddReplica-seed#[ACA94112DC23343A]) [    ] o.a.s.c.a.ScheduledTriggers Shutting down scheduled thread pool executor now
   [junit4]   2> 609258 DEBUG (TEST-TestSimPolicyCloud.testCreateCollectionAddReplica-seed#[ACA94112DC23343A]) [    ] o.a.s.c.a.ScheduledTriggers Shutting down action executor now
   [junit4]   2> 609258 DEBUG (TEST-TestSimPolicyCloud.testCreateCollectionAddReplica-seed#[ACA94112DC23343A]) [    ] o.a.s.c.a.ScheduledTriggers Awaiting termination for action executor
   [junit4]   2> 609258 DEBUG (TEST-TestSimPolicyCloud.testCreateCollectionAddReplica-seed#[ACA94112DC23343A]) [    ] o.a.s.c.a.ScheduledTriggers Awaiting termination for scheduled thread pool executor
   [junit4]   2> 609258 WARN  (Simulated OverseerAutoScalingTriggerThread) [    ] o.a.s.c.a.OverseerTriggerThread Interrupted
   [junit4]   2> java.lang.InterruptedException: null
   [junit4]   2> 	at java.util.concurrent.locks.AbstractQueuedSynchronizer.acquireInterruptibly(AbstractQueuedSynchronizer.java:1247) ~[?:?]
   [junit4]   2> 	at java.util.concurrent.locks.ReentrantLock.lockInterruptibly(ReentrantLock.java:317) ~[?:?]
   [junit4]   2> 	at org.apache.solr.cloud.autoscaling.OverseerTriggerThread.run(OverseerTriggerThread.java:177) [java/:?]
   [junit4]   2> 	at java.lang.Thread.run(Thread.java:844) [?:?]
   [junit4]   2> 609259 DEBUG (TEST-TestSimPolicyCloud.testCreateCollectionAddReplica-seed#[ACA94112DC23343A]) [    ] o.a.s.c.a.ScheduledTriggers ScheduledTriggers closed completely
   [junit4]   2> 609259 DEBUG (TEST-TestSimPolicyCloud.testCreateCollectionAddReplica-seed#[ACA94112DC23343A]) [    ] o.a.s.c.a.OverseerTriggerThread OverseerTriggerThread has been closed explicitly
   [junit4]   2> 609260 DEBUG (Simulated OverseerAutoScalingTriggerThread) [    ] o.a.s.c.a.OverseerTriggerThread Adding .auto_add_replicas and .scheduled_maintenance triggers
   [junit4]   2> 609260 DEBUG (Simulated OverseerAutoScalingTriggerThread) [    ] o.a.s.c.a.OverseerTriggerThread Refreshing /autoscaling.json with znode version 6
   [junit4]   2> 609260 DEBUG (Simulated OverseerAutoScalingTriggerThread) [    ] o.a.s.c.a.OverseerTriggerThread Current znodeVersion 6, lastZnodeVersion -1
   [junit4]   2> 609260 DEBUG (Simulated OverseerAutoScalingTriggerThread) [    ] o.a.s.c.a.OverseerTriggerThread Processed trigger updates upto znodeVersion 6
   [junit4]   2> 609260 DEBUG (Simulated OverseerAutoScalingTriggerThread) [    ] o.a.s.c.a.NodeLostTrigger NodeLostTrigger .auto_add_replicas - Initial livenodes: [127.0.0.1:10001_solr, 127.0.0.1:10004_solr, 127.0.0.1:10000_solr, 127.0.0.1:10002_solr, 127.0.0.1:10003_solr]
   [junit4]   2> 609260 DEBUG (Simulated OverseerAutoScalingTriggerThread) [    ] o.a.s.c.a.OverseerTriggerThread -- clean old nodeAdded markers
   [junit4]   2> 609261 DEBUG (Simulated OverseerAutoScalingTriggerThread) [    ] o.a.s.c.a.OverseerTriggerThread Current znodeVersion 6, lastZnodeVersion 6
   [junit4]   2> 609261 DEBUG (ScheduledTrigger-3785-thread-2) [    ] o.a.s.c.a.NodeLostTrigger Running NodeLostTrigger: .auto_add_replicas with currently live nodes: 5
   [junit4]   2> 609292 DEBUG (ScheduledTrigger-3785-thread-3) [    ] o.a.s.c.a.NodeLostTrigger Running NodeLostTrigger: .auto_add_replicas with currently live nodes: 5
   [junit4]   2> 609314 DEBUG (ScheduledTrigger-3785-thread-4) [    ] o.a.s.c.a.NodeLostTrigger Running NodeLostTrigger: .auto_add_replicas with currently live nodes: 5
   [junit4]   2> 609342 DEBUG (ScheduledTrigger-3785-thread-1) [    ] o.a.s.c.a.NodeLostTrigger Running NodeLostTrigger: .auto_add_replicas with currently live nodes: 5
   [junit4]   2> 609372 DEBUG (ScheduledTrigger-3785-thread-4) [    ] o.a.s.c.a.NodeLostTrigger Running NodeLostTrigger: .auto_add_replicas with currently live nodes: 5
   [junit4]   2> 609400 DEBUG (ScheduledTrigger-3785-thread-4) [    ] o.a.s.c.a.NodeLostTrigger Running NodeLostTrigger: .auto_add_replicas with currently live nodes: 5
   [junit4]   2> 609430 DEBUG (ScheduledTrigger-3785-thread-1) [    ] o.a.s.c.a.NodeLostTrigger Running NodeLostTrigger: .auto_add_replicas with currently live nodes: 5
   [junit4]   2> 609460 DEBUG (ScheduledTrigger-3785-thread-3) [    ] o.a.s.c.a.NodeLostTrigger Running NodeLostTrigger: .auto_add_replicas with currently live nodes: 5
   [junit4]   2> 609462 DEBUG (simCloudManagerPool-3784-thread-1) [    ] o.a.s.c.a.s.SimClusterStateProvider ** creating new collection states, currentVersion=16
   [junit4]   2> 609462 DEBUG (simCloudManagerPool-3784-thread-1) [    ] o.a.s.c.a.s.SimClusterStateProvider ** saved cluster state version 16
   [junit4]   2> 609462 DEBUG (simCloudManagerPool-3784-thread-1) [    ] o.a.s.c.a.AutoScalingHandler Verified autoscaling configuration
   [junit4]   2> 609463 DEBUG (simCloudManagerPool-3784-thread-1) [    ] o.a.s.c.a.OverseerTriggerThread Refreshing /autoscaling.json with znode version 7
   [junit4]   2> 609463 DEBUG (Simulated OverseerAutoScalingTriggerThread) [    ] o.a.s.c.a.OverseerTriggerThread Processed trigger updates upto znodeVersion 7
   [junit4]   2> 609463 DEBUG (Simulated OverseerAutoScalingTriggerThread) [    ] o.a.s.c.a.OverseerTriggerThread -- clean old nodeAdded markers
   [junit4]   2> 609463 DEBUG (Simulated OverseerAutoScalingTriggerThread) [    ] o.a.s.c.a.OverseerTriggerThread Current znodeVersion 7, lastZnodeVersion 7
   [junit4]   2> 609464 DEBUG (simCloudManagerPool-3784-thread-2) [    ] o.a.s.c.a.s.SimClusterStateProvider -- simCreateCollection testCreateCollectionAddReplica, currentVersion=17
   [junit4]   2> 609464 DEBUG (simCloudManagerPool-3784-thread-2) [    ] o.a.s.c.a.s.SimClusterStateProvider ** creating new collection states, currentVersion=17
   [junit4]   2> 609464 DEBUG (simCloudManagerPool-3784-thread-2) [    ] o.a.s.c.a.s.SimClusterStateProvider ** saved cluster state version 17
   [junit4]   2> 609479 DEBUG (simCloudManagerPool-3784-thread-2) [    ] o.a.s.c.a.s.SimClusterStateProvider ** creating new collection states, currentVersion=18
   [junit4]   2> 609479 DEBUG (simCloudManagerPool-3784-thread-2) [    ] o.a.s.c.a.s.SimClusterStateProvider ** saved cluster state version 18
   [junit4]   2> 609481 DEBUG (simCloudManagerPool-3784-thread-2) [    ] o.a.s.c.a.s.SimClusterStateProvider -- finished createCollection testCreateCollectionAddReplica, currentVersion=19
   [junit4]   2> 609483 DEBUG (ScheduledTrigger-3785-thread-4) [    ] o.a.s.c.a.NodeLostTrigger Running NodeLostTrigger: .auto_add_replicas with currently live nodes: 5
   [junit4]   2> 609496 DEBUG (simCloudManagerPool-3784-thread-3) [    ] o.a.s.c.a.s.SimClusterStateProvider ** creating new collection states, currentVersion=19
   [junit4]   2> 609496 DEBUG (simCloudManagerPool-3784-thread-3) [    ] o.a.s.c.a.s.SimClusterStateProvider ** saved cluster state version 19
   [junit4]   2> 609497 DEBUG (TEST-TestSimPolicyCloud.testCreateCollectionAddReplica-seed#[ACA94112DC23343A]) [    ] o.a.s.c.a.s.SimClusterStateProvider ** creating new collection states, currentVersion=20
   [junit4]   2> 609497 DEBUG (simCloudManagerPool-3784-thread-4) [    ] o.a.s.c.a.s.SimClusterStateProvider -- elected new leader for testCreateCollectionAddReplica / shard1 (currentVersion=20): {"core_node1":{
   [junit4]   2>     "core":"testCreateCollectionAddReplica_shard1_replica_n1",
   [junit4]   2>     "shard":"shard1",
   [junit4]   2>     "collection":"testCreateCollectionAddReplica",
   [junit4]   2>     "node_name":"127.0.0.1:10001_solr",
   [junit4]   2>     "type":"NRT",
   [junit4]   2>     "leader":"true",
   [junit4]   2>     "SEARCHER.searcher.maxDoc":0,
   [junit4]   2>     "SEARCHER.searcher.deletedDocs":0,
   [junit4]   2>     "INDEX.sizeInBytes":10240,
   [junit4]   2>     "state":"active",
   [junit4]   2>     "INDEX.sizeInGB":9.5367431640625E-6,
   [junit4]   2>     "SEARCHER.searcher.numDocs":0}}
   [junit4]   2> 609497 DEBUG (TEST-TestSimPolicyCloud.testCreateCollectionAddReplica-seed#[ACA94112DC23343A]) [    ] o.a.s.c.a.s.SimClusterStateProvider ** saved cluster state version 20
   [junit4]   2> 609513 DEBUG (ScheduledTrigger-3785-thread-1) [    ] o.a.s.c.a.NodeLostTrigger Running NodeLostTrigger: .auto_add_replicas with currently live nodes: 5
   [junit4]   2> 609534 DEBUG (ScheduledTrigger-3785-thread-3) [    ] o.a.s.c.a.NodeLostTrigger Running NodeLostTrigger: .auto_add_replicas with currently live nodes: 5
   [junit4]   2> 609556 DEBUG (ScheduledTrigger-3785-thread-1) [    ] o.a.s.c.a.NodeLostTrigger Running NodeLostTrigger: .auto_add_replicas with currently live nodes: 5
   [junit4]   2> 609586 DEBUG (ScheduledTrigger-3785-thread-2) [    ] o.a.s.c.a.NodeLostTrigger Running NodeLostTrigger: .auto_add_replicas with currently live nodes: 5
   [junit4]   2> 609609 DEBUG (ScheduledTrigger-3785-thread-4) [    ] o.a.s.c.a.NodeLostTrigger Running NodeLostTrigger: .auto_add_replicas with currently live nodes: 5
   [junit4]   2> 609630 DEBUG (ScheduledTrigger-3785-thread-1) [    ] o.a.s.c.a.NodeLostTrigger Running NodeLostTrigger: .auto_add_replicas with currently live nodes: 5
   [junit4]   2> 609654 DEBUG (ScheduledTrigger-3785-thread-4) [    ] o.a.s.c.a.NodeLostTrigger Running NodeLostTrigger: .auto_add_replicas with currently live nodes: 5
   [junit4]   2> 609675 DEBUG (ScheduledTrigger-3785-thread-3) [    ] o.a.s.c.a.NodeLostTrigger Running NodeLostTrigger: .auto_add_replicas with currently live nodes: 5
   [junit4]   2> 609695 DEBUG (ScheduledTrigger-3785-thread-2) [    ] o.a.s.c.a.NodeLostTrigger Running NodeLostTrigger: .auto_add_replicas with currently live nodes: 5
   [junit4]   2> 609718 DEBUG (ScheduledTrigger-3785-thread-1) [    ] o.a.s.c.a.NodeLostTrigger Running NodeLostTrigger: .auto_add_replicas with currently live nodes: 5
   [junit4]   2> 609749 DEBUG (ScheduledTrigger-3785-thread-3) [    ] o.a.s.c.a.NodeLostTrigger Running NodeLostTrigger: .auto_add_replicas with currently live nodes: 5
   [junit4]   2> 609780 DEBUG (ScheduledTrigger-3785-thread-4) [    ] o.a.s.c.a.NodeLostTrigger Running NodeLostTrigger: .auto_add_replicas with currently live nodes: 5
   [junit4]   2> 609809 DEBUG (ScheduledTrigger-3785-thread-2) [    ] o.a.s.c.a.NodeLostTrigger Running NodeLostTrigger: .auto_add_replicas with currently live nodes: 5
   [junit4]   2> 609832 DEBUG (ScheduledTrigger-3785-thread-4) [    ] o.a.s.c.a.NodeLostTrigger Running NodeLostTrigger: .auto_add_replicas with currently live nodes: 5
   [junit4]   2> 609859 DEBUG (ScheduledTrigger-3785-thread-4) [    ] o.a.s.c.a.NodeLostTrigger Running NodeLostTrigger: .auto_add_replicas with currently live nodes: 5
   [junit4]   2> 609880 DEBUG (ScheduledTrigger-3785-thread-4) [    ] o.a.s.c.a.NodeLostTrigger Running NodeLostTrigger: .auto_add_replicas with currently live nodes: 5
   [junit4]   2> 609906 DEBUG (ScheduledTrigger-3785-thread-2) [    ] o.a.s.c.a.NodeLostTrigger Running NodeLostTrigger: .auto_add_replicas with currently live nodes: 5
   [junit4]   2> 609931 DEBUG (ScheduledTrigger-3785-thread-3) [    ] o.a.s.c.a.NodeLostTrigger Running NodeLostTrigger: .auto_add_replicas with currently live nodes: 5
   [junit4]   2> 609957 DEBUG (ScheduledTrigger-3785-thread-4) [    ] o.a.s.c.a.NodeLostTrigger Running NodeLostTrigger: .auto_add_replicas with currently live nodes: 5
   [junit4]   2> 609984 DEBUG (ScheduledTrigger-3785-thread-1) [    ] o.a.s.c.a.NodeLostTrigger Running NodeLostTrigger: .auto_add_replicas with currently live nodes: 5
   [junit4]   2> 610009 DEBUG (ScheduledTrigger-3785-thread-3) [    ] o.a.s.c.a.NodeLostTrigger Running NodeLostTrigger: .auto_add_replicas with currently live nodes: 5
   [junit4]   2> 610035 DEBUG (ScheduledTrigger-3785-thread-4) [    ] o.a.s.c.a.NodeLostTrigger Running NodeLostTrigger: .auto_add_replicas with currently live nodes: 5
   [junit4]   2> 610058 DEBUG (ScheduledTrigger-3785-thread-1) [    ] o.a.s.c.a.NodeLostTrigger Running NodeLostTrigger: .auto_add_replicas with currently live nodes: 5
   [junit4]   2> 610079 DEBUG (ScheduledTrigger-3785-thread-1) [    ] o.a.s.c.a.NodeLostTrigger Running NodeLostTrigger: .auto_add_replicas with currently live nodes: 5
   [junit4]   2> 610100 DEBUG (ScheduledTrigger-3785-thread-3) [    ] o.a.s.c.a.NodeLostTrigger Running NodeLostTrigger: .auto_add_replicas with currently live nodes: 5
   [junit4]   2> 610126 DEBUG (ScheduledTrigger-3785-thread-1) [    ] o.a.s.c.a.NodeLostTrigger Running NodeLostTrigger: .auto_add_replicas with currently live nodes: 5
   [junit4]   2> 610154 DEBUG (ScheduledTrigger-3785-thread-3) [    ] o.a.s.c.a.NodeLostTrigger Running NodeLostTrigger: .auto_add_replicas with currently live nodes: 5
   [junit4]   2> 610184 DEBUG (ScheduledTrigger-3785-thread-1) [    ] o.a.s.c.a.NodeLostTrigger Running NodeLostTrigger: .auto_add_replicas with currently live nodes: 5
   [junit4]   2> 610205 DEBUG (ScheduledTrigger-3785-thread-4) [    ] o.a.s.c.a.NodeLostTrigger Running NodeLostTrigger: .auto_add_replicas with currently live nodes: 5
   [junit4]   2> 610235 DEBUG (ScheduledTrigger-3785-thread-3) [    ] o.a.s.c.a.NodeLostTrigger Running NodeLostTrigger: .auto_add_replicas with currently live nodes: 5
   [junit4]   2> 610258 DEBUG (ScheduledTrigger-3785-thread-4) [    ] o.a.s.c.a.NodeLostTrigger Running NodeLostTrigger: .auto_add_replicas with currently live nodes: 5
   [junit4]   2> 610286 DEBUG (ScheduledTrigger-3785-thread-1) [    ] o.a.s.c.a.NodeLostTrigger Running NodeLostTrigger: .auto_add_replicas with currently live nodes: 5
   [junit4]   2> 610308 DEBUG (ScheduledTrigger-3785-thread-2) [    ] o.a.s.c.a.NodeLostTrigger Running NodeLostTrigger: .auto_add_replicas with currently live nodes: 5
   [junit4]   2> 610338 DEBUG (ScheduledTrigger-3785-thread-3) [    ] o.a.s.c.a.NodeLostTrigger Running NodeLostTrigger: .auto_add_replicas with currently live nodes: 5
   [junit4]   2> 610361 DEBUG (ScheduledTrigger-3785-thread-4) [    ] o.a.s.c.a.NodeLostTrigger Running NodeLostTrigger: .auto_add_replicas with currently live nodes: 5
   [junit4]   2> 610387 DEBUG (ScheduledTrigger-3785-thread-1) [    ] o.a.s.c.a.NodeLostTrigger Running NodeLostTrigger: .auto_add_replicas with currently live nodes: 5
   [junit4]   2> 610413 DEBUG (ScheduledTrigger-3785-thread-3) [    ] o.a.s.c.a.NodeLostTrigger Running NodeLostTrigger: .auto_add_replicas with currently live nodes: 5
   [junit4]   2> 610434 DEBUG (ScheduledTrigger-3785-thread-1) [    ] o.a.s.c.a.NodeLostTrigger Running NodeLostTrigger: .auto_add_replicas with currently live nodes: 5
   [junit4]   2> 610464 DEBUG (ScheduledTrigger-3785-thread-3) [    ] o.a.s.c.a.NodeLostTrigger Running NodeLostTrigger: .auto_add_replicas with currently live nodes: 5
   [junit4]   2> 610494 DEBUG (ScheduledTrigger-3785-thread-4) [    ] o.a.s.c.a.NodeLostTrigger Running NodeLostTrigger: .auto_add_replicas with currently live nodes: 5
   [junit4]   2> 610517 DEBUG (ScheduledTrigger-3785-thread-2) [    ] o.a.s.c.a.NodeLostTrigger Running NodeLostTrigger: .auto_add_replicas with currently live nodes: 5
   [junit4]   2> 610538 DEBUG (ScheduledTrigger-3785-thread-4) [    ] o.a.s.c.a.NodeLostTrigger Running NodeLostTrigger: .auto_add_replicas with currently live nodes: 5
   [junit4]   2> 610560 DEBUG (ScheduledTrigger-3785-thread-3) [    ] o.a.s.c.a.NodeLostTrigger Running NodeLostTrigger: .auto_add_replicas with currently live nodes: 5
   [junit4]   2> 610590 DEBUG (ScheduledTrigger-3785-thread-1) [    ] o.a.s.c.a.NodeLostTrigger Running NodeLostTrigger: .auto_add_replicas with currently live nodes: 5
   [junit4]   2> 610613 DEBUG (ScheduledTrigger-3785-thread-4) [    ] o.a.s.c.a.NodeLostTrigger Running NodeLostTrigger: .auto_add_replicas with currently live nodes: 5
   [junit4]   2> 610635 DEBUG (ScheduledTrigger-3785-thread-2) [    ] o.a.s.c.a.NodeLostTrigger Running NodeLostTrigger: .auto_add_replicas with currently live nodes: 5
   [junit4]   2> 610656 DEBUG (ScheduledTrigger-3785-thread-1) [    ] o.a.s.c.a.NodeLostTrigger Running NodeLostTrigger: .auto_add_replicas with currently live nodes: 5
   [junit4]   2> 610682 DEBUG (ScheduledTrigger-3785-thread-1) [    ] o.a.s.c.a.NodeLostTrigger Running NodeLostTrigger: .auto_add_replicas with currently live nodes: 5
   [junit4]   2> 610705 DEBUG (ScheduledTrigger-3785-thread-2) [    ] o.a.s.c.a.NodeLostTrigger Running NodeLostTrigger: .auto_add_replicas with currently live nodes: 5
   [junit4]   2> 610734 DEBUG (ScheduledTrigger-3785-thread-3) [    ] o.a.s.c.a.NodeLostTrigger Running NodeLostTrigger: .auto_add_replicas with currently live nodes: 5
   [junit4]   2> 610756 DEBUG (ScheduledTrigger-3785-thread-2) [    ] o.a.s.c.a.NodeLostTrigger Running NodeLostTrigger: .auto_add_replicas with currently live nodes: 5
   [junit4]   2> 610777 DEBUG (ScheduledTrigger-3785-thread-3) [    ] o.a.s.c.a.NodeLostTrigger Running NodeLostTrigger: .auto_add_replicas with currently live nodes: 5
   [junit4]   2> 610800 DEBUG (ScheduledTrigger-3785-thread-4) [    ] o.a.s.c.a.NodeLostTrigger Running NodeLostTrigger: .auto_add_replicas with currently live nodes: 5
   [junit4]   2> 610821 DEBUG (ScheduledTrigger-3785-thread-4) [    ] o.a.s.c.a.NodeLostTrigger Running NodeLostTrigger: .auto_add_replicas with currently live nodes: 5
   [junit4]   2> 610845 DEBUG (ScheduledTrigger-3785-thread-4) [    ] o.a.s.c.a.NodeLostTrigger Running NodeLostTrigger: .auto_add_replicas with currently live nodes: 5
   [junit4]   2> 610866 DEBUG (ScheduledTrigger-3785-thread-4) [    ] o.a.s.c.a.NodeLostTrigger Running NodeLostTrigger: .auto_add_replicas with currently live nodes: 5
   [junit4]   2> 610887 DEBUG (ScheduledTrigger-3785-thread-4) [    ] o.a.s.c.a.NodeLostTrigger Running NodeLostTrigger: .auto_add_replicas with currently live nodes: 5
   [junit4]   2> 610911 DEBUG (ScheduledTrigger-3785-thread-4) [    ] o.a.s.c.a.NodeLostTrigger Running NodeLostTrigger: .auto_add_replicas with currently live nodes: 5
   [junit4]   2> 610931 DEBUG (ScheduledTrigger-3785-thread-2) [    ] o.a.s.c.a.NodeLostTrigger Running NodeLostTrigger: .auto_add_replicas with currently live nodes: 5
   [junit4]   2> 610954 DEBUG (ScheduledTrigger-3785-thread-1) [    ] o.a.s.c.a.NodeLostTrigger Running NodeLostTrigger: .auto_add_replicas with currently live nodes: 5
   [junit4]   2> 610976 DEBUG (ScheduledTrigger-3785-thread-2) [    ] o.a.s.c.a.NodeLostTrigger Running NodeLostTrigger: .auto_add_replicas with currently live nodes: 5
   [junit4]   2> 610996 DEBUG (ScheduledTrigger-3785-thread-1) [    ] o.a.s.c.a.NodeLostTrigger Running NodeLostTrigger: .auto_add_replicas with currently live nodes: 5
   [junit4]   2> 611019 DEBUG (ScheduledTrigger-3785-thread-2) [    ] o.a.s.c.a.NodeLostTrigger Running NodeLostTrigger: .auto_add_replicas with currently live nodes: 5
   [junit4]   2> 611040 DEBUG (ScheduledTrigger-3785-thread-1) [    ] o.a.s.c.a.NodeLostTrigger Running NodeLostTrigger: .auto_add_replicas with currently live nodes: 5
   [junit4]   2> 611060 DEBUG (ScheduledTrigger-3785-thread-2) [    ] o.a.s.c.a.NodeLostTrigger Running NodeLostTrigger: .auto_add_replicas with currently live nodes: 5
   [junit4]   2> 611080 DEBUG (ScheduledTrigger-3785-thread-1) [    ] o.a.s.c.a.NodeLostTrigger Running NodeLostTrigger: .auto_add_replicas with currently live nodes: 5
   [junit4]   2> 611101 DEBUG (ScheduledTrigger-3785-thread-2) [    ] o.a.s.c.a.NodeLostTrigger Running NodeLostTrigger: .auto_add_replicas with currently live nodes: 5
   [junit4]   2> 611123 DEBUG (ScheduledTrigger-3785-thread-4) [    ] o.a.s.c.a.NodeLostTrigger Running NodeLostTrigger: .auto_add_replicas with currently live nodes: 5
   [junit4]   2> 611146 DEBUG (ScheduledTrigger-3785-thread-2) [    ] o.a.s.c.a.NodeLostTrigger Running NodeLostTrigger: .auto_add_replicas with currently live nodes: 5
   [junit4]   2> 611176 DEBUG (ScheduledTrigger-3785-thread-4) [    ] o.a.s.c.a.NodeLostTrigger Running NodeLostTrigger: .auto_add_replicas with currently live nodes: 5
   [junit4]   2> 611197 DEBUG (ScheduledTrigger-3785-thread-1) [    ] o.a.s.c.a.NodeLostTrigger Running NodeLostTrigger: .auto_add_replicas with currently live nodes: 5
   [junit4]   2> 611227 DEBUG (ScheduledTrigger-3785-thread-4) [    ] o.a.s.c.a.NodeLostTrigger Running NodeLostTrigger: .auto_add_replicas with currently live nodes: 5
   [junit4]   2> 611249 DEBUG (ScheduledTrigger-3785-thread-3) [    ] o.a.s.c.a.NodeLostTrigger Running NodeLostTrigger: .auto_add_replicas with currently live nodes: 5
   [junit4]   2> 611279 DEBUG (ScheduledTrigger-3785-thread-1) [    ] o.a.s.c.a.NodeLostTrigger Running NodeLostTrigger: .auto_add_replicas with currently live nodes: 5
   [junit4]   2> 611282 INFO  (TEST-TestSimPolicyCloud.testCreateCollectionAddReplica-seed#[ACA94112DC23343A]) [    ] o.a.s.SolrTestCaseJ4 ###Ending testCreateCollectionAddReplica
   [junit4]   2> 611282 DEBUG (TEST-TestSimPolicyCloud.testCreateCollectionAddReplica-seed#[ACA94112DC23343A]) [    ] o.a.s.c.a.s.SimClusterStateProvider ** creating new collection states, currentVersion=21
   [junit4]   2> 611283 DEBUG (TEST-TestSimPolicyCloud.testCreateCollectionAddReplica-seed#[ACA94112DC23343A]) [    ] o.a.s.c.a.s.SimClusterStateProvider ** saved cluster state version 21
   [junit4]   2> 611283 INFO  (TEST-TestSimPolicyCloud.testCreateCollectionAddReplica-seed#[ACA94112DC23343A]) [    ] o.a.s.c.a.s.SimSolrCloudTestCase #######################################
   [junit4]   2> ############ CLUSTER STATE ############
   [junit4]   2> #######################################
   [junit4]   2> ## Live nodes:		5
   [junit4]   2> ## Empty nodes:	4
   [junit4]   2> ## Dead nodes:		0
   [junit4]   2> ## Collections:
   [junit4]   2> ##  * testCreateCollectionAddReplica
   [junit4]   2> ##    shardsTotal	1
   [junit4]   2> ##    shardsState	{active=1}
   [junit4]   2> ##      shardsWithoutLeader	0
   [junit4]   2> ##    totalReplicas	1
   [junit4]   2> ##      activeReplicas	1
   [junit4]   2> ##      inactiveReplicas	0
   [junit4]   2> ##    totalActiveDocs	0
   [junit4]   2> ##      bufferedDocs	0
   [junit4]   2> ##      maxActiveSliceDocs	0
   [junit4]   2> ##      minActiveSliceDocs	0
   [junit4]   2> ##      avgActiveSliceDocs	0
   [junit4]   2> ##    totalInactiveDocs	0
   [junit4]   2> ##      maxInactiveSliceDocs	0
   [junit4]   2> ##      minInactiveSliceDocs	0
   [junit4]   2> ##      avgInactiveSliceDocs	NaN
   [junit4]   2> ##    totalActiveBytes	10,240
   [junit4]   2> ##      maxActiveSliceBytes	10,240
   [junit4]   2> ##      minActiveSliceBytes	10,240
   [junit4]   2> ##      avgActiveSliceBytes	10,240
   [junit4]   2> ##    totalInactiveBytes	0
   [junit4]   2> ##      maxInactiveSliceBytes	0
   [junit4]   2> ##      minInactiveSliceBytes	0
   [junit4]   2> ##      avgInactiveSliceBytes	NaN
   [junit4]   2> ##    totalActiveDeletedDocs	0
   [junit4]   2> ## Max replicas per node:	1
   [junit4]   2> ## Min replicas per node:	0
   [junit4]   2> ## Total replicas:		1
   [junit4]   2> ## * testCreateCollectionAddReplica		1
   [junit4]   2> ##		- active           1
   [junit4]   2> ######### Solr op counts ##########
   [junit4]   2> ##		- CREATE             1
   [junit4]   2> ##		- autoscaling        1
   [junit4]   2> ######### Autoscaling event counts ###########
   [junit4]   2> 
   [junit4]   2> NOTE: reproduce with: ant test  -Dtestcase=TestSimPolicyCloud -Dtests.method=testCreateCollectionAddReplica -Dtests.seed=ACA94112DC23343A -Dtests.slow=true -Dtests.locale=it-CH -Dtests.timezone=Africa/Libreville -Dtests.asserts=true -Dtests.file.encoding=ISO-8859-1
   [junit4] FAILURE 2.03s J1 | TestSimPolicyCloud.testCreateCollectionAddReplica <<<
   [junit4]    > Throwable #1: java.lang.AssertionError: Timeout waiting for collection to become active
   [junit4]    > Live Nodes: [127.0.0.1:10001_solr, 127.0.0.1:10004_solr, 127.0.0.1:10000_solr, 127.0.0.1:10002_solr, 127.0.0.1:10003_solr]
   [junit4]    > Last available state: DocCollection(testCreateCollectionAddReplica//clusterstate.json/20)={
   [junit4]    >   "replicationFactor":"1",
   [junit4]    >   "pullReplicas":"0",
   [junit4]    >   "router":{"name":"compositeId"},
   [junit4]    >   "maxShardsPerNode":"1",
   [junit4]    >   "autoAddReplicas":"false",
   [junit4]    >   "nrtReplicas":"1",
   [junit4]    >   "tlogReplicas":"0",
   [junit4]    >   "autoCreated":"true",
   [junit4]    >   "policy":"c1",
   [junit4]    >   "shards":{"shard1":{
   [junit4]    >       "replicas":{"core_node1":{
   [junit4]    >           "core":"testCreateCollectionAddReplica_shard1_replica_n1",
   [junit4]    >           "SEARCHER.searcher.maxDoc":0,
   [junit4]    >           "SEARCHER.searcher.deletedDocs":0,
   [junit4]    >           "INDEX.sizeInBytes":10240,
   [junit4]    >           "node_name":"127.0.0.1:10001_solr",
   [junit4]    >           "state":"active",
   [junit4]    >           "type":"NRT",
   [junit4]    >           "INDEX.sizeInGB":9.5367431640625E-6,
   [junit4]    >           "SEARCHER.searcher.numDocs":0}},
   [junit4]    >       "range":"80000000-7fffffff",
   [junit4]    >       "state":"active"}}}
   [junit4]    > 	at __randomizedtesting.SeedInfo.seed([ACA94112DC23343A:2C89243CCD60DC9C]:0)
   [junit4]    > 	at org.apache.solr.cloud.CloudTestUtils.waitForState(CloudTestUtils.java:70)
   [junit4]    > 	at org.apache.solr.cloud.autoscaling.sim.TestSimPolicyCloud.testCreateCollectionAddReplica(TestSimPolicyCloud.java:123)
   [junit4]    > 	at java.base/jdk.internal.reflect.NativeMethodAccessorImpl.invoke0(Native Method)
   [junit4]    > 	at java.base/jdk.internal.reflect.NativeMethodAccessorImpl.invoke(NativeMethodAccessorImpl.java:62)
   [junit4]    > 	at java.base/jdk.internal.reflect.DelegatingMethodAccessorImpl.invoke(DelegatingMethodAccessorImpl.java:43)
   [junit4]    > 	at java.base/java.lang.reflect.Method.invoke(Method.java:564)
   [junit4]    > 	at java.base/java.lang.Thread.run(Thread.java:844)
   [junit4]    > Caused by: java.util.concurrent.TimeoutException: last ClusterState: znodeVersion: 21
   [junit4]    > live nodes:[127.0.0.1:10001_solr, 127.0.0.1:10004_solr, 127.0.0.1:10000_solr, 127.0.0.1:10002_solr, 127.0.0.1:10003_solr]
   [junit4]    > collections:{testCreateCollectionAddReplica=DocCollection(testCreateCollectionAddReplica//clusterstate.json/20)={
   [junit4]    >   "replicationFactor":"1",
   [junit4]    >   "pullReplicas":"0",
   [junit4]    >   "router":{"name":"compositeId"},
   [junit4]    >   "maxShardsPerNode":"1",
   [junit4]    >   "autoAddReplicas":"false",
   [junit4]    >   "nrtReplicas":"1",
   [junit4]    >   "tlogReplicas":"0",
   [junit4]    >   "autoCreated":"true",
   [junit4]    >   "policy":"c1",
   [junit4]    >   "shards":{"shard1":{
   [junit4]    >       "replicas":{"core_node1":{
   [junit4]    >           "core":"testCreateCollectionAddReplica_shard1_replica_n1",
   [junit4]    >           "SEARCHER.searcher.maxDoc":0,
   [junit4]    >           "SEARCHER.searcher.deletedDocs":0,
   [junit4]    >           "INDEX.sizeInBytes":10240,
   [junit4]    >           "node_name":"127.0.0.1:10001_solr",
   [junit4]    >           "state":"active",
   [junit4]    >           "type":"NRT",
   [junit4]    >           "INDEX.sizeInGB":9.5367431640625E-6,
   [junit4]    >           "SEARCHER.searcher.numDocs":0}},
   [junit4]    >       "range":"80000000-7fffffff",
   [junit4]    >       "state":"active"}}}}, last coll state: DocCollection(testCreateCollectionAddReplica//clusterstate.json/20)={
   [junit4]    >   "replicationFactor":"1",
   [junit4]    >   "pullReplicas":"0",
   [junit4]    >   "router":{"name":"compositeId"},
   [junit4]    >   "maxShardsPerNode":"1",
   [junit4]    >   "autoAddReplicas":"false",
   [junit4]    >   "nrtReplicas":"1",
   [junit4]    >   "tlogReplicas":"0",
   [junit4]    >   "autoCreated":"true",
   [junit4]    >   "policy":"c1",
   [junit4]    >   "shards":{"shard1":{
   [junit4]    >       "replicas":{"core_node1":{
   [junit4]    >           "core":"testCreateCollectionAddReplica_shard1_replica_n1",
   [junit4]    >           "SEARCHER.searcher.maxDoc":0,
   [junit4]    >           "SEARCHER.searcher.deletedDocs":0,
   [junit4]    >           "INDEX.sizeInBytes":10240,
   [junit4]    >           "node_name":"127.0.0.1:10001_solr",
   [junit4]    >           "state":"active",
   [junit4]    >           "type":"NRT",
   [junit4]    >           "INDEX.sizeInGB":9.5367431640625E-6,
   [junit4]    >           "SEARCHER.searcher.numDocs":0}},
   [junit4]    >       "range":"80000000-7fffffff",
   [junit4]    >       "state":"active"}}}
   [junit4]    > 	at org.apache.solr.cloud.CloudTestUtils.waitForState(CloudTestUtils.java:112)
   [junit4]    > 	at org.apache.solr.cloud.CloudTestUtils.waitForState(CloudTestUtils.java:64)
   [junit4]    > 	... 40 more
   [junit4]   2> 611288 INFO  (TEST-TestSimPolicyCloud.testCreateCollectionAddShardWithReplicaTypeUsingPolicy-seed#[ACA94112DC23343A]) [    ] o.a.s.SolrTestCaseJ4 ###Starting testCreateCollectionAddShardWithReplicaTypeUsingPolicy
   [junit4]   2> 611288 DEBUG (TEST-TestSimPolicyCloud.testCreateCollectionAddShardWithReplicaTypeUsingPolicy-seed#[ACA94112DC23343A]) [    ] o.a.s.c.a.OverseerTriggerThread Refreshing /autoscaling.json with znode version 8
   [junit4]   2> 611288 DEBUG (Simulated OverseerAutoScalingTriggerThread) [    ] o.a.s.c.a.OverseerTriggerThread Processed trigger updates upto znodeVersion 8
   [junit4]   2> 611288 INFO  (TEST-TestSimPolicyCloud.testCreateCollectionAddShardWithReplicaTypeUsingPolicy-seed#[ACA94112DC23343A]) [    ] o.a.s.c.a.s.SimCloudManager === Restarting OverseerTriggerThread and clearing object cache...
   [junit4]   2> 611288 DEBUG (Simulated OverseerAutoScalingTriggerThread) [    ] o.a.s.c.a.OverseerTriggerThread -- clean old nodeLost markers
   [junit4]   2> 611288 DEBUG (Simulated OverseerAutoScalingTriggerThread) [    ] o.a.s.c.a.OverseerTriggerThread -- clean old nodeAdded markers
   [junit4]   2> 611288 DEBUG (TEST-TestSimPolicyCloud.testCreateCollectionAddShardWithReplicaTypeUsingPolicy-seed#[ACA94112DC23343A]) [    ] o.a.s.c.a.ScheduledTriggers Shutting down scheduled thread pool executor now
   [junit4]   2> 611288 DEBUG (TEST-TestSimPolicyCloud.testCreateCollectionAddShardWithReplicaTypeUsingPolicy-seed#[ACA94112DC23343A]) [    ] o.a.s.c.a.ScheduledTriggers Shutting down action executor now
   [junit4]   2> 611288 DEBUG (TEST-TestSimPolicyCloud.testCreateCollectionAddShardWithReplicaTypeUsingPolicy-seed#[ACA94112DC23343A]) [    ] o.a.s.c.a.ScheduledTriggers Awaiting termination for action executor
   [junit4]   2> 611288 DEBUG (TEST-TestSimPolicyCloud.testCreateCollectionAddShardWithReplicaTypeUsingPolicy-seed#[ACA94112DC23343A]) [    ] o.a.s.c.a.ScheduledTriggers Awaiting termination for scheduled thread pool executor
   [junit4]   2> 611288 WARN  (Simulated OverseerAutoScalingTriggerThread) [    ] o.a.s.c.a.OverseerTriggerThread Interrupted
   [junit4]   2> java.lang.InterruptedException: null
   [junit4]   2> 	at java.util.concurrent.locks.AbstractQueuedSynchronizer.acquireInterruptibly(AbstractQueuedSynchronizer.java:1247) ~[?:?]
   [junit4]   2> 	at java.util.concurrent.locks.ReentrantLock.lockInterruptibly(ReentrantLock.java:317) ~[?:?]
   [junit4]   2> 	at org.apache.solr.cloud.autoscaling.OverseerTriggerThread.run(OverseerTriggerThread.java:177) [java/:?]
   [junit4]   2> 	at java.lang.Thread.run(Thread.java:844) [?:?]
   [junit4]   2> 611289 DEBUG (TEST-TestSimPolicyCloud.testCreateCollectionAddShardWithReplicaTypeUsingPolicy-seed#[ACA94112DC23343A]) [    ] o.a.s.c.a.ScheduledTriggers ScheduledTriggers closed completely
   [junit4]   2> 611289 DEBUG (TEST-TestSimPolicyCloud.testCreateCollectionAddShardWithReplicaTypeUsingPolicy-seed#[ACA94112DC23343A]) [    ] o.a.s.c.a.OverseerTriggerThread OverseerTriggerThread has been closed explicitly
   [junit4]   2> 611290 DEBUG (Simulated OverseerAutoScalingTriggerThread) [    ] o.a.s.c.a.OverseerTriggerThread Adding .auto_add_replicas and .scheduled_maintenance triggers
   [junit4]   2> 611290 DEBUG (Simulated OverseerAutoScalingTriggerThread) [    ] o.a.s.c.a.OverseerTriggerThread Refreshing /autoscaling.json with znode version 9
   [junit4]   2> 611290 DEBUG (Simulated OverseerAutoScalingTriggerThread) [    ] o.a.s.c.a.OverseerTriggerThread Current znodeVersion 9, lastZnodeVersion -1
   [junit4]   2> 611290 DEBUG (Simulated OverseerAutoScalingTriggerThread) [    ] o.a.s.c.a.OverseerTriggerThread Processed trigger updates upto znodeVersion 9
   [junit4]   2> 611290 DEBUG (Simulated OverseerAutoScalingTriggerThread) [    ] o.a.s.c.a.NodeLostTrigger NodeLostTrigger .auto_add_replicas - Initial livenodes: [127.0.0.1:10001_solr, 127.0.0.1:10004_solr, 127.0.0.1:10000_solr, 127.0.0.1:10002_solr, 127.0.0.1:10003_solr]
   [junit4]   2> 611291 DEBUG (Simulated OverseerAutoScalingTriggerThread) [    ] o.a.s.c.a.OverseerTriggerThread -- clean old nodeAdded markers
   [junit4]   2> 611291 DEBUG (Simulated OverseerAutoScalingTriggerThread) [    ] o.a.s.c.a.OverseerTriggerThread Current znodeVersion 9, lastZnodeVersion 9
   [junit4]   2> 611291 DEBUG (ScheduledTrigger-3788-thread-2) [    ] o.a.s.c.a.NodeLostTrigger Running NodeLostTrigger: .auto_add_replicas with currently live nodes: 5
   [junit4]   2> 611321 DEBUG (ScheduledTrigger-3788-thread-1) [    ] o.a.s.c.a.NodeLostTrigger Running NodeLostTrigger: .auto_add_replicas with currently live nodes: 5
   [junit4]   2> 611345 DEBUG (ScheduledTrigger-3788-thread-4) [    ] o.a.s.c.a.NodeLostTrigger Running NodeLostTrigger: .auto_add_replicas with currently live nodes: 5
   [junit4]   2> 611366 DEBUG (ScheduledTrigger-3788-thread-4) [    ] o.a.s.c.a.NodeLostTrigger Running NodeLostTrigger: .auto_add_replicas with currently live nodes: 5
   [junit4]   2> 611393 DEBUG (ScheduledTrigger-3788-thread-4) [    ] o.a.s.c.a.NodeLostTrigger Running NodeLostTrigger: .auto_add_replicas with currently live nodes: 5
   [junit4]   2> 611424 DEBUG (ScheduledTrigger-3788-thread-3) [    ] o.a.s.c.a.NodeLostTrigger Running NodeLostTrigger: .auto_add_replicas with currently live nodes: 5
   [junit4]   2> 611454 DEBUG (ScheduledTrigger-3788-thread-2) [    ] o.a.s.c.a.NodeLostTrigger Running NodeLostTrigger: .auto_add_replicas with currently live nodes: 5
   [junit4]   2> 611477 DEBUG (ScheduledTrigger-3788-thread-4) [    ] o.a.s.c.a.NodeLostTrigger Running NodeLostTrigger: .auto_add_replicas with currently live nodes: 5
   [junit4]   2> 611490 INFO  (TEST-TestSimPolicyCloud.testCreateCollectionAddShardWithReplicaTypeUsingPolicy-seed#[ACA94112DC23343A]) [    ] o.a.s.c.a.s.TestSimPolicyCloud NRT 127.0.0.1:10001_solr PULL 127.0.0.1:10004_solr , TLOG 127.0.0.1:10000_solr 
   [junit4]   2> 611492 DEBUG (simCloudManagerPool-3787-thread-1) [    ] o.a.s.c.a.s.SimClusterStateProvider ** creating new collection states, currentVersion=22
   [junit4]   2> 611492 DEBUG (simCloudManagerPool-3787-thread-1) [    ] o.a.s.c.a.s.SimClusterStateProvider ** saved cluster state version 22
   [junit4]   2> 611492 DEBUG (simCloudManagerPool-3787-thread-1) [    ] o.a.s.c.a.AutoScalingHandler Verified autoscaling configuration
   [junit4]   2> 611492 DEBUG (simCloudManagerPool-3787-thread-1) [    ] o.a.s.c.a.OverseerTriggerThread Refreshing /autoscaling.json with znode version 10
   [junit4]   2> 611493 DEBUG (Simulated OverseerAutoScalingTriggerThread) [    ] o.a.s.c.a.OverseerTriggerThread Processed trigger updates upto znodeVersion 10
   [junit4]   2> 611493 DEBUG (Simulated OverseerAutoScalingTriggerThread) [    ] o.a.s.c.a.OverseerTriggerThread -- clean old nodeAdded markers
   [junit4]   2> 611493 DEBUG (Simulated OverseerAutoScalingTriggerThread) [    ] o.a.s.c.a.OverseerTriggerThread Current znodeVersion 10, lastZnodeVersion 10
   [junit4]   2> 611494 DEBUG (simCloudManagerPool-3787-thread-2) [    ] o.a.s.c.a.s.SimClusterStateProvider -- simCreateCollection policiesTest, currentVersion=23
   [junit4]   2> 611494 DEBUG (simCloudManagerPool-3787-thread-2) [    ] o.a.s.c.a.s.SimClusterStateProvider ** creating new collection states, currentVersion=23
   [junit4]   2> 611494 DEBUG (simCloudManagerPool-3787-thread-2) [    ] o.a.s.c.a.s.SimClusterStateProvider ** saved cluster state version 23
   [junit4]   2> 611503 DEBUG (ScheduledTrigger-3788-thread-2) [    ] o.a.s.c.a.NodeLostTrigger Running NodeLostTrigger: .auto_add_replicas with currently live nodes: 5
   [junit4]   2> 611509 DEBUG (simCloudManagerPool-3787-thread-2) [    ] o.a.s.c.a.s.SimClusterStateProvider ** creating new collection states, currentVersion=24
   [junit4]   2> 611509 DEBUG (simCloudManagerPool-3787-thread-2) [    ] o.a.s.c.a.s.SimClusterStateProvider ** saved cluster state version 24
   [junit4]   2> 611513 DEBUG (simCloudManagerPool-3787-thread-2) [    ] o.a.s.c.a.s.SimClusterStateProvider -- finished createCollection policiesTest, currentVersion=25
   [junit4]   2> 611528 DEBUG (simCloudManagerPool-3787-thread-3) [    ] o.a.s.c.a.s.SimClusterStateProvider ** creating new collection states, currentVersion=25
   [junit4]   2> 611528 DEBUG (simCloudManagerPool-3787-thread-3) [    ] o.a.s.c.a.s.SimClusterStateProvider ** saved cluster state version 25
   [junit4]   2> 611529 DEBUG (ScheduledTrigger-3788-thread-1) [    ] o.a.s.c.a.NodeLostTrigger Running NodeLostTrigger: .auto_add_replicas with currently live nodes: 5
   [junit4]   2> 611529 DEBUG (simCloudManagerPool-3787-thread-6) [    ] o.a.s.c.a.s.SimClusterStateProvider -- elected new leader for policiesTest / s1 (currentVersion=26): {"core_node3":{
   [junit4]   2>     "core":"policiesTest_s1_replica_n1",
   [junit4]   2>     "shard":"s1",
   [junit4]   2>     "collection":"policiesTest",
   [junit4]   2>     "node_name":"127.0.0.1:10001_solr",
   [junit4]   2>     "type":"NRT",
   [junit4]   2>     "leader":"true",
   [junit4]   2>     "SEARCHER.searcher.maxDoc":0,
   [junit4]   2>     "SEARCHER.searcher.deletedDocs":0,
   [junit4]   2>     "INDEX.sizeInBytes":10240,
   [junit4]   2>     "state":"active",
   [junit4]   2>     "INDEX.sizeInGB":9.5367431640625E-6,
   [junit4]   2>     "SEARCHER.searcher.numDocs":0}}
   [junit4]   2> 611543 DEBUG (simCloudManagerPool-3787-thread-4) [    ] o.a.s.c.a.s.SimClusterStateProvider ** creating new collection states, currentVersion=26
   [junit4]   2> 611544 DEBUG (simCloudManagerPool-3787-thread-4) [    ] o.a.s.c.a.s.SimClusterStateProvider ** saved cluster state version 26
   [junit4]   2> 611558 DEBUG (ScheduledTrigger-3788-thread-2) [    ] o.a.s.c.a.NodeLostTrigger Running NodeLostTrigger: .auto_add_replicas with currently live nodes: 5
   [junit4]   2> 611558 DEBUG (simCloudManagerPool-3787-thread-5) [    ] o.a.s.c.a.s.SimClusterStateProvider ** creating new collection states, currentVersion=27
   [junit4]   2> 611558 DEBUG (simCloudManagerPool-3787-thread-5) [    ] o.a.s.c.a.s.SimClusterStateProvider ** saved cluster state version 27
   [junit4]   2> 611559 DEBUG (TEST-TestSimPolicyCloud.testCreateCollectionAddShardWithReplicaTypeUsingPolicy-seed#[ACA94112DC23343A]) [    ] o.a.s.c.a.s.SimClusterStateProvider ** creating new collection states, currentVersion=28
   [junit4]   2> 611559 DEBUG (TEST-TestSimPolicyCloud.testCreateCollectionAddShardWithReplicaTypeUsingPolicy-seed#[ACA94112DC23343A]) [    ] o.a.s.c.a.s.SimClusterStateProvider ** saved cluster state version 28
   [junit4]   2> 611588 DEBUG (ScheduledTrigger-3788-thread-1) [    ] o.a.s.c.a.NodeLostTrigger Running NodeLostTrigger: .auto_add_replicas with currently live nodes: 5
   [junit4]   2> 611617 DEBUG (ScheduledTrigger-3788-thread-3) [    ] o.a.s.c.a.NodeLostTrigger Running NodeLostTrigger: .auto_add_replicas with currently live nodes: 5
   [junit4]   2> 611647 DEBUG (ScheduledTrigger-3788-thread-2) [    ] o.a.s.c.a.NodeLostTrigger Running NodeLostTrigger: .auto_add_replicas with currently live nodes: 5
   [junit4]   2> 611673 DEBUG (ScheduledTrigger-3788-thread-4) [    ] o.a.s.c.a.NodeLostTrigger Running NodeLostTrigger: .auto_add_replicas with currently live nodes: 5
   [junit4]   2> 611678 INFO  (simCloudManagerPool-3787-thread-7) [    ] o.a.s.c.a.c.AddReplicaCmd Node Identified 127.0.0.1:10001_solr for creating new replica of shard s3 for collection policiesTest
   [junit4]   2> 611693 DEBUG (simCloudManagerPool-3787-thread-7) [    ] o.a.s.c.a.s.SimClusterStateProvider ** creating new collection states, currentVersion=29
   [junit4]   2> 611694 DEBUG (ScheduledTrigger-3788-thread-3) [    ] o.a.s.c.a.NodeLostTrigger Running NodeLostTrigger: .auto_add_replicas with currently live nodes: 5
   [junit4]   2> 611694 DEBUG (simCloudManagerPool-3787-thread-7) [    ] o.a.s.c.a.s.SimClusterStateProvider ** saved cluster state version 29
   [junit4]   2> 611694 INFO  (simCloudManagerPool-3787-thread-7) [    ] o.a.s.c.a.c.AddReplicaCmd Node Identified 127.0.0.1:10000_solr for creating new replica of shard s3 for collection policiesTest
   [junit4]   2> 611695 DEBUG (simCloudManagerPool-3787-thread-8) [    ] o.a.s.c.a.s.SimClusterStateProvider -- elected new leader for policiesTest / s3 (currentVersion=30): {"core_node7":{
   [junit4]   2>     "core":"policiesTest_s3_replica_n6",
   [junit4]   2>     "shard":"s3",
   [junit4]   2>     "collection":"policiesTest",
   [junit4]   2>     "node_name":"127.0.0.1:10001_solr",
   [junit4]   2>     "type":"NRT",
   [junit4]   2>     "pullReplicas":"1",
   [junit4]   2>     "leader":"true",
   [junit4]   2>     "INDEX.sizeInBytes":10240,
   [junit4]   2>     "nrtReplicas":"1",
   [junit4]   2>     "tlogReplicas":"1",
   [junit4]   2>     "state":"active",
   [junit4]   2>     "INDEX.sizeInGB":9.5367431640625E-6}}
   [junit4]   2> 611709 DEBUG (simCloudManagerPool-3787-thread-7) [    ] o.a.s.c.a.s.SimClusterStateProvider ** creating new collection states, currentVersion=30
   [junit4]   2> 611709 DEBUG (simCloudManagerPool-3787-thread-7) [    ] o.a.s.c.a.s.SimClusterStateProvider ** saved cluster state version 30
   [junit4]   2> 611709 INFO  (simCloudManagerPool-3787-thread-7) [    ] o.a.s.c.a.c.AddReplicaCmd Node Identified 127.0.0.1:10004_solr for creating new replica of shard s3 for collection policiesTest
   [junit4]   2> 611720 DEBUG (ScheduledTrigger-3788-thread-3) [    ] o.a.s.c.a.NodeLostTrigger Running NodeLostTrigger: .auto_add_replicas with currently live nodes: 5
   [junit4]   2> 611720 DEBUG (simCloudManagerPool-3787-thread-7) [    ] o.a.s.c.a.s.SimClusterStateProvider ** creating new collection states, currentVersion=31
   [junit4]   2> 611720 DEBUG (simCloudManagerPool-3787-thread-7) [    ] o.a.s.c.a.s.SimClusterStateProvider ** saved cluster state version 31
   [junit4]   2> 611720 DEBUG (simCloudManagerPool-3787-thread-7) [    ] o.a.s.c.a.s.SimClusterStateProvider ** creating new collection states, currentVersion=32
   [junit4]   2> 611720 DEBUG (simCloudManagerPool-3787-thread-7) [    ] o.a.s.c.a.s.SimClusterStateProvider ** saved cluster state version 32
   [junit4]   2> 611721 INFO  (TEST-TestSimPolicyCloud.testCreateCollectionAddShardWithReplicaTypeUsingPolicy-seed#[ACA94112DC23343A]) [    ] o.a.s.SolrTestCaseJ4 ###Ending testCreateCollectionAddShardWithReplicaTypeUsingPolicy
   [junit4]   2> 611721 DEBUG (TEST-TestSimPolicyCloud.testCreateCollectionAddShardWithReplicaTypeUsingPolicy-seed#[ACA94112DC23343A]) [    ] o.a.s.c.a.s.SimClusterStateProvider ** creating new collection states, currentVersion=33
   [junit4]   2> 611722 DEBUG (TEST-TestSimPolicyCloud.testCreateCollectionAddShardWithReplicaTypeUsingPolicy-seed#[ACA94112DC23343A]) [    ] o.a.s.c.a.s.SimClusterStateProvider ** saved cluster state version 33
   [junit4]   2> 611722 INFO  (TEST-TestSimPolicyCloud.testCreateCollectionAddShardWithReplicaTypeUsingPolicy-seed#[ACA94112DC23343A]) [    ] o.a.s.c.a.s.SimSolrCloudTestCase #######################################
   [junit4]   2> ############ CLUSTER STATE ############
   [junit4]   2> #######################################
   [junit4]   2> ## Live nodes:		5
   [junit4]   2> ## Empty nodes:	2
   [junit4]   2> ## Dead nodes:		0
   [junit4]   2> ## Collections:
   [junit4]   2> ##  * policiesTest
   [junit4]   2> ##    shardsTotal	2
   [junit4]   2> ##    shardsState	{active=2}
   [junit4]   2> ##      shardsWithoutLeader	0
   [junit4]   2> ##    totalReplicas	6
   [junit4]   2> ##      activeReplicas	6
   [junit4]   2> ##      inactiveReplicas	0
   [junit4]   2> ##    totalActiveDocs	0
   [junit4]   2> ##      bufferedDocs	0
   [junit4]   2> ##      maxActiveSliceDocs	0
   [junit4]   2> ##      minActiveSliceDocs	0
   [junit4]   2> ##      avgActiveSliceDocs	0
   [junit4]   2> ##    totalInactiveDocs	0
   [junit4]   2> ##      maxInactiveSliceDocs	0
   [junit4]   2> ##      minInactiveSliceDocs	0
   [junit4]   2> ##      avgInactiveSliceDocs	NaN
   [junit4]   2> ##    totalActiveBytes	20,480
   [junit4]   2> ##      maxActiveSliceBytes	10,240
   [junit4]   2> ##      minActiveSliceBytes	10,240
   [junit4]   2> ##      avgActiveSliceBytes	10,240
   [junit4]   2> ##    totalInactiveBytes	0
   [junit4]   2> ##      maxInactiveSliceBytes	0
   [junit4]   2> ##      minInactiveSliceBytes	0
   [junit4]   2> ##      avgInactiveSliceBytes	NaN
   [junit4]   2> ##    totalActiveDeletedDocs	0
   [junit4]   2> ## Max replicas per node:	2
   [junit4]   2> ## Min replicas per node:	0
   [junit4]   2> ## Total replicas:		6
   [junit4]   2> ## * policiesTest		6
   [junit4]   2> ##		- active           6
   [junit4]   2> ######### Solr op counts ##########
   [junit4]   2> ##		- CREATE             1
   [junit4]   2> ##		- CREATESHARD        1
   [junit4]   2> ##		- autoscaling        1
   [junit4]   2> ######### Autoscaling event counts ###########
   [junit4]   2> 
   [junit4]   2> 611726 INFO  (TEST-TestSimPolicyCloud.testCreateCollectionSplitShard-seed#[ACA94112DC23343A]) [    ] o.a.s.SolrTestCaseJ4 ###Starting testCreateCollectionSplitShard
   [junit4]   2> 611726 DEBUG (TEST-TestSimPolicyCloud.testCreateCollectionSplitShard-seed#[ACA94112DC23343A]) [    ] o.a.s.c.a.OverseerTriggerThread Refreshing /autoscaling.json with znode version 11
   [junit4]   2> 611726 DEBUG (Simulated OverseerAutoScalingTriggerThread) [    ] o.a.s.c.a.OverseerTriggerThread Processed trigger updates upto znodeVersion 11
   [junit4]   2> 611726 INFO  (TEST-TestSimPolicyCloud.testCreateCollectionSplitShard-seed#[ACA94112DC23343A]) [    ] o.a.s.c.a.s.SimCloudManager === Restarting OverseerTriggerThread and clearing object cache...
   [junit4]   2> 611726 DEBUG (Simulated OverseerAutoScalingTriggerThread) [    ] o.a.s.c.a.OverseerTriggerThread -- clean old nodeLost markers
   [junit4]   2> 611726 DEBUG (Simulated OverseerAutoScalingTriggerThread) [    ] o.a.s.c.a.OverseerTriggerThread -- clean old nodeAdded markers
   [junit4]   2> 611726 DEBUG (TEST-TestSimPolicyCloud.testCreateCollectionSplitShard-seed#[ACA94112DC23343A]) [    ] o.a.s.c.a.ScheduledTriggers Shutting down scheduled thread pool executor now
   [junit4]   2> 611726 DEBUG (TEST-TestSimPolicyCloud.testCreateCollectionSplitShard-seed#[ACA94112DC23343A]) [    ] o.a.s.c.a.ScheduledTriggers Shutting down action executor now
   [junit4]   2> 611726 DEBUG (TEST-TestSimPolicyCloud.testCreateCollectionSplitShard-seed#[ACA94112DC23343A]) [    ] o.a.s.c.a.ScheduledTriggers Awaiting termination for action executor
   [junit4]   2> 611726 DEBUG (TEST-TestSimPolicyCloud.testCreateCollectionSplitShard-seed#[ACA94112DC23343A]) [    ] o.a.s.c.a.ScheduledTriggers Awaiting termination for scheduled thread pool executor
   [junit4]   2> 611726 WARN  (Simulated OverseerAutoScalingTriggerThread) [    ] o.a.s.c.a.OverseerTriggerThread Interrupted
   [junit4]   2> java.lang.InterruptedException: null
   [junit4]   2> 	at java.util.concurrent.locks.AbstractQueuedSynchronizer.acquireInterruptibly(AbstractQueuedSynchronizer.java:1247) ~[?:?]
   [junit4]   2> 	at java.util.concurrent.locks.ReentrantLock.lockInterruptibly(ReentrantLock.java:317) ~[?:?]
   [junit4]   2> 	at org.apache.solr.cloud.autoscaling.OverseerTriggerThread.run(OverseerTriggerThread.java:177) [java/:?]
   [junit4]   2> 	at java.lang.Thread.run(Thread.java:844) [?:?]
   [junit4]   2> 611727 DEBUG (TEST-TestSimPolicyCloud.testCreateCollectionSplitShard-seed#[ACA94112DC23343A]) [    ] o.a.s.c.a.ScheduledTriggers ScheduledTriggers closed completely
   [junit4]   2> 611727 DEBUG (TEST-TestSimPolicyCloud.testCreateCollectionSplitShard-seed#[ACA94112DC23343A]) [    ] o.a.s.c.a.OverseerTriggerThread OverseerTriggerThread has been closed explicitly
   [junit4]   2> 611736 DEBUG (Simulated OverseerAutoScalingTriggerThread) [    ] o.a.s.c.a.OverseerTriggerThread Adding .auto_add_replicas and .scheduled_maintenance triggers
   [junit4]   2> 611736 DEBUG (Simulated OverseerAutoScalingTriggerThread) [    ] o.a.s.c.a.OverseerTriggerThread Refreshing /autoscaling.json with znode version 12
   [junit4]   2> 611737 DEBUG (Simulated OverseerAutoScalingTriggerThread) [    ] o.a.s.c.a.OverseerTriggerThread Current znodeVersion 12, lastZnodeVersion -1
   [junit4]   2> 611737 DEBUG (Simulated OverseerAutoScalingTriggerThread) [    ] o.a.s.c.a.OverseerTriggerThread Processed trigger updates upto znodeVersion 12
   [junit4]   2> 611737 DEBUG (Simulated OverseerAutoScalingTriggerThread) [    ] o.a.s.c.a.NodeLostTrigger NodeLostTrigger .auto_add_replicas - Initial livenodes: [127.0.0.1:10001_solr, 127.0.0.1:10004_solr, 127.0.0.1:10000_solr, 127.0.0.1:10002_solr, 127.0.0.1:10003_solr]
   [junit4]   2> 611738 DEBUG (Simulated OverseerAutoScalingTriggerThread) [    ] o.a.s.c.a.OverseerTriggerThread -- clean old nodeAdded markers
   [junit4]   2> 611738 DEBUG (Simulated OverseerAutoScalingTriggerThread) [    ] o.a.s.c.a.OverseerTriggerThread Current znodeVersion 12, lastZnodeVersion 12
   [junit4]   2> 611738 DEBUG (ScheduledTrigger-3791-thread-2) [    ] o.a.s.c.a.NodeLostTrigger Running NodeLostTrigger: .auto_add_replicas with currently live nodes: 5
   [junit4]   2> 611767 DEBUG (ScheduledTrigger-3791-thread-1) [    ] o.a.s.c.a.NodeLostTrigger Running NodeLostTrigger: .auto_add_replicas with currently live nodes: 5
   [junit4]   2> 611789 DEBUG (ScheduledTrigger-3791-thread-4) [    ] o.a.s.c.a.NodeLostTrigger Running NodeLostTrigger: .auto_add_replicas with currently live nodes: 5
   [junit4]   2> 611819 DEBUG (ScheduledTrigger-3791-thread-1) [    ] o.a.s.c.a.NodeLostTrigger Running NodeLostTrigger: .auto_add_replicas with currently live nodes: 5
   [junit4]   2> 611849 DEBUG (ScheduledTrigger-3791-thread-3) [    ] o.a.s.c.a.NodeLostTrigger Running NodeLostTrigger: .auto_add_replicas with currently live nodes: 5
   [junit4]   2> 611879 DEBUG (ScheduledTrigger-3791-thread-1) [    ] o.a.s.c.a.NodeLostTrigger Running NodeLostTrigger: .auto_add_replicas with currently live nodes: 5
   [junit4]   2> 611909 DEBUG (ScheduledTrigger-3791-thread-1) [    ] o.a.s.c.a.NodeLostTrigger Running NodeLostTrigger: .auto_add_replicas with currently live nodes: 5
   [junit4]   2> 611937 DEBUG (ScheduledTrigger-3791-thread-1) [    ] o.a.s.c.a.NodeLostTrigger Running NodeLostTrigger: .auto_add_replicas with currently live nodes: 5
   [junit4]   2> 611939 DEBUG (simCloudManagerPool-3790-thread-1) [    ] o.a.s.c.a.s.SimClusterStateProvider ** creating new collection states, currentVersion=34
   [junit4]   2> 611939 DEBUG (simCloudManagerPool-3790-thread-1) [    ] o.a.s.c.a.s.SimClusterStateProvider ** saved cluster state version 34
   [junit4]   2> 611940 DEBUG (simCloudManagerPool-3790-thread-1) [    ] o.a.s.c.a.AutoScalingHandler Verified autoscaling configuration
   [junit4]   2> 611940 DEBUG (simCloudManagerPool-3790-thread-1) [    ] o.a.s.c.a.OverseerTriggerThread Refreshing /autoscaling.json with znode version 13
   [junit4]   2> 611940 DEBUG (Simulated OverseerAutoScalingTriggerThread) [    ] o.a.s.c.a.OverseerTriggerThread Processed trigger updates upto znodeVersion 13
   [junit4]   2> 611940 DEBUG (Simulated OverseerAutoScalingTriggerThread) [    ] o.a.s.c.a.OverseerTriggerThread -- clean old nodeAdded markers
   [junit4]   2> 611940 DEBUG (Simulated OverseerAutoScalingTriggerThread) [    ] o.a.s.c.a.OverseerTriggerThread Current znodeVersion 13, lastZnodeVersion 13
   [junit4]   2> 611941 DEBUG (simCloudManagerPool-3790-thread-2) [    ] o.a.s.c.a.s.SimClusterStateProvider -- simCreateCollection testCreateCollectionSplitShard, currentVersion=35
   [junit4]   2> 611941 DEBUG (simCloudManagerPool-3790-thread-2) [    ] o.a.s.c.a.s.SimClusterStateProvider ** creating new collection states, currentVersion=35
   [junit4]   2> 611941 DEBUG (simCloudManagerPool-3790-thread-2) [    ] o.a.s.c.a.s.SimClusterStateProvider ** saved cluster state version 35
   [junit4]   2> 611956 DEBUG (simCloudManagerPool-3790-thread-2) [    ] o.a.s.c.a.s.SimClusterStateProvider ** creating new collection states, currentVersion=36
   [junit4]   2> 611956 DEBUG (simCloudManagerPool-3790-thread-2) [    ] o.a.s.c.a.s.SimClusterStateProvider ** saved cluster state version 36
   [junit4]   2> 611958 DEBUG (simCloudManagerPool-3790-thread-2) [    ] o.a.s.c.a.s.SimClusterStateProvider -- finished createCollection testCreateCollectionSplitShard, currentVersion=37
   [junit4]   2> 611962 DEBUG (ScheduledTrigger-3791-thread-1) [    ] o.a.s.c.a.NodeLostTrigger Running NodeLostTrigger: .auto_add_replicas with currently live nodes: 5
   [junit4]   2> 611973 DEBUG (simCloudManagerPool-3790-thread-3) [    ] o.a.s.c.a.s.SimClusterStateProvider ** creating new collection states, currentVersion=37
   [junit4]   2> 611974 DEBUG (simCloudManagerPool-3790-thread-3) [    ] o.a.s.c.a.s.SimClusterStateProvider ** saved cluster state version 37
   [junit4]   2> 611974 DEBUG (simCloudManagerPool-3790-thread-5) [    ] o.a.s.c.a.s.SimClusterStateProvider -- elected new leader for testCreateCollectionSplitShard / shard1 (currentVers

[...truncated too long message...]

ed cluster state version 47
   [junit4]   2> 612502 DEBUG (simCloudManagerPool-3793-thread-3) [    ] o.a.s.c.a.s.SimClusterStateProvider -- finished createCollection metricsTest, currentVersion=48
   [junit4]   2> 612515 DEBUG (simCloudManagerPool-3793-thread-4) [    ] o.a.s.c.a.s.SimClusterStateProvider ** creating new collection states, currentVersion=48
   [junit4]   2> 612515 DEBUG (simCloudManagerPool-3793-thread-4) [    ] o.a.s.c.a.s.SimClusterStateProvider ** saved cluster state version 48
   [junit4]   2> 612515 DEBUG (TEST-TestSimPolicyCloud.testMetricsTag-seed#[ACA94112DC23343A]) [    ] o.a.s.c.a.s.SimClusterStateProvider ** creating new collection states, currentVersion=49
   [junit4]   2> 612516 DEBUG (TEST-TestSimPolicyCloud.testMetricsTag-seed#[ACA94112DC23343A]) [    ] o.a.s.c.a.s.SimClusterStateProvider ** saved cluster state version 49
   [junit4]   2> 612516 DEBUG (simCloudManagerPool-3793-thread-5) [    ] o.a.s.c.a.s.SimClusterStateProvider -- elected new leader for metricsTest / shard1 (currentVersion=49): {"core_node1":{
   [junit4]   2>     "core":"metricsTest_shard1_replica_n1",
   [junit4]   2>     "shard":"shard1",
   [junit4]   2>     "collection":"metricsTest",
   [junit4]   2>     "node_name":"127.0.0.1:10003_solr",
   [junit4]   2>     "type":"NRT",
   [junit4]   2>     "leader":"true",
   [junit4]   2>     "SEARCHER.searcher.maxDoc":0,
   [junit4]   2>     "SEARCHER.searcher.deletedDocs":0,
   [junit4]   2>     "INDEX.sizeInBytes":10240,
   [junit4]   2>     "state":"active",
   [junit4]   2>     "INDEX.sizeInGB":9.5367431640625E-6,
   [junit4]   2>     "SEARCHER.searcher.numDocs":0}}
   [junit4]   2> 612517 INFO  (TEST-TestSimPolicyCloud.testMetricsTag-seed#[ACA94112DC23343A]) [    ] o.a.s.SolrTestCaseJ4 ###Ending testMetricsTag
   [junit4]   2> 612517 DEBUG (TEST-TestSimPolicyCloud.testMetricsTag-seed#[ACA94112DC23343A]) [    ] o.a.s.c.a.s.SimClusterStateProvider ** creating new collection states, currentVersion=50
   [junit4]   2> 612517 DEBUG (TEST-TestSimPolicyCloud.testMetricsTag-seed#[ACA94112DC23343A]) [    ] o.a.s.c.a.s.SimClusterStateProvider ** saved cluster state version 50
   [junit4]   2> 612517 INFO  (TEST-TestSimPolicyCloud.testMetricsTag-seed#[ACA94112DC23343A]) [    ] o.a.s.c.a.s.SimSolrCloudTestCase #######################################
   [junit4]   2> ############ CLUSTER STATE ############
   [junit4]   2> #######################################
   [junit4]   2> ## Live nodes:		5
   [junit4]   2> ## Empty nodes:	4
   [junit4]   2> ## Dead nodes:		0
   [junit4]   2> ## Collections:
   [junit4]   2> ##  * metricsTest
   [junit4]   2> ##    shardsTotal	1
   [junit4]   2> ##    shardsState	{active=1}
   [junit4]   2> ##      shardsWithoutLeader	0
   [junit4]   2> ##    totalReplicas	1
   [junit4]   2> ##      activeReplicas	1
   [junit4]   2> ##      inactiveReplicas	0
   [junit4]   2> ##    totalActiveDocs	0
   [junit4]   2> ##      bufferedDocs	0
   [junit4]   2> ##      maxActiveSliceDocs	0
   [junit4]   2> ##      minActiveSliceDocs	0
   [junit4]   2> ##      avgActiveSliceDocs	0
   [junit4]   2> ##    totalInactiveDocs	0
   [junit4]   2> ##      maxInactiveSliceDocs	0
   [junit4]   2> ##      minInactiveSliceDocs	0
   [junit4]   2> ##      avgInactiveSliceDocs	NaN
   [junit4]   2> ##    totalActiveBytes	10,240
   [junit4]   2> ##      maxActiveSliceBytes	10,240
   [junit4]   2> ##      minActiveSliceBytes	10,240
   [junit4]   2> ##      avgActiveSliceBytes	10,240
   [junit4]   2> ##    totalInactiveBytes	0
   [junit4]   2> ##      maxInactiveSliceBytes	0
   [junit4]   2> ##      minInactiveSliceBytes	0
   [junit4]   2> ##      avgInactiveSliceBytes	NaN
   [junit4]   2> ##    totalActiveDeletedDocs	0
   [junit4]   2> ## Max replicas per node:	1
   [junit4]   2> ## Min replicas per node:	0
   [junit4]   2> ## Total replicas:		1
   [junit4]   2> ## * metricsTest		1
   [junit4]   2> ##		- active           1
   [junit4]   2> ######### Solr op counts ##########
   [junit4]   2> ##		- CREATE             1
   [junit4]   2> ##		- autoscaling        2
   [junit4]   2> ######### Autoscaling event counts ###########
   [junit4]   2> 
   [junit4]   2> 612518 DEBUG (ScheduledTrigger-3794-thread-4) [    ] o.a.s.c.a.NodeLostTrigger Running NodeLostTrigger: .auto_add_replicas with currently live nodes: 5
   [junit4]   2> 612518 WARN  (Simulated OverseerAutoScalingTriggerThread) [    ] o.a.s.c.a.OverseerTriggerThread OverseerTriggerThread woken up but we are closed, exiting.
   [junit4]   2> 612518 DEBUG (SUITE-TestSimPolicyCloud-seed#[ACA94112DC23343A]-worker) [    ] o.a.s.c.a.ScheduledTriggers Shutting down scheduled thread pool executor now
   [junit4]   2> 612518 DEBUG (SUITE-TestSimPolicyCloud-seed#[ACA94112DC23343A]-worker) [    ] o.a.s.c.a.ScheduledTriggers Shutting down action executor now
   [junit4]   2> 612519 DEBUG (SUITE-TestSimPolicyCloud-seed#[ACA94112DC23343A]-worker) [    ] o.a.s.c.a.ScheduledTriggers Awaiting termination for action executor
   [junit4]   2> 612519 DEBUG (SUITE-TestSimPolicyCloud-seed#[ACA94112DC23343A]-worker) [    ] o.a.s.c.a.ScheduledTriggers Awaiting termination for scheduled thread pool executor
   [junit4]   2> 612519 DEBUG (SUITE-TestSimPolicyCloud-seed#[ACA94112DC23343A]-worker) [    ] o.a.s.c.a.ScheduledTriggers ScheduledTriggers closed completely
   [junit4]   2> 612519 DEBUG (SUITE-TestSimPolicyCloud-seed#[ACA94112DC23343A]-worker) [    ] o.a.s.c.a.OverseerTriggerThread OverseerTriggerThread has been closed explicitly
   [junit4]   2> NOTE: leaving temporary files on disk at: /Users/jenkins/workspace/Lucene-Solr-master-MacOSX/solr/build/solr-core/test/J1/temp/solr.cloud.autoscaling.sim.TestSimPolicyCloud_ACA94112DC23343A-001
   [junit4]   2> NOTE: test params are: codec=Lucene80, sim=Asserting(org.apache.lucene.search.similarities.AssertingSimilarity@2ff4c326), locale=it-CH, timezone=Africa/Libreville
   [junit4]   2> NOTE: Mac OS X 10.11.6 x86_64/Oracle Corporation 9 (64-bit)/cpus=3,threads=1,free=159709704,total=332132352
   [junit4]   2> NOTE: All tests run in this JVM: [TestDocumentBuilder, DistributedQueueTest, ClusterStateUpdateTest, TestPayloadCheckQParserPlugin, TestReloadAndDeleteDocs, RecoveryAfterSoftCommitTest, TestSimClusterStateProvider, LukeRequestHandlerTest, TestStressRecovery, ParsingFieldUpdateProcessorsTest, InfoHandlerTest, TestSchemaSimilarityResource, BlobRepositoryCloudTest, DocValuesMultiTest, TestBlendedInfixSuggestions, BlockCacheTest, TriggerCooldownIntegrationTest, JvmMetricsTest, SubstringBytesRefFilterTest, SpatialRPTFieldTypeTest, RankQueryTest, RandomizedTaggerTest, UniqFieldsUpdateProcessorFactoryTest, SimplePostToolTest, URLClassifyProcessorTest, TestSurroundQueryParser, BigEndianAscendingWordDeserializerTest, IndexSchemaRuntimeFieldTest, BadIndexSchemaTest, DistributedTermsComponentTest, SignificantTermsQParserPluginTest, TestBinaryField, ShardRoutingCustomTest, TestCustomDocTransformer, CoreAdminRequestStatusTest, SampleTest, ChaosMonkeySafeLeaderTest, DistributedFacetExistsSmallTest, TestCorePropertiesReload, ZkSolrClientTest, TestSolrFieldCacheBean, TestSystemCollAutoCreate, VMParamsZkACLAndCredentialsProvidersTest, TestStressLiveNodes, TestRequestStatusCollectionAPI, CheckHdfsIndexTest, ShufflingReplicaListTransformerTest, TestHttpShardHandlerFactory, TestFoldingMultitermQuery, TestCollapseQParserPlugin, ResourceLoaderTest, TestLuceneMatchVersion, TestCollectionsAPIViaSolrCloudCluster, TestFreeTextSuggestions, TestSolrCloudWithKerberosAlt, TestQueryUtils, CurrencyFieldTypeTest, SharedFSAutoReplicaFailoverTest, TestCloudManagedSchema, TestSolrQueryParser, TestStressUserVersions, OverriddenZkACLAndCredentialsProvidersTest, TestReloadDeadlock, CoreAdminHandlerTest, TestDocTermOrdsUninvertLimit, TestFieldCollectionResource, SystemLogListenerTest, LeaderVoteWaitTimeoutTest, ReplaceNodeTest, ConfigureRecoveryStrategyTest, TestSearcherReuse, TestUpdate, TestFastLRUCache, HighlighterConfigTest, HttpSolrCallGetCoreTest, TestRandomCollapseQParserPlugin, DistributedSpellCheckComponentTest, TestCoreContainer, AnalyticsMergeStrategyTest, DocValuesNotIndexedTest, SolrGangliaReporterTest, ClassificationUpdateProcessorFactoryTest, TestSimExecutePlanAction, TestChildDocTransformer, TestNoOpRegenerator, TriLevelCompositeIdRoutingTest, DocumentBuilderTest, AsyncCallRequestStatusResponseTest, TestLegacyTerms, TestRealTimeGet, PluginInfoTest, HighlighterTest, TestNestedDocsSort, TestDelegationWithHadoopAuth, TestMergePolicyConfig, SearchHandlerTest, TestConfigSetsAPIZkFailure, TestPullReplica, ZkStateReaderTest, FullHLLTest, TestUtils, TestExceedMaxTermLength, CustomHighlightComponentTest, TestSimPolicyCloud]
   [junit4] Completed [176/836 (1!)] on J1 in 4.04s, 7 tests, 1 failure, 1 skipped <<< FAILURES!

[...truncated 44737 lines...]
[repro] Jenkins log URL: https://jenkins.thetaphi.de/job/Lucene-Solr-master-MacOSX/4948/consoleText

[repro] Revision: d7b878e90c6ce185d799f1fa554e8c3770793f80

[repro] Ant options: "-Dargs=-XX:-UseCompressedOops -XX:+UseSerialGC"
[repro] Repro line:  ant test  -Dtestcase=TestSimPolicyCloud -Dtests.method=testCreateCollectionAddReplica -Dtests.seed=ACA94112DC23343A -Dtests.slow=true -Dtests.locale=it-CH -Dtests.timezone=Africa/Libreville -Dtests.asserts=true -Dtests.file.encoding=ISO-8859-1

[repro] ant clean

[...truncated 6 lines...]
[repro] Test suites by module:
[repro]    solr/core
[repro]       TestSimPolicyCloud
[repro] ant compile-test

[...truncated 3600 lines...]
[repro] ant test-nocompile -Dtests.dups=5 -Dtests.maxfailures=5 -Dtests.class="*.TestSimPolicyCloud" -Dtests.showOutput=onerror "-Dargs=-XX:-UseCompressedOops -XX:+UseSerialGC" -Dtests.seed=ACA94112DC23343A -Dtests.slow=true -Dtests.locale=it-CH -Dtests.timezone=Africa/Libreville -Dtests.asserts=true -Dtests.file.encoding=ISO-8859-1

[...truncated 103 lines...]
[repro] Failures:
[repro]   0/5 failed: org.apache.solr.cloud.autoscaling.sim.TestSimPolicyCloud
[repro] Exiting with code 0

[...truncated 70 lines...]

[JENKINS] Lucene-Solr-master-MacOSX (64bit/jdk-9) - Build # 4949 - Still Unstable!

Posted by Policeman Jenkins Server <je...@thetaphi.de>.
Build: https://jenkins.thetaphi.de/job/Lucene-Solr-master-MacOSX/4949/
Java: 64bit/jdk-9 -XX:+UseCompressedOops -XX:+UseSerialGC

5 tests failed.
FAILED:  org.apache.solr.update.RootFieldTest.testLegacyBlockProcessing

Error Message:
ERROR: [doc=11] unknown field 'name'

Stack Trace:
org.apache.solr.common.SolrException: ERROR: [doc=11] unknown field 'name'
	at __randomizedtesting.SeedInfo.seed([DF8DBCAF454B18F5:BEB7AA1384ACE6C4]:0)
	at org.apache.solr.update.DocumentBuilder.toDocument(DocumentBuilder.java:226)
	at org.apache.solr.update.AddUpdateCommand.getLuceneDocument(AddUpdateCommand.java:105)
	at org.apache.solr.update.DirectUpdateHandler2.updateDocOrDocValues(DirectUpdateHandler2.java:963)
	at org.apache.solr.update.DirectUpdateHandler2.doNormalUpdate(DirectUpdateHandler2.java:342)
	at org.apache.solr.update.DirectUpdateHandler2.addDoc0(DirectUpdateHandler2.java:289)
	at org.apache.solr.update.DirectUpdateHandler2.addDoc(DirectUpdateHandler2.java:236)
	at org.apache.solr.update.processor.RunUpdateProcessor.processAdd(RunUpdateProcessorFactory.java:67)
	at org.apache.solr.update.processor.UpdateRequestProcessor.processAdd(UpdateRequestProcessor.java:55)
	at org.apache.solr.update.processor.DistributedUpdateProcessor.doLocalAdd(DistributedUpdateProcessor.java:943)
	at org.apache.solr.update.processor.DistributedUpdateProcessor.versionAdd(DistributedUpdateProcessor.java:1159)
	at org.apache.solr.update.processor.DistributedUpdateProcessor.processAdd(DistributedUpdateProcessor.java:648)
	at org.apache.solr.update.processor.LogUpdateProcessorFactory$LogUpdateProcessor.processAdd(LogUpdateProcessorFactory.java:103)
	at org.apache.solr.handler.loader.JavabinLoader$1.update(JavabinLoader.java:118)
	at org.apache.solr.client.solrj.request.JavaBinUpdateRequestCodec$1.readOuterMostDocIterator(JavaBinUpdateRequestCodec.java:188)
	at org.apache.solr.client.solrj.request.JavaBinUpdateRequestCodec$1.readIterator(JavaBinUpdateRequestCodec.java:144)
	at org.apache.solr.common.util.JavaBinCodec.readObject(JavaBinCodec.java:330)
	at org.apache.solr.common.util.JavaBinCodec.readVal(JavaBinCodec.java:275)
	at org.apache.solr.client.solrj.request.JavaBinUpdateRequestCodec$1.readNamedList(JavaBinUpdateRequestCodec.java:130)
	at org.apache.solr.common.util.JavaBinCodec.readObject(JavaBinCodec.java:295)
	at org.apache.solr.common.util.JavaBinCodec.readVal(JavaBinCodec.java:275)
	at org.apache.solr.common.util.JavaBinCodec.unmarshal(JavaBinCodec.java:188)
	at org.apache.solr.client.solrj.request.JavaBinUpdateRequestCodec.unmarshal(JavaBinUpdateRequestCodec.java:195)
	at org.apache.solr.handler.loader.JavabinLoader.parseAndLoadDocs(JavabinLoader.java:129)
	at org.apache.solr.handler.loader.JavabinLoader.load(JavabinLoader.java:71)
	at org.apache.solr.handler.UpdateRequestHandler$1.load(UpdateRequestHandler.java:97)
	at org.apache.solr.handler.ContentStreamHandlerBase.handleRequestBody(ContentStreamHandlerBase.java:68)
	at org.apache.solr.handler.RequestHandlerBase.handleRequest(RequestHandlerBase.java:199)
	at org.apache.solr.core.SolrCore.execute(SolrCore.java:2541)
	at org.apache.solr.client.solrj.embedded.EmbeddedSolrServer.request(EmbeddedSolrServer.java:191)
	at org.apache.solr.client.solrj.SolrRequest.process(SolrRequest.java:194)
	at org.apache.solr.client.solrj.SolrClient.add(SolrClient.java:177)
	at org.apache.solr.client.solrj.SolrClient.add(SolrClient.java:138)
	at org.apache.solr.client.solrj.SolrClient.add(SolrClient.java:156)
	at org.apache.solr.update.RootFieldTest.testLegacyBlockProcessing(RootFieldTest.java:68)
	at java.base/jdk.internal.reflect.NativeMethodAccessorImpl.invoke0(Native Method)
	at java.base/jdk.internal.reflect.NativeMethodAccessorImpl.invoke(NativeMethodAccessorImpl.java:62)
	at java.base/jdk.internal.reflect.DelegatingMethodAccessorImpl.invoke(DelegatingMethodAccessorImpl.java:43)
	at java.base/java.lang.reflect.Method.invoke(Method.java:564)
	at com.carrotsearch.randomizedtesting.RandomizedRunner.invoke(RandomizedRunner.java:1742)
	at com.carrotsearch.randomizedtesting.RandomizedRunner$8.evaluate(RandomizedRunner.java:935)
	at com.carrotsearch.randomizedtesting.RandomizedRunner$9.evaluate(RandomizedRunner.java:971)
	at com.carrotsearch.randomizedtesting.RandomizedRunner$10.evaluate(RandomizedRunner.java:985)
	at org.junit.rules.ExpectedException$ExpectedExceptionStatement.evaluate(ExpectedException.java:110)
	at com.carrotsearch.randomizedtesting.rules.SystemPropertiesRestoreRule$1.evaluate(SystemPropertiesRestoreRule.java:57)
	at org.apache.lucene.util.TestRuleSetupTeardownChained$1.evaluate(TestRuleSetupTeardownChained.java:49)
	at org.apache.lucene.util.AbstractBeforeAfterRule$1.evaluate(AbstractBeforeAfterRule.java:45)
	at org.apache.lucene.util.TestRuleThreadAndTestName$1.evaluate(TestRuleThreadAndTestName.java:48)
	at org.apache.lucene.util.TestRuleIgnoreAfterMaxFailures$1.evaluate(TestRuleIgnoreAfterMaxFailures.java:64)
	at org.apache.lucene.util.TestRuleMarkFailure$1.evaluate(TestRuleMarkFailure.java:47)
	at com.carrotsearch.randomizedtesting.rules.StatementAdapter.evaluate(StatementAdapter.java:36)
	at com.carrotsearch.randomizedtesting.ThreadLeakControl$StatementRunner.run(ThreadLeakControl.java:368)
	at com.carrotsearch.randomizedtesting.ThreadLeakControl.forkTimeoutingTask(ThreadLeakControl.java:817)
	at com.carrotsearch.randomizedtesting.ThreadLeakControl$3.evaluate(ThreadLeakControl.java:468)
	at com.carrotsearch.randomizedtesting.RandomizedRunner.runSingleTest(RandomizedRunner.java:944)
	at com.carrotsearch.randomizedtesting.RandomizedRunner$5.evaluate(RandomizedRunner.java:830)
	at com.carrotsearch.randomizedtesting.RandomizedRunner$6.evaluate(RandomizedRunner.java:880)
	at com.carrotsearch.randomizedtesting.RandomizedRunner$7.evaluate(RandomizedRunner.java:891)
	at com.carrotsearch.randomizedtesting.rules.StatementAdapter.evaluate(StatementAdapter.java:36)
	at com.carrotsearch.randomizedtesting.rules.SystemPropertiesRestoreRule$1.evaluate(SystemPropertiesRestoreRule.java:57)
	at org.apache.lucene.util.AbstractBeforeAfterRule$1.evaluate(AbstractBeforeAfterRule.java:45)
	at com.carrotsearch.randomizedtesting.rules.StatementAdapter.evaluate(StatementAdapter.java:36)
	at org.apache.lucene.util.TestRuleStoreClassName$1.evaluate(TestRuleStoreClassName.java:41)
	at com.carrotsearch.randomizedtesting.rules.NoShadowingOrOverridesOnMethodsRule$1.evaluate(NoShadowingOrOverridesOnMethodsRule.java:40)
	at com.carrotsearch.randomizedtesting.rules.NoShadowingOrOverridesOnMethodsRule$1.evaluate(NoShadowingOrOverridesOnMethodsRule.java:40)
	at com.carrotsearch.randomizedtesting.rules.StatementAdapter.evaluate(StatementAdapter.java:36)
	at com.carrotsearch.randomizedtesting.rules.StatementAdapter.evaluate(StatementAdapter.java:36)
	at org.apache.lucene.util.TestRuleAssertionsRequired$1.evaluate(TestRuleAssertionsRequired.java:53)
	at org.apache.lucene.util.TestRuleMarkFailure$1.evaluate(TestRuleMarkFailure.java:47)
	at org.apache.lucene.util.TestRuleIgnoreAfterMaxFailures$1.evaluate(TestRuleIgnoreAfterMaxFailures.java:64)
	at org.apache.lucene.util.TestRuleIgnoreTestSuites$1.evaluate(TestRuleIgnoreTestSuites.java:54)
	at com.carrotsearch.randomizedtesting.rules.StatementAdapter.evaluate(StatementAdapter.java:36)
	at com.carrotsearch.randomizedtesting.ThreadLeakControl$StatementRunner.run(ThreadLeakControl.java:368)
	at java.base/java.lang.Thread.run(Thread.java:844)


FAILED:  org.apache.solr.update.RootFieldTest.testLegacyBlockProcessing

Error Message:
ERROR: [doc=11] unknown field 'name'

Stack Trace:
org.apache.solr.common.SolrException: ERROR: [doc=11] unknown field 'name'
	at __randomizedtesting.SeedInfo.seed([DF8DBCAF454B18F5:BEB7AA1384ACE6C4]:0)
	at org.apache.solr.update.DocumentBuilder.toDocument(DocumentBuilder.java:226)
	at org.apache.solr.update.AddUpdateCommand.getLuceneDocument(AddUpdateCommand.java:105)
	at org.apache.solr.update.DirectUpdateHandler2.updateDocOrDocValues(DirectUpdateHandler2.java:963)
	at org.apache.solr.update.DirectUpdateHandler2.doNormalUpdate(DirectUpdateHandler2.java:342)
	at org.apache.solr.update.DirectUpdateHandler2.addDoc0(DirectUpdateHandler2.java:289)
	at org.apache.solr.update.DirectUpdateHandler2.addDoc(DirectUpdateHandler2.java:236)
	at org.apache.solr.update.processor.RunUpdateProcessor.processAdd(RunUpdateProcessorFactory.java:67)
	at org.apache.solr.update.processor.UpdateRequestProcessor.processAdd(UpdateRequestProcessor.java:55)
	at org.apache.solr.update.processor.DistributedUpdateProcessor.doLocalAdd(DistributedUpdateProcessor.java:943)
	at org.apache.solr.update.processor.DistributedUpdateProcessor.versionAdd(DistributedUpdateProcessor.java:1159)
	at org.apache.solr.update.processor.DistributedUpdateProcessor.processAdd(DistributedUpdateProcessor.java:648)
	at org.apache.solr.update.processor.LogUpdateProcessorFactory$LogUpdateProcessor.processAdd(LogUpdateProcessorFactory.java:103)
	at org.apache.solr.handler.loader.JavabinLoader$1.update(JavabinLoader.java:118)
	at org.apache.solr.client.solrj.request.JavaBinUpdateRequestCodec$1.readOuterMostDocIterator(JavaBinUpdateRequestCodec.java:188)
	at org.apache.solr.client.solrj.request.JavaBinUpdateRequestCodec$1.readIterator(JavaBinUpdateRequestCodec.java:144)
	at org.apache.solr.common.util.JavaBinCodec.readObject(JavaBinCodec.java:330)
	at org.apache.solr.common.util.JavaBinCodec.readVal(JavaBinCodec.java:275)
	at org.apache.solr.client.solrj.request.JavaBinUpdateRequestCodec$1.readNamedList(JavaBinUpdateRequestCodec.java:130)
	at org.apache.solr.common.util.JavaBinCodec.readObject(JavaBinCodec.java:295)
	at org.apache.solr.common.util.JavaBinCodec.readVal(JavaBinCodec.java:275)
	at org.apache.solr.common.util.JavaBinCodec.unmarshal(JavaBinCodec.java:188)
	at org.apache.solr.client.solrj.request.JavaBinUpdateRequestCodec.unmarshal(JavaBinUpdateRequestCodec.java:195)
	at org.apache.solr.handler.loader.JavabinLoader.parseAndLoadDocs(JavabinLoader.java:129)
	at org.apache.solr.handler.loader.JavabinLoader.load(JavabinLoader.java:71)
	at org.apache.solr.handler.UpdateRequestHandler$1.load(UpdateRequestHandler.java:97)
	at org.apache.solr.handler.ContentStreamHandlerBase.handleRequestBody(ContentStreamHandlerBase.java:68)
	at org.apache.solr.handler.RequestHandlerBase.handleRequest(RequestHandlerBase.java:199)
	at org.apache.solr.core.SolrCore.execute(SolrCore.java:2541)
	at org.apache.solr.client.solrj.embedded.EmbeddedSolrServer.request(EmbeddedSolrServer.java:191)
	at org.apache.solr.client.solrj.SolrRequest.process(SolrRequest.java:194)
	at org.apache.solr.client.solrj.SolrClient.add(SolrClient.java:177)
	at org.apache.solr.client.solrj.SolrClient.add(SolrClient.java:138)
	at org.apache.solr.client.solrj.SolrClient.add(SolrClient.java:156)
	at org.apache.solr.update.RootFieldTest.testLegacyBlockProcessing(RootFieldTest.java:68)
	at java.base/jdk.internal.reflect.NativeMethodAccessorImpl.invoke0(Native Method)
	at java.base/jdk.internal.reflect.NativeMethodAccessorImpl.invoke(NativeMethodAccessorImpl.java:62)
	at java.base/jdk.internal.reflect.DelegatingMethodAccessorImpl.invoke(DelegatingMethodAccessorImpl.java:43)
	at java.base/java.lang.reflect.Method.invoke(Method.java:564)
	at com.carrotsearch.randomizedtesting.RandomizedRunner.invoke(RandomizedRunner.java:1742)
	at com.carrotsearch.randomizedtesting.RandomizedRunner$8.evaluate(RandomizedRunner.java:935)
	at com.carrotsearch.randomizedtesting.RandomizedRunner$9.evaluate(RandomizedRunner.java:971)
	at com.carrotsearch.randomizedtesting.RandomizedRunner$10.evaluate(RandomizedRunner.java:985)
	at org.junit.rules.ExpectedException$ExpectedExceptionStatement.evaluate(ExpectedException.java:110)
	at com.carrotsearch.randomizedtesting.rules.SystemPropertiesRestoreRule$1.evaluate(SystemPropertiesRestoreRule.java:57)
	at org.apache.lucene.util.TestRuleSetupTeardownChained$1.evaluate(TestRuleSetupTeardownChained.java:49)
	at org.apache.lucene.util.AbstractBeforeAfterRule$1.evaluate(AbstractBeforeAfterRule.java:45)
	at org.apache.lucene.util.TestRuleThreadAndTestName$1.evaluate(TestRuleThreadAndTestName.java:48)
	at org.apache.lucene.util.TestRuleIgnoreAfterMaxFailures$1.evaluate(TestRuleIgnoreAfterMaxFailures.java:64)
	at org.apache.lucene.util.TestRuleMarkFailure$1.evaluate(TestRuleMarkFailure.java:47)
	at com.carrotsearch.randomizedtesting.rules.StatementAdapter.evaluate(StatementAdapter.java:36)
	at com.carrotsearch.randomizedtesting.ThreadLeakControl$StatementRunner.run(ThreadLeakControl.java:368)
	at com.carrotsearch.randomizedtesting.ThreadLeakControl.forkTimeoutingTask(ThreadLeakControl.java:817)
	at com.carrotsearch.randomizedtesting.ThreadLeakControl$3.evaluate(ThreadLeakControl.java:468)
	at com.carrotsearch.randomizedtesting.RandomizedRunner.runSingleTest(RandomizedRunner.java:944)
	at com.carrotsearch.randomizedtesting.RandomizedRunner$5.evaluate(RandomizedRunner.java:830)
	at com.carrotsearch.randomizedtesting.RandomizedRunner$6.evaluate(RandomizedRunner.java:880)
	at com.carrotsearch.randomizedtesting.RandomizedRunner$7.evaluate(RandomizedRunner.java:891)
	at com.carrotsearch.randomizedtesting.rules.StatementAdapter.evaluate(StatementAdapter.java:36)
	at com.carrotsearch.randomizedtesting.rules.SystemPropertiesRestoreRule$1.evaluate(SystemPropertiesRestoreRule.java:57)
	at org.apache.lucene.util.AbstractBeforeAfterRule$1.evaluate(AbstractBeforeAfterRule.java:45)
	at com.carrotsearch.randomizedtesting.rules.StatementAdapter.evaluate(StatementAdapter.java:36)
	at org.apache.lucene.util.TestRuleStoreClassName$1.evaluate(TestRuleStoreClassName.java:41)
	at com.carrotsearch.randomizedtesting.rules.NoShadowingOrOverridesOnMethodsRule$1.evaluate(NoShadowingOrOverridesOnMethodsRule.java:40)
	at com.carrotsearch.randomizedtesting.rules.NoShadowingOrOverridesOnMethodsRule$1.evaluate(NoShadowingOrOverridesOnMethodsRule.java:40)
	at com.carrotsearch.randomizedtesting.rules.StatementAdapter.evaluate(StatementAdapter.java:36)
	at com.carrotsearch.randomizedtesting.rules.StatementAdapter.evaluate(StatementAdapter.java:36)
	at org.apache.lucene.util.TestRuleAssertionsRequired$1.evaluate(TestRuleAssertionsRequired.java:53)
	at org.apache.lucene.util.TestRuleMarkFailure$1.evaluate(TestRuleMarkFailure.java:47)
	at org.apache.lucene.util.TestRuleIgnoreAfterMaxFailures$1.evaluate(TestRuleIgnoreAfterMaxFailures.java:64)
	at org.apache.lucene.util.TestRuleIgnoreTestSuites$1.evaluate(TestRuleIgnoreTestSuites.java:54)
	at com.carrotsearch.randomizedtesting.rules.StatementAdapter.evaluate(StatementAdapter.java:36)
	at com.carrotsearch.randomizedtesting.ThreadLeakControl$StatementRunner.run(ThreadLeakControl.java:368)
	at java.base/java.lang.Thread.run(Thread.java:844)


FAILED:  org.apache.solr.update.RootFieldTest.testLegacyBlockProcessing

Error Message:
ERROR: [doc=11] unknown field 'name'

Stack Trace:
org.apache.solr.common.SolrException: ERROR: [doc=11] unknown field 'name'
	at __randomizedtesting.SeedInfo.seed([DF8DBCAF454B18F5:BEB7AA1384ACE6C4]:0)
	at org.apache.solr.update.DocumentBuilder.toDocument(DocumentBuilder.java:226)
	at org.apache.solr.update.AddUpdateCommand.getLuceneDocument(AddUpdateCommand.java:105)
	at org.apache.solr.update.DirectUpdateHandler2.updateDocOrDocValues(DirectUpdateHandler2.java:963)
	at org.apache.solr.update.DirectUpdateHandler2.doNormalUpdate(DirectUpdateHandler2.java:342)
	at org.apache.solr.update.DirectUpdateHandler2.addDoc0(DirectUpdateHandler2.java:289)
	at org.apache.solr.update.DirectUpdateHandler2.addDoc(DirectUpdateHandler2.java:236)
	at org.apache.solr.update.processor.RunUpdateProcessor.processAdd(RunUpdateProcessorFactory.java:67)
	at org.apache.solr.update.processor.UpdateRequestProcessor.processAdd(UpdateRequestProcessor.java:55)
	at org.apache.solr.update.processor.DistributedUpdateProcessor.doLocalAdd(DistributedUpdateProcessor.java:943)
	at org.apache.solr.update.processor.DistributedUpdateProcessor.versionAdd(DistributedUpdateProcessor.java:1159)
	at org.apache.solr.update.processor.DistributedUpdateProcessor.processAdd(DistributedUpdateProcessor.java:648)
	at org.apache.solr.update.processor.LogUpdateProcessorFactory$LogUpdateProcessor.processAdd(LogUpdateProcessorFactory.java:103)
	at org.apache.solr.handler.loader.JavabinLoader$1.update(JavabinLoader.java:118)
	at org.apache.solr.client.solrj.request.JavaBinUpdateRequestCodec$1.readOuterMostDocIterator(JavaBinUpdateRequestCodec.java:188)
	at org.apache.solr.client.solrj.request.JavaBinUpdateRequestCodec$1.readIterator(JavaBinUpdateRequestCodec.java:144)
	at org.apache.solr.common.util.JavaBinCodec.readObject(JavaBinCodec.java:330)
	at org.apache.solr.common.util.JavaBinCodec.readVal(JavaBinCodec.java:275)
	at org.apache.solr.client.solrj.request.JavaBinUpdateRequestCodec$1.readNamedList(JavaBinUpdateRequestCodec.java:130)
	at org.apache.solr.common.util.JavaBinCodec.readObject(JavaBinCodec.java:295)
	at org.apache.solr.common.util.JavaBinCodec.readVal(JavaBinCodec.java:275)
	at org.apache.solr.common.util.JavaBinCodec.unmarshal(JavaBinCodec.java:188)
	at org.apache.solr.client.solrj.request.JavaBinUpdateRequestCodec.unmarshal(JavaBinUpdateRequestCodec.java:195)
	at org.apache.solr.handler.loader.JavabinLoader.parseAndLoadDocs(JavabinLoader.java:129)
	at org.apache.solr.handler.loader.JavabinLoader.load(JavabinLoader.java:71)
	at org.apache.solr.handler.UpdateRequestHandler$1.load(UpdateRequestHandler.java:97)
	at org.apache.solr.handler.ContentStreamHandlerBase.handleRequestBody(ContentStreamHandlerBase.java:68)
	at org.apache.solr.handler.RequestHandlerBase.handleRequest(RequestHandlerBase.java:199)
	at org.apache.solr.core.SolrCore.execute(SolrCore.java:2541)
	at org.apache.solr.client.solrj.embedded.EmbeddedSolrServer.request(EmbeddedSolrServer.java:191)
	at org.apache.solr.client.solrj.SolrRequest.process(SolrRequest.java:194)
	at org.apache.solr.client.solrj.SolrClient.add(SolrClient.java:177)
	at org.apache.solr.client.solrj.SolrClient.add(SolrClient.java:138)
	at org.apache.solr.client.solrj.SolrClient.add(SolrClient.java:156)
	at org.apache.solr.update.RootFieldTest.testLegacyBlockProcessing(RootFieldTest.java:68)
	at java.base/jdk.internal.reflect.NativeMethodAccessorImpl.invoke0(Native Method)
	at java.base/jdk.internal.reflect.NativeMethodAccessorImpl.invoke(NativeMethodAccessorImpl.java:62)
	at java.base/jdk.internal.reflect.DelegatingMethodAccessorImpl.invoke(DelegatingMethodAccessorImpl.java:43)
	at java.base/java.lang.reflect.Method.invoke(Method.java:564)
	at com.carrotsearch.randomizedtesting.RandomizedRunner.invoke(RandomizedRunner.java:1742)
	at com.carrotsearch.randomizedtesting.RandomizedRunner$8.evaluate(RandomizedRunner.java:935)
	at com.carrotsearch.randomizedtesting.RandomizedRunner$9.evaluate(RandomizedRunner.java:971)
	at com.carrotsearch.randomizedtesting.RandomizedRunner$10.evaluate(RandomizedRunner.java:985)
	at org.junit.rules.ExpectedException$ExpectedExceptionStatement.evaluate(ExpectedException.java:110)
	at com.carrotsearch.randomizedtesting.rules.SystemPropertiesRestoreRule$1.evaluate(SystemPropertiesRestoreRule.java:57)
	at org.apache.lucene.util.TestRuleSetupTeardownChained$1.evaluate(TestRuleSetupTeardownChained.java:49)
	at org.apache.lucene.util.AbstractBeforeAfterRule$1.evaluate(AbstractBeforeAfterRule.java:45)
	at org.apache.lucene.util.TestRuleThreadAndTestName$1.evaluate(TestRuleThreadAndTestName.java:48)
	at org.apache.lucene.util.TestRuleIgnoreAfterMaxFailures$1.evaluate(TestRuleIgnoreAfterMaxFailures.java:64)
	at org.apache.lucene.util.TestRuleMarkFailure$1.evaluate(TestRuleMarkFailure.java:47)
	at com.carrotsearch.randomizedtesting.rules.StatementAdapter.evaluate(StatementAdapter.java:36)
	at com.carrotsearch.randomizedtesting.ThreadLeakControl$StatementRunner.run(ThreadLeakControl.java:368)
	at com.carrotsearch.randomizedtesting.ThreadLeakControl.forkTimeoutingTask(ThreadLeakControl.java:817)
	at com.carrotsearch.randomizedtesting.ThreadLeakControl$3.evaluate(ThreadLeakControl.java:468)
	at com.carrotsearch.randomizedtesting.RandomizedRunner.runSingleTest(RandomizedRunner.java:944)
	at com.carrotsearch.randomizedtesting.RandomizedRunner$5.evaluate(RandomizedRunner.java:830)
	at com.carrotsearch.randomizedtesting.RandomizedRunner$6.evaluate(RandomizedRunner.java:880)
	at com.carrotsearch.randomizedtesting.RandomizedRunner$7.evaluate(RandomizedRunner.java:891)
	at com.carrotsearch.randomizedtesting.rules.StatementAdapter.evaluate(StatementAdapter.java:36)
	at com.carrotsearch.randomizedtesting.rules.SystemPropertiesRestoreRule$1.evaluate(SystemPropertiesRestoreRule.java:57)
	at org.apache.lucene.util.AbstractBeforeAfterRule$1.evaluate(AbstractBeforeAfterRule.java:45)
	at com.carrotsearch.randomizedtesting.rules.StatementAdapter.evaluate(StatementAdapter.java:36)
	at org.apache.lucene.util.TestRuleStoreClassName$1.evaluate(TestRuleStoreClassName.java:41)
	at com.carrotsearch.randomizedtesting.rules.NoShadowingOrOverridesOnMethodsRule$1.evaluate(NoShadowingOrOverridesOnMethodsRule.java:40)
	at com.carrotsearch.randomizedtesting.rules.NoShadowingOrOverridesOnMethodsRule$1.evaluate(NoShadowingOrOverridesOnMethodsRule.java:40)
	at com.carrotsearch.randomizedtesting.rules.StatementAdapter.evaluate(StatementAdapter.java:36)
	at com.carrotsearch.randomizedtesting.rules.StatementAdapter.evaluate(StatementAdapter.java:36)
	at org.apache.lucene.util.TestRuleAssertionsRequired$1.evaluate(TestRuleAssertionsRequired.java:53)
	at org.apache.lucene.util.TestRuleMarkFailure$1.evaluate(TestRuleMarkFailure.java:47)
	at org.apache.lucene.util.TestRuleIgnoreAfterMaxFailures$1.evaluate(TestRuleIgnoreAfterMaxFailures.java:64)
	at org.apache.lucene.util.TestRuleIgnoreTestSuites$1.evaluate(TestRuleIgnoreTestSuites.java:54)
	at com.carrotsearch.randomizedtesting.rules.StatementAdapter.evaluate(StatementAdapter.java:36)
	at com.carrotsearch.randomizedtesting.ThreadLeakControl$StatementRunner.run(ThreadLeakControl.java:368)
	at java.base/java.lang.Thread.run(Thread.java:844)


FAILED:  org.apache.solr.update.RootFieldTest.testLegacyBlockProcessing

Error Message:
ERROR: [doc=11] unknown field 'name'

Stack Trace:
org.apache.solr.common.SolrException: ERROR: [doc=11] unknown field 'name'
	at __randomizedtesting.SeedInfo.seed([DF8DBCAF454B18F5:BEB7AA1384ACE6C4]:0)
	at org.apache.solr.update.DocumentBuilder.toDocument(DocumentBuilder.java:226)
	at org.apache.solr.update.AddUpdateCommand.getLuceneDocument(AddUpdateCommand.java:105)
	at org.apache.solr.update.DirectUpdateHandler2.updateDocOrDocValues(DirectUpdateHandler2.java:963)
	at org.apache.solr.update.DirectUpdateHandler2.doNormalUpdate(DirectUpdateHandler2.java:342)
	at org.apache.solr.update.DirectUpdateHandler2.addDoc0(DirectUpdateHandler2.java:289)
	at org.apache.solr.update.DirectUpdateHandler2.addDoc(DirectUpdateHandler2.java:236)
	at org.apache.solr.update.processor.RunUpdateProcessor.processAdd(RunUpdateProcessorFactory.java:67)
	at org.apache.solr.update.processor.UpdateRequestProcessor.processAdd(UpdateRequestProcessor.java:55)
	at org.apache.solr.update.processor.DistributedUpdateProcessor.doLocalAdd(DistributedUpdateProcessor.java:943)
	at org.apache.solr.update.processor.DistributedUpdateProcessor.versionAdd(DistributedUpdateProcessor.java:1159)
	at org.apache.solr.update.processor.DistributedUpdateProcessor.processAdd(DistributedUpdateProcessor.java:648)
	at org.apache.solr.update.processor.LogUpdateProcessorFactory$LogUpdateProcessor.processAdd(LogUpdateProcessorFactory.java:103)
	at org.apache.solr.handler.loader.JavabinLoader$1.update(JavabinLoader.java:118)
	at org.apache.solr.client.solrj.request.JavaBinUpdateRequestCodec$1.readOuterMostDocIterator(JavaBinUpdateRequestCodec.java:188)
	at org.apache.solr.client.solrj.request.JavaBinUpdateRequestCodec$1.readIterator(JavaBinUpdateRequestCodec.java:144)
	at org.apache.solr.common.util.JavaBinCodec.readObject(JavaBinCodec.java:330)
	at org.apache.solr.common.util.JavaBinCodec.readVal(JavaBinCodec.java:275)
	at org.apache.solr.client.solrj.request.JavaBinUpdateRequestCodec$1.readNamedList(JavaBinUpdateRequestCodec.java:130)
	at org.apache.solr.common.util.JavaBinCodec.readObject(JavaBinCodec.java:295)
	at org.apache.solr.common.util.JavaBinCodec.readVal(JavaBinCodec.java:275)
	at org.apache.solr.common.util.JavaBinCodec.unmarshal(JavaBinCodec.java:188)
	at org.apache.solr.client.solrj.request.JavaBinUpdateRequestCodec.unmarshal(JavaBinUpdateRequestCodec.java:195)
	at org.apache.solr.handler.loader.JavabinLoader.parseAndLoadDocs(JavabinLoader.java:129)
	at org.apache.solr.handler.loader.JavabinLoader.load(JavabinLoader.java:71)
	at org.apache.solr.handler.UpdateRequestHandler$1.load(UpdateRequestHandler.java:97)
	at org.apache.solr.handler.ContentStreamHandlerBase.handleRequestBody(ContentStreamHandlerBase.java:68)
	at org.apache.solr.handler.RequestHandlerBase.handleRequest(RequestHandlerBase.java:199)
	at org.apache.solr.core.SolrCore.execute(SolrCore.java:2541)
	at org.apache.solr.client.solrj.embedded.EmbeddedSolrServer.request(EmbeddedSolrServer.java:191)
	at org.apache.solr.client.solrj.SolrRequest.process(SolrRequest.java:194)
	at org.apache.solr.client.solrj.SolrClient.add(SolrClient.java:177)
	at org.apache.solr.client.solrj.SolrClient.add(SolrClient.java:138)
	at org.apache.solr.client.solrj.SolrClient.add(SolrClient.java:156)
	at org.apache.solr.update.RootFieldTest.testLegacyBlockProcessing(RootFieldTest.java:68)
	at java.base/jdk.internal.reflect.NativeMethodAccessorImpl.invoke0(Native Method)
	at java.base/jdk.internal.reflect.NativeMethodAccessorImpl.invoke(NativeMethodAccessorImpl.java:62)
	at java.base/jdk.internal.reflect.DelegatingMethodAccessorImpl.invoke(DelegatingMethodAccessorImpl.java:43)
	at java.base/java.lang.reflect.Method.invoke(Method.java:564)
	at com.carrotsearch.randomizedtesting.RandomizedRunner.invoke(RandomizedRunner.java:1742)
	at com.carrotsearch.randomizedtesting.RandomizedRunner$8.evaluate(RandomizedRunner.java:935)
	at com.carrotsearch.randomizedtesting.RandomizedRunner$9.evaluate(RandomizedRunner.java:971)
	at com.carrotsearch.randomizedtesting.RandomizedRunner$10.evaluate(RandomizedRunner.java:985)
	at org.junit.rules.ExpectedException$ExpectedExceptionStatement.evaluate(ExpectedException.java:110)
	at com.carrotsearch.randomizedtesting.rules.SystemPropertiesRestoreRule$1.evaluate(SystemPropertiesRestoreRule.java:57)
	at org.apache.lucene.util.TestRuleSetupTeardownChained$1.evaluate(TestRuleSetupTeardownChained.java:49)
	at org.apache.lucene.util.AbstractBeforeAfterRule$1.evaluate(AbstractBeforeAfterRule.java:45)
	at org.apache.lucene.util.TestRuleThreadAndTestName$1.evaluate(TestRuleThreadAndTestName.java:48)
	at org.apache.lucene.util.TestRuleIgnoreAfterMaxFailures$1.evaluate(TestRuleIgnoreAfterMaxFailures.java:64)
	at org.apache.lucene.util.TestRuleMarkFailure$1.evaluate(TestRuleMarkFailure.java:47)
	at com.carrotsearch.randomizedtesting.rules.StatementAdapter.evaluate(StatementAdapter.java:36)
	at com.carrotsearch.randomizedtesting.ThreadLeakControl$StatementRunner.run(ThreadLeakControl.java:368)
	at com.carrotsearch.randomizedtesting.ThreadLeakControl.forkTimeoutingTask(ThreadLeakControl.java:817)
	at com.carrotsearch.randomizedtesting.ThreadLeakControl$3.evaluate(ThreadLeakControl.java:468)
	at com.carrotsearch.randomizedtesting.RandomizedRunner.runSingleTest(RandomizedRunner.java:944)
	at com.carrotsearch.randomizedtesting.RandomizedRunner$5.evaluate(RandomizedRunner.java:830)
	at com.carrotsearch.randomizedtesting.RandomizedRunner$6.evaluate(RandomizedRunner.java:880)
	at com.carrotsearch.randomizedtesting.RandomizedRunner$7.evaluate(RandomizedRunner.java:891)
	at com.carrotsearch.randomizedtesting.rules.StatementAdapter.evaluate(StatementAdapter.java:36)
	at com.carrotsearch.randomizedtesting.rules.SystemPropertiesRestoreRule$1.evaluate(SystemPropertiesRestoreRule.java:57)
	at org.apache.lucene.util.AbstractBeforeAfterRule$1.evaluate(AbstractBeforeAfterRule.java:45)
	at com.carrotsearch.randomizedtesting.rules.StatementAdapter.evaluate(StatementAdapter.java:36)
	at org.apache.lucene.util.TestRuleStoreClassName$1.evaluate(TestRuleStoreClassName.java:41)
	at com.carrotsearch.randomizedtesting.rules.NoShadowingOrOverridesOnMethodsRule$1.evaluate(NoShadowingOrOverridesOnMethodsRule.java:40)
	at com.carrotsearch.randomizedtesting.rules.NoShadowingOrOverridesOnMethodsRule$1.evaluate(NoShadowingOrOverridesOnMethodsRule.java:40)
	at com.carrotsearch.randomizedtesting.rules.StatementAdapter.evaluate(StatementAdapter.java:36)
	at com.carrotsearch.randomizedtesting.rules.StatementAdapter.evaluate(StatementAdapter.java:36)
	at org.apache.lucene.util.TestRuleAssertionsRequired$1.evaluate(TestRuleAssertionsRequired.java:53)
	at org.apache.lucene.util.TestRuleMarkFailure$1.evaluate(TestRuleMarkFailure.java:47)
	at org.apache.lucene.util.TestRuleIgnoreAfterMaxFailures$1.evaluate(TestRuleIgnoreAfterMaxFailures.java:64)
	at org.apache.lucene.util.TestRuleIgnoreTestSuites$1.evaluate(TestRuleIgnoreTestSuites.java:54)
	at com.carrotsearch.randomizedtesting.rules.StatementAdapter.evaluate(StatementAdapter.java:36)
	at com.carrotsearch.randomizedtesting.ThreadLeakControl$StatementRunner.run(ThreadLeakControl.java:368)
	at java.base/java.lang.Thread.run(Thread.java:844)


FAILED:  org.apache.solr.update.RootFieldTest.testLegacyBlockProcessing

Error Message:
ERROR: [doc=11] unknown field 'name'

Stack Trace:
org.apache.solr.common.SolrException: ERROR: [doc=11] unknown field 'name'
	at __randomizedtesting.SeedInfo.seed([DF8DBCAF454B18F5:BEB7AA1384ACE6C4]:0)
	at org.apache.solr.update.DocumentBuilder.toDocument(DocumentBuilder.java:226)
	at org.apache.solr.update.AddUpdateCommand.getLuceneDocument(AddUpdateCommand.java:105)
	at org.apache.solr.update.DirectUpdateHandler2.updateDocOrDocValues(DirectUpdateHandler2.java:963)
	at org.apache.solr.update.DirectUpdateHandler2.doNormalUpdate(DirectUpdateHandler2.java:342)
	at org.apache.solr.update.DirectUpdateHandler2.addDoc0(DirectUpdateHandler2.java:289)
	at org.apache.solr.update.DirectUpdateHandler2.addDoc(DirectUpdateHandler2.java:236)
	at org.apache.solr.update.processor.RunUpdateProcessor.processAdd(RunUpdateProcessorFactory.java:67)
	at org.apache.solr.update.processor.UpdateRequestProcessor.processAdd(UpdateRequestProcessor.java:55)
	at org.apache.solr.update.processor.DistributedUpdateProcessor.doLocalAdd(DistributedUpdateProcessor.java:943)
	at org.apache.solr.update.processor.DistributedUpdateProcessor.versionAdd(DistributedUpdateProcessor.java:1159)
	at org.apache.solr.update.processor.DistributedUpdateProcessor.processAdd(DistributedUpdateProcessor.java:648)
	at org.apache.solr.update.processor.LogUpdateProcessorFactory$LogUpdateProcessor.processAdd(LogUpdateProcessorFactory.java:103)
	at org.apache.solr.handler.loader.JavabinLoader$1.update(JavabinLoader.java:118)
	at org.apache.solr.client.solrj.request.JavaBinUpdateRequestCodec$1.readOuterMostDocIterator(JavaBinUpdateRequestCodec.java:188)
	at org.apache.solr.client.solrj.request.JavaBinUpdateRequestCodec$1.readIterator(JavaBinUpdateRequestCodec.java:144)
	at org.apache.solr.common.util.JavaBinCodec.readObject(JavaBinCodec.java:330)
	at org.apache.solr.common.util.JavaBinCodec.readVal(JavaBinCodec.java:275)
	at org.apache.solr.client.solrj.request.JavaBinUpdateRequestCodec$1.readNamedList(JavaBinUpdateRequestCodec.java:130)
	at org.apache.solr.common.util.JavaBinCodec.readObject(JavaBinCodec.java:295)
	at org.apache.solr.common.util.JavaBinCodec.readVal(JavaBinCodec.java:275)
	at org.apache.solr.common.util.JavaBinCodec.unmarshal(JavaBinCodec.java:188)
	at org.apache.solr.client.solrj.request.JavaBinUpdateRequestCodec.unmarshal(JavaBinUpdateRequestCodec.java:195)
	at org.apache.solr.handler.loader.JavabinLoader.parseAndLoadDocs(JavabinLoader.java:129)
	at org.apache.solr.handler.loader.JavabinLoader.load(JavabinLoader.java:71)
	at org.apache.solr.handler.UpdateRequestHandler$1.load(UpdateRequestHandler.java:97)
	at org.apache.solr.handler.ContentStreamHandlerBase.handleRequestBody(ContentStreamHandlerBase.java:68)
	at org.apache.solr.handler.RequestHandlerBase.handleRequest(RequestHandlerBase.java:199)
	at org.apache.solr.core.SolrCore.execute(SolrCore.java:2541)
	at org.apache.solr.client.solrj.embedded.EmbeddedSolrServer.request(EmbeddedSolrServer.java:191)
	at org.apache.solr.client.solrj.SolrRequest.process(SolrRequest.java:194)
	at org.apache.solr.client.solrj.SolrClient.add(SolrClient.java:177)
	at org.apache.solr.client.solrj.SolrClient.add(SolrClient.java:138)
	at org.apache.solr.client.solrj.SolrClient.add(SolrClient.java:156)
	at org.apache.solr.update.RootFieldTest.testLegacyBlockProcessing(RootFieldTest.java:68)
	at java.base/jdk.internal.reflect.NativeMethodAccessorImpl.invoke0(Native Method)
	at java.base/jdk.internal.reflect.NativeMethodAccessorImpl.invoke(NativeMethodAccessorImpl.java:62)
	at java.base/jdk.internal.reflect.DelegatingMethodAccessorImpl.invoke(DelegatingMethodAccessorImpl.java:43)
	at java.base/java.lang.reflect.Method.invoke(Method.java:564)
	at com.carrotsearch.randomizedtesting.RandomizedRunner.invoke(RandomizedRunner.java:1742)
	at com.carrotsearch.randomizedtesting.RandomizedRunner$8.evaluate(RandomizedRunner.java:935)
	at com.carrotsearch.randomizedtesting.RandomizedRunner$9.evaluate(RandomizedRunner.java:971)
	at com.carrotsearch.randomizedtesting.RandomizedRunner$10.evaluate(RandomizedRunner.java:985)
	at org.junit.rules.ExpectedException$ExpectedExceptionStatement.evaluate(ExpectedException.java:110)
	at com.carrotsearch.randomizedtesting.rules.SystemPropertiesRestoreRule$1.evaluate(SystemPropertiesRestoreRule.java:57)
	at org.apache.lucene.util.TestRuleSetupTeardownChained$1.evaluate(TestRuleSetupTeardownChained.java:49)
	at org.apache.lucene.util.AbstractBeforeAfterRule$1.evaluate(AbstractBeforeAfterRule.java:45)
	at org.apache.lucene.util.TestRuleThreadAndTestName$1.evaluate(TestRuleThreadAndTestName.java:48)
	at org.apache.lucene.util.TestRuleIgnoreAfterMaxFailures$1.evaluate(TestRuleIgnoreAfterMaxFailures.java:64)
	at org.apache.lucene.util.TestRuleMarkFailure$1.evaluate(TestRuleMarkFailure.java:47)
	at com.carrotsearch.randomizedtesting.rules.StatementAdapter.evaluate(StatementAdapter.java:36)
	at com.carrotsearch.randomizedtesting.ThreadLeakControl$StatementRunner.run(ThreadLeakControl.java:368)
	at com.carrotsearch.randomizedtesting.ThreadLeakControl.forkTimeoutingTask(ThreadLeakControl.java:817)
	at com.carrotsearch.randomizedtesting.ThreadLeakControl$3.evaluate(ThreadLeakControl.java:468)
	at com.carrotsearch.randomizedtesting.RandomizedRunner.runSingleTest(RandomizedRunner.java:944)
	at com.carrotsearch.randomizedtesting.RandomizedRunner$5.evaluate(RandomizedRunner.java:830)
	at com.carrotsearch.randomizedtesting.RandomizedRunner$6.evaluate(RandomizedRunner.java:880)
	at com.carrotsearch.randomizedtesting.RandomizedRunner$7.evaluate(RandomizedRunner.java:891)
	at com.carrotsearch.randomizedtesting.rules.StatementAdapter.evaluate(StatementAdapter.java:36)
	at com.carrotsearch.randomizedtesting.rules.SystemPropertiesRestoreRule$1.evaluate(SystemPropertiesRestoreRule.java:57)
	at org.apache.lucene.util.AbstractBeforeAfterRule$1.evaluate(AbstractBeforeAfterRule.java:45)
	at com.carrotsearch.randomizedtesting.rules.StatementAdapter.evaluate(StatementAdapter.java:36)
	at org.apache.lucene.util.TestRuleStoreClassName$1.evaluate(TestRuleStoreClassName.java:41)
	at com.carrotsearch.randomizedtesting.rules.NoShadowingOrOverridesOnMethodsRule$1.evaluate(NoShadowingOrOverridesOnMethodsRule.java:40)
	at com.carrotsearch.randomizedtesting.rules.NoShadowingOrOverridesOnMethodsRule$1.evaluate(NoShadowingOrOverridesOnMethodsRule.java:40)
	at com.carrotsearch.randomizedtesting.rules.StatementAdapter.evaluate(StatementAdapter.java:36)
	at com.carrotsearch.randomizedtesting.rules.StatementAdapter.evaluate(StatementAdapter.java:36)
	at org.apache.lucene.util.TestRuleAssertionsRequired$1.evaluate(TestRuleAssertionsRequired.java:53)
	at org.apache.lucene.util.TestRuleMarkFailure$1.evaluate(TestRuleMarkFailure.java:47)
	at org.apache.lucene.util.TestRuleIgnoreAfterMaxFailures$1.evaluate(TestRuleIgnoreAfterMaxFailures.java:64)
	at org.apache.lucene.util.TestRuleIgnoreTestSuites$1.evaluate(TestRuleIgnoreTestSuites.java:54)
	at com.carrotsearch.randomizedtesting.rules.StatementAdapter.evaluate(StatementAdapter.java:36)
	at com.carrotsearch.randomizedtesting.ThreadLeakControl$StatementRunner.run(ThreadLeakControl.java:368)
	at java.base/java.lang.Thread.run(Thread.java:844)




Build Log:
[...truncated 13581 lines...]
   [junit4] Suite: org.apache.solr.update.RootFieldTest
   [junit4]   2> Creating dataDir: /Users/jenkins/workspace/Lucene-Solr-master-MacOSX/solr/build/solr-core/test/J0/temp/solr.update.RootFieldTest_DF8DBCAF454B18F5-001/init-core-data-001
   [junit4]   2> 1223041 WARN  (SUITE-RootFieldTest-seed#[DF8DBCAF454B18F5]-worker) [    ] o.a.s.SolrTestCaseJ4 startTrackingSearchers: numOpens=1 numCloses=1
   [junit4]   2> 1223041 INFO  (SUITE-RootFieldTest-seed#[DF8DBCAF454B18F5]-worker) [    ] o.a.s.SolrTestCaseJ4 Using PointFields (NUMERIC_POINTS_SYSPROP=true) w/NUMERIC_DOCVALUES_SYSPROP=true
   [junit4]   2> 1223043 INFO  (SUITE-RootFieldTest-seed#[DF8DBCAF454B18F5]-worker) [    ] o.a.s.SolrTestCaseJ4 Randomized ssl (true) and clientAuth (false) via: @org.apache.solr.util.RandomizeSSL(reason="", value=0.0/0.0, ssl=0.0/0.0, clientAuth=0.0/0.0) w/ MAC_OS_X supressed clientAuth
   [junit4]   2> 1223044 INFO  (SUITE-RootFieldTest-seed#[DF8DBCAF454B18F5]-worker) [    ] o.a.s.SolrTestCaseJ4 SecureRandom sanity checks: test.solr.allowed.securerandom=null & java.security.egd=file:/dev/./urandom
   [junit4]   2> 1223045 INFO  (SUITE-RootFieldTest-seed#[DF8DBCAF454B18F5]-worker) [    ] o.a.s.SolrTestCaseJ4 ####initCore
   [junit4]   2> 1223045 INFO  (SUITE-RootFieldTest-seed#[DF8DBCAF454B18F5]-worker) [    ] o.a.s.c.SolrResourceLoader [null] Added 2 libs to classloader, from paths: [/Users/jenkins/workspace/Lucene-Solr-master-MacOSX/solr/core/src/test-files/solr/collection1/lib, /Users/jenkins/workspace/Lucene-Solr-master-MacOSX/solr/core/src/test-files/solr/collection1/lib/classes]
   [junit4]   2> 1223084 INFO  (SUITE-RootFieldTest-seed#[DF8DBCAF454B18F5]-worker) [    ] o.a.s.c.SolrConfig Using Lucene MatchVersion: 8.0.0
   [junit4]   2> 1223123 INFO  (SUITE-RootFieldTest-seed#[DF8DBCAF454B18F5]-worker) [    ] o.a.s.s.IndexSchema [null] Schema name=example
   [junit4]   2> 1223181 INFO  (SUITE-RootFieldTest-seed#[DF8DBCAF454B18F5]-worker) [    ] o.a.s.s.IndexSchema Loaded schema example/1.1 with uniqueid field id
   [junit4]   2> 1223399 INFO  (SUITE-RootFieldTest-seed#[DF8DBCAF454B18F5]-worker) [    ] o.a.s.c.TransientSolrCoreCacheDefault Allocating transient cache for 2147483647 transient cores
   [junit4]   2> 1223399 INFO  (SUITE-RootFieldTest-seed#[DF8DBCAF454B18F5]-worker) [    ] o.a.s.h.a.MetricsHistoryHandler No .system collection, keeping metrics history in memory.
   [junit4]   2> 1223431 INFO  (SUITE-RootFieldTest-seed#[DF8DBCAF454B18F5]-worker) [    ] o.a.s.m.r.SolrJmxReporter JMX monitoring for 'solr.node' (registry 'solr.node') enabled at server: com.sun.jmx.mbeanserver.JmxMBeanServer@25f904e4
   [junit4]   2> 1223447 INFO  (SUITE-RootFieldTest-seed#[DF8DBCAF454B18F5]-worker) [    ] o.a.s.m.r.SolrJmxReporter JMX monitoring for 'solr.jvm' (registry 'solr.jvm') enabled at server: com.sun.jmx.mbeanserver.JmxMBeanServer@25f904e4
   [junit4]   2> 1223447 INFO  (SUITE-RootFieldTest-seed#[DF8DBCAF454B18F5]-worker) [    ] o.a.s.m.r.SolrJmxReporter JMX monitoring for 'solr.jetty' (registry 'solr.jetty') enabled at server: com.sun.jmx.mbeanserver.JmxMBeanServer@25f904e4
   [junit4]   2> 1223449 INFO  (coreLoadExecutor-4818-thread-1) [    x:collection1] o.a.s.c.SolrResourceLoader [null] Added 2 libs to classloader, from paths: [/Users/jenkins/workspace/Lucene-Solr-master-MacOSX/solr/core/src/test-files/solr/collection1/lib, /Users/jenkins/workspace/Lucene-Solr-master-MacOSX/solr/core/src/test-files/solr/collection1/lib/classes]
   [junit4]   2> 1223490 INFO  (coreLoadExecutor-4818-thread-1) [    x:collection1] o.a.s.c.SolrConfig Using Lucene MatchVersion: 8.0.0
   [junit4]   2> 1223528 INFO  (coreLoadExecutor-4818-thread-1) [    x:collection1] o.a.s.s.IndexSchema [collection1] Schema name=example
   [junit4]   2> 1223591 INFO  (coreLoadExecutor-4818-thread-1) [    x:collection1] o.a.s.s.IndexSchema Loaded schema example/1.1 with uniqueid field id
   [junit4]   2> 1223596 INFO  (coreLoadExecutor-4818-thread-1) [    x:collection1] o.a.s.c.CoreContainer Creating SolrCore 'collection1' using configuration from instancedir /Users/jenkins/workspace/Lucene-Solr-master-MacOSX/solr/core/src/test-files/solr/collection1, trusted=true
   [junit4]   2> 1223596 INFO  (coreLoadExecutor-4818-thread-1) [    x:collection1] o.a.s.m.r.SolrJmxReporter JMX monitoring for 'solr.core.collection1' (registry 'solr.core.collection1') enabled at server: com.sun.jmx.mbeanserver.JmxMBeanServer@25f904e4
   [junit4]   2> 1223596 INFO  (coreLoadExecutor-4818-thread-1) [    x:collection1] o.a.s.c.SolrCore [[collection1] ] Opening new SolrCore at [/Users/jenkins/workspace/Lucene-Solr-master-MacOSX/solr/core/src/test-files/solr/collection1], dataDir=[/Users/jenkins/workspace/Lucene-Solr-master-MacOSX/solr/build/solr-core/test/J0/temp/solr.update.RootFieldTest_DF8DBCAF454B18F5-001/init-core-data-001/]
   [junit4]   2> 1223598 INFO  (coreLoadExecutor-4818-thread-1) [    x:collection1] o.a.s.u.RandomMergePolicy RandomMergePolicy wrapping class org.apache.lucene.index.LogByteSizeMergePolicy: [LogByteSizeMergePolicy: minMergeSize=1677721, mergeFactor=48, maxMergeSize=2147483648, maxMergeSizeForForcedMerge=9223372036854775807, calibrateSizeByDeletes=false, maxMergeDocs=2147483647, maxCFSSegmentSizeMB=8.796093022207999E12, noCFSRatio=0.722452340868009]
   [junit4]   2> 1223796 INFO  (coreLoadExecutor-4818-thread-1) [    x:collection1] o.a.s.u.UpdateHandler Using UpdateLog implementation: org.apache.solr.update.UpdateLog
   [junit4]   2> 1223796 INFO  (coreLoadExecutor-4818-thread-1) [    x:collection1] o.a.s.u.UpdateLog Initializing UpdateLog: dataDir= defaultSyncLevel=FLUSH numRecordsToKeep=100 maxNumLogsToKeep=10 numVersionBuckets=65536
   [junit4]   2> 1223797 INFO  (coreLoadExecutor-4818-thread-1) [    x:collection1] o.a.s.u.CommitTracker Hard AutoCommit: disabled
   [junit4]   2> 1223797 INFO  (coreLoadExecutor-4818-thread-1) [    x:collection1] o.a.s.u.CommitTracker Soft AutoCommit: disabled
   [junit4]   2> 1223798 INFO  (coreLoadExecutor-4818-thread-1) [    x:collection1] o.a.s.u.RandomMergePolicy RandomMergePolicy wrapping class org.apache.lucene.index.LogDocMergePolicy: [LogDocMergePolicy: minMergeSize=1000, mergeFactor=42, maxMergeSize=9223372036854775807, maxMergeSizeForForcedMerge=9223372036854775807, calibrateSizeByDeletes=true, maxMergeDocs=2147483647, maxCFSSegmentSizeMB=8.796093022207999E12, noCFSRatio=1.0]
   [junit4]   2> 1223798 INFO  (coreLoadExecutor-4818-thread-1) [    x:collection1] o.a.s.s.SolrIndexSearcher Opening [Searcher@4a508fca[collection1] main]
   [junit4]   2> 1223799 INFO  (coreLoadExecutor-4818-thread-1) [    x:collection1] o.a.s.h.c.SpellCheckComponent Initializing spell checkers
   [junit4]   2> 1223981 INFO  (coreLoadExecutor-4818-thread-1) [    x:collection1] o.a.s.s.DirectSolrSpellChecker init: {name=direct,classname=DirectSolrSpellChecker,field=lowerfilt,minQueryLength=3}
   [junit4]   2> 1224198 INFO  (coreLoadExecutor-4818-thread-1) [    x:collection1] o.a.s.h.ReplicationHandler Commits will be reserved for 10000ms.
   [junit4]   2> 1224198 INFO  (coreLoadExecutor-4818-thread-1) [    x:collection1] o.a.s.u.UpdateLog Could not find max version in index or recent updates, using new clock 1618187973499551744
   [junit4]   2> 1224200 INFO  (searcherExecutor-4819-thread-1-processing-x:collection1) [    x:collection1] o.a.s.h.c.SpellCheckComponent Loading spell index for spellchecker: default
   [junit4]   2> 1224201 INFO  (SUITE-RootFieldTest-seed#[DF8DBCAF454B18F5]-worker) [    ] o.a.s.SolrTestCaseJ4 ####initCore end
   [junit4]   2> 1224202 INFO  (searcherExecutor-4819-thread-1-processing-x:collection1) [    x:collection1] o.a.s.h.c.SpellCheckComponent Loading spell index for spellchecker: direct
   [junit4]   2> 1224202 INFO  (searcherExecutor-4819-thread-1-processing-x:collection1) [    x:collection1] o.a.s.h.c.SpellCheckComponent Loading spell index for spellchecker: wordbreak
   [junit4]   2> 1224202 INFO  (searcherExecutor-4819-thread-1-processing-x:collection1) [    x:collection1] o.a.s.h.c.SpellCheckComponent Loading spell index for spellchecker: multipleFields
   [junit4]   2> 1224204 INFO  (searcherExecutor-4819-thread-1-processing-x:collection1) [    x:collection1] o.a.s.h.c.SpellCheckComponent Loading spell index for spellchecker: jarowinkler
   [junit4]   2> 1224205 INFO  (searcherExecutor-4819-thread-1-processing-x:collection1) [    x:collection1] o.a.s.h.c.SpellCheckComponent Loading spell index for spellchecker: external
   [junit4]   2> 1224208 INFO  (searcherExecutor-4819-thread-1-processing-x:collection1) [    x:collection1] o.a.s.h.c.SpellCheckComponent Loading spell index for spellchecker: freq
   [junit4]   2> 1224209 INFO  (searcherExecutor-4819-thread-1-processing-x:collection1) [    x:collection1] o.a.s.h.c.SpellCheckComponent Loading spell index for spellchecker: fqcn
   [junit4]   2> 1224210 INFO  (searcherExecutor-4819-thread-1-processing-x:collection1) [    x:collection1] o.a.s.h.c.SpellCheckComponent Loading spell index for spellchecker: perDict
   [junit4]   2> 1224211 INFO  (searcherExecutor-4819-thread-1-processing-x:collection1) [    x:collection1] o.a.s.c.SolrCore [collection1] Registered new searcher Searcher@4a508fca[collection1] main{ExitableDirectoryReader(UninvertingDirectoryReader())}
   [junit4]   2> 1224215 INFO  (TEST-RootFieldTest.testLegacyBlockProcessing-seed#[DF8DBCAF454B18F5]) [    ] o.a.s.SolrTestCaseJ4 ###Starting testLegacyBlockProcessing
   [junit4]   2> 1224218 INFO  (TEST-RootFieldTest.testLegacyBlockProcessing-seed#[DF8DBCAF454B18F5]) [    ] o.a.s.u.p.LogUpdateProcessorFactory [collection1]  webapp=null path=/update params={}{deleteByQuery=*:* (-1618187973517377536)} 0 2
   [junit4]   2> 1224218 INFO  (TEST-RootFieldTest.testLegacyBlockProcessing-seed#[DF8DBCAF454B18F5]) [    ] o.a.s.u.p.LogUpdateProcessorFactory [collection1]  webapp=null path=/update params={}{} 0 0
   [junit4]   2> 1224218 ERROR (TEST-RootFieldTest.testLegacyBlockProcessing-seed#[DF8DBCAF454B18F5]) [    ] o.a.s.h.RequestHandlerBase org.apache.solr.common.SolrException: ERROR: [doc=11] unknown field 'name'
   [junit4]   2> 	at org.apache.solr.update.DocumentBuilder.toDocument(DocumentBuilder.java:226)
   [junit4]   2> 	at org.apache.solr.update.AddUpdateCommand.getLuceneDocument(AddUpdateCommand.java:105)
   [junit4]   2> 	at org.apache.solr.update.DirectUpdateHandler2.updateDocOrDocValues(DirectUpdateHandler2.java:963)
   [junit4]   2> 	at org.apache.solr.update.DirectUpdateHandler2.doNormalUpdate(DirectUpdateHandler2.java:342)
   [junit4]   2> 	at org.apache.solr.update.DirectUpdateHandler2.addDoc0(DirectUpdateHandler2.java:289)
   [junit4]   2> 	at org.apache.solr.update.DirectUpdateHandler2.addDoc(DirectUpdateHandler2.java:236)
   [junit4]   2> 	at org.apache.solr.update.processor.RunUpdateProcessor.processAdd(RunUpdateProcessorFactory.java:67)
   [junit4]   2> 	at org.apache.solr.update.processor.UpdateRequestProcessor.processAdd(UpdateRequestProcessor.java:55)
   [junit4]   2> 	at org.apache.solr.update.processor.DistributedUpdateProcessor.doLocalAdd(DistributedUpdateProcessor.java:943)
   [junit4]   2> 	at org.apache.solr.update.processor.DistributedUpdateProcessor.versionAdd(DistributedUpdateProcessor.java:1159)
   [junit4]   2> 	at org.apache.solr.update.processor.DistributedUpdateProcessor.processAdd(DistributedUpdateProcessor.java:648)
   [junit4]   2> 	at org.apache.solr.update.processor.LogUpdateProcessorFactory$LogUpdateProcessor.processAdd(LogUpdateProcessorFactory.java:103)
   [junit4]   2> 	at org.apache.solr.handler.loader.JavabinLoader$1.update(JavabinLoader.java:118)
   [junit4]   2> 	at org.apache.solr.client.solrj.request.JavaBinUpdateRequestCodec$1.readOuterMostDocIterator(JavaBinUpdateRequestCodec.java:188)
   [junit4]   2> 	at org.apache.solr.client.solrj.request.JavaBinUpdateRequestCodec$1.readIterator(JavaBinUpdateRequestCodec.java:144)
   [junit4]   2> 	at org.apache.solr.common.util.JavaBinCodec.readObject(JavaBinCodec.java:330)
   [junit4]   2> 	at org.apache.solr.common.util.JavaBinCodec.readVal(JavaBinCodec.java:275)
   [junit4]   2> 	at org.apache.solr.client.solrj.request.JavaBinUpdateRequestCodec$1.readNamedList(JavaBinUpdateRequestCodec.java:130)
   [junit4]   2> 	at org.apache.solr.common.util.JavaBinCodec.readObject(JavaBinCodec.java:295)
   [junit4]   2> 	at org.apache.solr.common.util.JavaBinCodec.readVal(JavaBinCodec.java:275)
   [junit4]   2> 	at org.apache.solr.common.util.JavaBinCodec.unmarshal(JavaBinCodec.java:188)
   [junit4]   2> 	at org.apache.solr.client.solrj.request.JavaBinUpdateRequestCodec.unmarshal(JavaBinUpdateRequestCodec.java:195)
   [junit4]   2> 	at org.apache.solr.handler.loader.JavabinLoader.parseAndLoadDocs(JavabinLoader.java:129)
   [junit4]   2> 	at org.apache.solr.handler.loader.JavabinLoader.load(JavabinLoader.java:71)
   [junit4]   2> 	at org.apache.solr.handler.UpdateRequestHandler$1.load(UpdateRequestHandler.java:97)
   [junit4]   2> 	at org.apache.solr.handler.ContentStreamHandlerBase.handleRequestBody(ContentStreamHandlerBase.java:68)
   [junit4]   2> 	at org.apache.solr.handler.RequestHandlerBase.handleRequest(RequestHandlerBase.java:199)
   [junit4]   2> 	at org.apache.solr.core.SolrCore.execute(SolrCore.java:2541)
   [junit4]   2> 	at org.apache.solr.client.solrj.embedded.EmbeddedSolrServer.request(EmbeddedSolrServer.java:191)
   [junit4]   2> 	at org.apache.solr.client.solrj.SolrRequest.process(SolrRequest.java:194)
   [junit4]   2> 	at org.apache.solr.client.solrj.SolrClient.add(SolrClient.java:177)
   [junit4]   2> 	at org.apache.solr.client.solrj.SolrClient.add(SolrClient.java:138)
   [junit4]   2> 	at org.apache.solr.client.solrj.SolrClient.add(SolrClient.java:156)
   [junit4]   2> 	at org.apache.solr.update.RootFieldTest.testLegacyBlockProcessing(RootFieldTest.java:68)
   [junit4]   2> 	at java.base/jdk.internal.reflect.NativeMethodAccessorImpl.invoke0(Native Method)
   [junit4]   2> 	at java.base/jdk.internal.reflect.NativeMethodAccessorImpl.invoke(NativeMethodAccessorImpl.java:62)
   [junit4]   2> 	at java.base/jdk.internal.reflect.DelegatingMethodAccessorImpl.invoke(DelegatingMethodAccessorImpl.java:43)
   [junit4]   2> 	at java.base/java.lang.reflect.Method.invoke(Method.java:564)
   [junit4]   2> 	at com.carrotsearch.randomizedtesting.RandomizedRunner.invoke(RandomizedRunner.java:1742)
   [junit4]   2> 	at com.carrotsearch.randomizedtesting.RandomizedRunner$8.evaluate(RandomizedRunner.java:935)
   [junit4]   2> 	at com.carrotsearch.randomizedtesting.RandomizedRunner$9.evaluate(RandomizedRunner.java:971)
   [junit4]   2> 	at com.carrotsearch.randomizedtesting.RandomizedRunner$10.evaluate(RandomizedRunner.java:985)
   [junit4]   2> 	at org.junit.rules.ExpectedException$ExpectedExceptionStatement.evaluate(ExpectedException.java:110)
   [junit4]   2> 	at com.carrotsearch.randomizedtesting.rules.SystemPropertiesRestoreRule$1.evaluate(SystemPropertiesRestoreRule.java:57)
   [junit4]   2> 	at org.apache.lucene.util.TestRuleSetupTeardownChained$1.evaluate(TestRuleSetupTeardownChained.java:49)
   [junit4]   2> 	at org.apache.lucene.util.AbstractBeforeAfterRule$1.evaluate(AbstractBeforeAfterRule.java:45)
   [junit4]   2> 	at org.apache.lucene.util.TestRuleThreadAndTestName$1.evaluate(TestRuleThreadAndTestName.java:48)
   [junit4]   2> 	at org.apache.lucene.util.TestRuleIgnoreAfterMaxFailures$1.evaluate(TestRuleIgnoreAfterMaxFailures.java:64)
   [junit4]   2> 	at org.apache.lucene.util.TestRuleMarkFailure$1.evaluate(TestRuleMarkFailure.java:47)
   [junit4]   2> 	at com.carrotsearch.randomizedtesting.rules.StatementAdapter.evaluate(StatementAdapter.java:36)
   [junit4]   2> 	at com.carrotsearch.randomizedtesting.ThreadLeakControl$StatementRunner.run(ThreadLeakControl.java:368)
   [junit4]   2> 	at com.carrotsearch.randomizedtesting.ThreadLeakControl.forkTimeoutingTask(ThreadLeakControl.java:817)
   [junit4]   2> 	at com.carrotsearch.randomizedtesting.ThreadLeakControl$3.evaluate(ThreadLeakControl.java:468)
   [junit4]   2> 	at com.carrotsearch.randomizedtesting.RandomizedRunner.runSingleTest(RandomizedRunner.java:944)
   [junit4]   2> 	at com.carrotsearch.randomizedtesting.RandomizedRunner$5.evaluate(RandomizedRunner.java:830)
   [junit4]   2> 	at com.carrotsearch.randomizedtesting.RandomizedRunner$6.evaluate(RandomizedRunner.java:880)
   [junit4]   2> 	at com.carrotsearch.randomizedtesting.RandomizedRunner$7.evaluate(RandomizedRunner.java:891)
   [junit4]   2> 	at com.carrotsearch.randomizedtesting.rules.StatementAdapter.evaluate(StatementAdapter.java:36)
   [junit4]   2> 	at com.carrotsearch.randomizedtesting.rules.SystemPropertiesRestoreRule$1.evaluate(SystemPropertiesRestoreRule.java:57)
   [junit4]   2> 	at org.apache.lucene.util.AbstractBeforeAfterRule$1.evaluate(AbstractBeforeAfterRule.java:45)
   [junit4]   2> 	at com.carrotsearch.randomizedtesting.rules.StatementAdapter.evaluate(StatementAdapter.java:36)
   [junit4]   2> 	at org.apache.lucene.util.TestRuleStoreClassName$1.evaluate(TestRuleStoreClassName.java:41)
   [junit4]   2> 	at com.carrotsearch.randomizedtesting.rules.NoShadowingOrOverridesOnMethodsRule$1.evaluate(NoShadowingOrOverridesOnMethodsRule.java:40)
   [junit4]   2> 	at com.carrotsearch.randomizedtesting.rules.NoShadowingOrOverridesOnMethodsRule$1.evaluate(NoShadowingOrOverridesOnMethodsRule.java:40)
   [junit4]   2> 	at com.carrotsearch.randomizedtesting.rules.StatementAdapter.evaluate(StatementAdapter.java:36)
   [junit4]   2> 	at com.carrotsearch.randomizedtesting.rules.StatementAdapter.evaluate(StatementAdapter.java:36)
   [junit4]   2> 	at org.apache.lucene.util.TestRuleAssertionsRequired$1.evaluate(TestRuleAssertionsRequired.java:53)
   [junit4]   2> 	at org.apache.lucene.util.TestRuleMarkFailure$1.evaluate(TestRuleMarkFailure.java:47)
   [junit4]   2> 	at org.apache.lucene.util.TestRuleIgnoreAfterMaxFailures$1.evaluate(TestRuleIgnoreAfterMaxFailures.java:64)
   [junit4]   2> 	at org.apache.lucene.util.TestRuleIgnoreTestSuites$1.evaluate(TestRuleIgnoreTestSuites.java:54)
   [junit4]   2> 	at com.carrotsearch.randomizedtesting.rules.StatementAdapter.evaluate(StatementAdapter.java:36)
   [junit4]   2> 	at com.carrotsearch.randomizedtesting.ThreadLeakControl$StatementRunner.run(ThreadLeakControl.java:368)
   [junit4]   2> 	at java.base/java.lang.Thread.run(Thread.java:844)
   [junit4]   2> 
   [junit4]   2> 1224220 INFO  (TEST-RootFieldTest.testLegacyBlockProcessing-seed#[DF8DBCAF454B18F5]) [    ] o.a.s.SolrTestCaseJ4 ###Ending testLegacyBlockProcessing
   [junit4]   2> NOTE: reproduce with: ant test  -Dtestcase=RootFieldTest -Dtests.method=testLegacyBlockProcessing -Dtests.seed=DF8DBCAF454B18F5 -Dtests.slow=true -Dtests.locale=en-MH -Dtests.timezone=Africa/Mogadishu -Dtests.asserts=true -Dtests.file.encoding=UTF-8
   [junit4] ERROR   0.03s J0 | RootFieldTest.testLegacyBlockProcessing <<<
   [junit4]    > Throwable #1: org.apache.solr.common.SolrException: ERROR: [doc=11] unknown field 'name'
   [junit4]    > 	at __randomizedtesting.SeedInfo.seed([DF8DBCAF454B18F5:BEB7AA1384ACE6C4]:0)
   [junit4]    > 	at org.apache.solr.update.DocumentBuilder.toDocument(DocumentBuilder.java:226)
   [junit4]    > 	at org.apache.solr.update.AddUpdateCommand.getLuceneDocument(AddUpdateCommand.java:105)
   [junit4]    > 	at org.apache.solr.update.DirectUpdateHandler2.updateDocOrDocValues(DirectUpdateHandler2.java:963)
   [junit4]    > 	at org.apache.solr.update.DirectUpdateHandler2.doNormalUpdate(DirectUpdateHandler2.java:342)
   [junit4]    > 	at org.apache.solr.update.DirectUpdateHandler2.addDoc0(DirectUpdateHandler2.java:289)
   [junit4]    > 	at org.apache.solr.update.DirectUpdateHandler2.addDoc(DirectUpdateHandler2.java:236)
   [junit4]    > 	at org.apache.solr.update.processor.RunUpdateProcessor.processAdd(RunUpdateProcessorFactory.java:67)
   [junit4]    > 	at org.apache.solr.update.processor.UpdateRequestProcessor.processAdd(UpdateRequestProcessor.java:55)
   [junit4]    > 	at org.apache.solr.update.processor.DistributedUpdateProcessor.doLocalAdd(DistributedUpdateProcessor.java:943)
   [junit4]    > 	at org.apache.solr.update.processor.DistributedUpdateProcessor.versionAdd(DistributedUpdateProcessor.java:1159)
   [junit4]    > 	at org.apache.solr.update.processor.DistributedUpdateProcessor.processAdd(DistributedUpdateProcessor.java:648)
   [junit4]    > 	at org.apache.solr.update.processor.LogUpdateProcessorFactory$LogUpdateProcessor.processAdd(LogUpdateProcessorFactory.java:103)
   [junit4]    > 	at org.apache.solr.handler.loader.JavabinLoader$1.update(JavabinLoader.java:118)
   [junit4]    > 	at org.apache.solr.client.solrj.request.JavaBinUpdateRequestCodec$1.readOuterMostDocIterator(JavaBinUpdateRequestCodec.java:188)
   [junit4]    > 	at org.apache.solr.client.solrj.request.JavaBinUpdateRequestCodec$1.readIterator(JavaBinUpdateRequestCodec.java:144)
   [junit4]    > 	at org.apache.solr.common.util.JavaBinCodec.readObject(JavaBinCodec.java:330)
   [junit4]    > 	at org.apache.solr.common.util.JavaBinCodec.readVal(JavaBinCodec.java:275)
   [junit4]    > 	at org.apache.solr.client.solrj.request.JavaBinUpdateRequestCodec$1.readNamedList(JavaBinUpdateRequestCodec.java:130)
   [junit4]    > 	at org.apache.solr.common.util.JavaBinCodec.readObject(JavaBinCodec.java:295)
   [junit4]    > 	at org.apache.solr.common.util.JavaBinCodec.readVal(JavaBinCodec.java:275)
   [junit4]    > 	at org.apache.solr.common.util.JavaBinCodec.unmarshal(JavaBinCodec.java:188)
   [junit4]    > 	at org.apache.solr.client.solrj.request.JavaBinUpdateRequestCodec.unmarshal(JavaBinUpdateRequestCodec.java:195)
   [junit4]    > 	at org.apache.solr.handler.loader.JavabinLoader.parseAndLoadDocs(JavabinLoader.java:129)
   [junit4]    > 	at org.apache.solr.handler.loader.JavabinLoader.load(JavabinLoader.java:71)
   [junit4]    > 	at org.apache.solr.handler.UpdateRequestHandler$1.load(UpdateRequestHandler.java:97)
   [junit4]    > 	at org.apache.solr.handler.ContentStreamHandlerBase.handleRequestBody(ContentStreamHandlerBase.java:68)
   [junit4]    > 	at org.apache.solr.handler.RequestHandlerBase.handleRequest(RequestHandlerBase.java:199)
   [junit4]    > 	at org.apache.solr.core.SolrCore.execute(SolrCore.java:2541)
   [junit4]    > 	at org.apache.solr.client.solrj.embedded.EmbeddedSolrServer.request(EmbeddedSolrServer.java:191)
   [junit4]    > 	at org.apache.solr.client.solrj.SolrRequest.process(SolrRequest.java:194)
   [junit4]    > 	at org.apache.solr.client.solrj.SolrClient.add(SolrClient.java:177)
   [junit4]    > 	at org.apache.solr.client.solrj.SolrClient.add(SolrClient.java:138)
   [junit4]    > 	at org.apache.solr.client.solrj.SolrClient.add(SolrClient.java:156)
   [junit4]    > 	at org.apache.solr.update.RootFieldTest.testLegacyBlockProcessing(RootFieldTest.java:68)
   [junit4]    > 	at java.base/jdk.internal.reflect.NativeMethodAccessorImpl.invoke0(Native Method)
   [junit4]    > 	at java.base/jdk.internal.reflect.NativeMethodAccessorImpl.invoke(NativeMethodAccessorImpl.java:62)
   [junit4]    > 	at java.base/jdk.internal.reflect.DelegatingMethodAccessorImpl.invoke(DelegatingMethodAccessorImpl.java:43)
   [junit4]    > 	at java.base/java.lang.reflect.Method.invoke(Method.java:564)
   [junit4]    > 	at java.base/java.lang.Thread.run(Thread.java:844)
   [junit4]   2> 1224230 INFO  (TEST-RootFieldTest.testUpdateWithChildDocs-seed#[DF8DBCAF454B18F5]) [    ] o.a.s.SolrTestCaseJ4 ###Starting testUpdateWithChildDocs
   [junit4]   2> 1224231 INFO  (TEST-RootFieldTest.testUpdateWithChildDocs-seed#[DF8DBCAF454B18F5]) [    ] o.a.s.u.p.LogUpdateProcessorFactory [collection1]  webapp=null path=/update params={}{deleteByQuery=*:* (-1618187973533106176)} 0 0
   [junit4]   2> 1224239 INFO  (TEST-RootFieldTest.testUpdateWithChildDocs-seed#[DF8DBCAF454B18F5]) [    ] o.a.s.u.p.LogUpdateProcessorFactory [collection1]  webapp=null path=/update params={}{} 0 0
   [junit4]   2> 1224239 ERROR (TEST-RootFieldTest.testUpdateWithChildDocs-seed#[DF8DBCAF454B18F5]) [    ] o.a.s.h.RequestHandlerBase org.apache.solr.common.SolrException: Unable to index docs with children: the schema must include definitions for both a uniqueKey field and the '_root_' field, using the exact same fieldType
   [junit4]   2> 	at org.apache.solr.update.DocumentBuilder.unexpectedNestedDocException(DocumentBuilder.java:260)
   [junit4]   2> 	at org.apache.solr.update.DocumentBuilder.toDocument(DocumentBuilder.java:128)
   [junit4]   2> 	at org.apache.solr.update.AddUpdateCommand.getLuceneDocument(AddUpdateCommand.java:105)
   [junit4]   2> 	at org.apache.solr.update.DirectUpdateHandler2.updateDocOrDocValues(DirectUpdateHandler2.java:963)
   [junit4]   2> 	at org.apache.solr.update.DirectUpdateHandler2.doNormalUpdate(DirectUpdateHandler2.java:342)
   [junit4]   2> 	at org.apache.solr.update.DirectUpdateHandler2.addDoc0(DirectUpdateHandler2.java:289)
   [junit4]   2> 	at org.apache.solr.update.DirectUpdateHandler2.addDoc(DirectUpdateHandler2.java:236)
   [junit4]   2> 	at org.apache.solr.update.processor.RunUpdateProcessor.processAdd(RunUpdateProcessorFactory.java:67)
   [junit4]   2> 	at org.apache.solr.update.processor.UpdateRequestProcessor.processAdd(UpdateRequestProcessor.java:55)
   [junit4]   2> 	at org.apache.solr.update.processor.DistributedUpdateProcessor.doLocalAdd(DistributedUpdateProcessor.java:943)
   [junit4]   2> 	at org.apache.solr.update.processor.DistributedUpdateProcessor.versionAdd(DistributedUpdateProcessor.java:1159)
   [junit4]   2> 	at org.apache.solr.update.processor.DistributedUpdateProcessor.processAdd(DistributedUpdateProcessor.java:648)
   [junit4]   2> 	at org.apache.solr.update.processor.LogUpdateProcessorFactory$LogUpdateProcessor.processAdd(LogUpdateProcessorFactory.java:103)
   [junit4]   2> 	at org.apache.solr.handler.loader.JavabinLoader$1.update(JavabinLoader.java:118)
   [junit4]   2> 	at org.apache.solr.client.solrj.request.JavaBinUpdateRequestCodec$1.readOuterMostDocIterator(JavaBinUpdateRequestCodec.java:188)
   [junit4]   2> 	at org.apache.solr.client.solrj.request.JavaBinUpdateRequestCodec$1.readIterator(JavaBinUpdateRequestCodec.java:144)
   [junit4]   2> 	at org.apache.solr.common.util.JavaBinCodec.readObject(JavaBinCodec.java:330)
   [junit4]   2> 	at org.apache.solr.common.util.JavaBinCodec.readVal(JavaBinCodec.java:275)
   [junit4]   2> 	at org.apache.solr.client.solrj.request.JavaBinUpdateRequestCodec$1.readNamedList(JavaBinUpdateRequestCodec.java:130)
   [junit4]   2> 	at org.apache.solr.common.util.JavaBinCodec.readObject(JavaBinCodec.java:295)
   [junit4]   2> 	at org.apache.solr.common.util.JavaBinCodec.readVal(JavaBinCodec.java:275)
   [junit4]   2> 	at org.apache.solr.common.util.JavaBinCodec.unmarshal(JavaBinCodec.java:188)
   [junit4]   2> 	at org.apache.solr.client.solrj.request.JavaBinUpdateRequestCodec.unmarshal(JavaBinUpdateRequestCodec.java:195)
   [junit4]   2> 	at org.apache.solr.handler.loader.JavabinLoader.parseAndLoadDocs(JavabinLoader.java:129)
   [junit4]   2> 	at org.apache.solr.handler.loader.JavabinLoader.load(JavabinLoader.java:71)
   [junit4]   2> 	at org.apache.solr.handler.UpdateRequestHandler$1.load(UpdateRequestHandler.java:97)
   [junit4]   2> 	at org.apache.solr.handler.ContentStreamHandlerBase.handleRequestBody(ContentStreamHandlerBase.java:68)
   [junit4]   2> 	at org.apache.solr.handler.RequestHandlerBase.handleRequest(RequestHandlerBase.java:199)
   [junit4]   2> 	at org.apache.solr.core.SolrCore.execute(SolrCore.java:2541)
   [junit4]   2> 	at org.apache.solr.client.solrj.embedded.EmbeddedSolrServer.request(EmbeddedSolrServer.java:191)
   [junit4]   2> 	at org.apache.solr.client.solrj.SolrRequest.process(SolrRequest.java:194)
   [junit4]   2> 	at org.apache.solr.client.solrj.SolrClient.add(SolrClient.java:177)
   [junit4]   2> 	at org.apache.solr.client.solrj.SolrClient.add(SolrClient.java:138)
   [junit4]   2> 	at org.apache.solr.client.solrj.SolrClient.add(SolrClient.java:156)
   [junit4]   2> 	at org.apache.solr.update.RootFieldTest.testUpdateWithChildDocs(RootFieldTest.java:121)
   [junit4]   2> 	at java.base/jdk.internal.reflect.NativeMethodAccessorImpl.invoke0(Native Method)
   [junit4]   2> 	at java.base/jdk.internal.reflect.NativeMethodAccessorImpl.invoke(NativeMethodAccessorImpl.java:62)
   [junit4]   2> 	at java.base/jdk.internal.reflect.DelegatingMethodAccessorImpl.invoke(DelegatingMethodAccessorImpl.java:43)
   [junit4]   2> 	at java.base/java.lang.reflect.Method.invoke(Method.java:564)
   [junit4]   2> 	at com.carrotsearch.randomizedtesting.RandomizedRunner.invoke(RandomizedRunner.java:1742)
   [junit4]   2> 	at com.carrotsearch.randomizedtesting.RandomizedRunner$8.evaluate(RandomizedRunner.java:935)
   [junit4]   2> 	at com.carrotsearch.randomizedtesting.RandomizedRunner$9.evaluate(RandomizedRunner.java:971)
   [junit4]   2> 	at com.carrotsearch.randomizedtesting.RandomizedRunner$10.evaluate(RandomizedRunner.java:985)
   [junit4]   2> 	at org.junit.rules.ExpectedException$ExpectedExceptionStatement.evaluate(ExpectedException.java:110)
   [junit4]   2> 	at com.carrotsearch.randomizedtesting.rules.SystemPropertiesRestoreRule$1.evaluate(SystemPropertiesRestoreRule.java:57)
   [junit4]   2> 	at org.apache.lucene.util.TestRuleSetupTeardownChained$1.evaluate(TestRuleSetupTeardownChained.java:49)
   [junit4]   2> 	at org.apache.lucene.util.AbstractBeforeAfterRule$1.evaluate(AbstractBeforeAfterRule.java:45)
   [junit4]   2> 	at org.apache.lucene.util.TestRuleThreadAndTestName$1.evaluate(TestRuleThreadAndTestName.java:48)
   [junit4]   2> 	at org.apache.lucene.util.TestRuleIgnoreAfterMaxFailures$1.evaluate(TestRuleIgnoreAfterMaxFailures.java:64)
   [junit4]   2> 	at org.apache.lucene.util.TestRuleMarkFailure$1.evaluate(TestRuleMarkFailure.java:47)
   [junit4]   2> 	at com.carrotsearch.randomizedtesting.rules.StatementAdapter.evaluate(StatementAdapter.java:36)
   [junit4]   2> 	at com.carrotsearch.randomizedtesting.ThreadLeakControl$StatementRunner.run(ThreadLeakControl.java:368)
   [junit4]   2> 	at com.carrotsearch.randomizedtesting.ThreadLeakControl.forkTimeoutingTask(ThreadLeakControl.java:817)
   [junit4]   2> 	at com.carrotsearch.randomizedtesting.ThreadLeakControl$3.evaluate(ThreadLeakControl.java:468)
   [junit4]   2> 	at com.carrotsearch.randomizedtesting.RandomizedRunner.runSingleTest(RandomizedRunner.java:944)
   [junit4]   2> 	at com.carrotsearch.randomizedtesting.RandomizedRunner$5.evaluate(RandomizedRunner.java:830)
   [junit4]   2> 	at com.carrotsearch.randomizedtesting.RandomizedRunner$6.evaluate(RandomizedRunner.java:880)
   [junit4]   2> 	at com.carrotsearch.randomizedtesting.RandomizedRunner$7.evaluate(RandomizedRunner.java:891)
   [junit4]   2> 	at com.carrotsearch.randomizedtesting.rules.StatementAdapter.evaluate(StatementAdapter.java:36)
   [junit4]   2> 	at com.carrotsearch.randomizedtesting.rules.SystemPropertiesRestoreRule$1.evaluate(SystemPropertiesRestoreRule.java:57)
   [junit4]   2> 	at org.apache.lucene.util.AbstractBeforeAfterRule$1.evaluate(AbstractBeforeAfterRule.java:45)
   [junit4]   2> 	at com.carrotsearch.randomizedtesting.rules.StatementAdapter.evaluate(StatementAdapter.java:36)
   [junit4]   2> 	at org.apache.lucene.util.TestRuleStoreClassName$1.evaluate(TestRuleStoreClassName.java:41)
   [junit4]   2> 	at com.carrotsearch.randomizedtesting.rules.NoShadowingOrOverridesOnMethodsRule$1.evaluate(NoShadowingOrOverridesOnMethodsRule.java:40)
   [junit4]   2> 	at com.carrotsearch.randomizedtesting.rules.NoShadowingOrOverridesOnMethodsRule$1.evaluate(NoShadowingOrOverridesOnMethodsRule.java:40)
   [junit4]   2> 	at com.carrotsearch.randomizedtesting.rules.StatementAdapter.evaluate(StatementAdapter.java:36)
   [junit4]   2> 	at com.carrotsearch.randomizedtesting.rules.StatementAdapter.evaluate(StatementAdapter.java:36)
   [junit4]   2> 	at org.apache.lucene.util.TestRuleAssertionsRequired$1.evaluate(TestRuleAssertionsRequired.java:53)
   [junit4]   2> 	at org.apache.lucene.util.TestRuleMarkFailure$1.evaluate(TestRuleMarkFailure.java:47)
   [junit4]   2> 	at org.apache.lucene.util.TestRuleIgnoreAfterMaxFailures$1.evaluate(TestRuleIgnoreAfterMaxFailures.java:64)
   [junit4]   2> 	at org.apache.lucene.util.TestRuleIgnoreTestSuites$1.evaluate(TestRuleIgnoreTestSuites.java:54)
   [junit4]   2> 	at com.carrotsearch.randomizedtesting.rules.StatementAdapter.evaluate(StatementAdapter.java:36)
   [junit4]   2> 	at com.carrotsearch.randomizedtesting.ThreadLeakControl$StatementRunner.run(ThreadLeakControl.java:368)
   [junit4]   2> 	at java.base/java.lang.Thread.run(Thread.java:844)
   [junit4]   2> 
   [junit4]   2> 1224245 INFO  (TEST-RootFieldTest.testUpdateWithChildDocs-seed#[DF8DBCAF454B18F5]) [    ] o.a.s.SolrTestCaseJ4 ###Ending testUpdateWithChildDocs
   [junit4]   2> 1224245 INFO  (SUITE-RootFieldTest-seed#[DF8DBCAF454B18F5]-worker) [    ] o.a.s.SolrTestCaseJ4 ###deleteCore
   [junit4]   2> 1224245 INFO  (SUITE-RootFieldTest-seed#[DF8DBCAF454B18F5]-worker) [    ] o.a.s.c.CoreContainer Shutting down CoreContainer instance=1934134476
   [junit4]   2> 1224246 INFO  (SUITE-RootFieldTest-seed#[DF8DBCAF454B18F5]-worker) [    ] o.a.s.m.SolrMetricManager Closing metric reporters for registry=solr.node, tag=null
   [junit4]   2> 1224246 INFO  (SUITE-RootFieldTest-seed#[DF8DBCAF454B18F5]-worker) [    ] o.a.s.m.r.SolrJmxReporter Closing reporter [org.apache.solr.metrics.reporters.SolrJmxReporter@723b537d: rootName = null, domain = solr.node, service url = null, agent id = null] for registry solr.node / com.codahale.metrics.MetricRegistry@225c8cb4
   [junit4]   2> 1224253 INFO  (SUITE-RootFieldTest-seed#[DF8DBCAF454B18F5]-worker) [    ] o.a.s.m.SolrMetricManager Closing metric reporters for registry=solr.jvm, tag=null
   [junit4]   2> 1224253 INFO  (SUITE-RootFieldTest-seed#[DF8DBCAF454B18F5]-worker) [    ] o.a.s.m.r.SolrJmxReporter Closing reporter [org.apache.solr.metrics.reporters.SolrJmxReporter@59d43e56: rootName = null, domain = solr.jvm, service url = null, agent id = null] for registry solr.jvm / com.codahale.metrics.MetricRegistry@50690067
   [junit4]   2> 1224261 INFO  (SUITE-RootFieldTest-seed#[DF8DBCAF454B18F5]-worker) [    ] o.a.s.m.SolrMetricManager Closing metric reporters for registry=solr.jetty, tag=null
   [junit4]   2> 1224261 INFO  (SUITE-RootFieldTest-seed#[DF8DBCAF454B18F5]-worker) [    ] o.a.s.m.r.SolrJmxReporter Closing reporter [org.apache.solr.metrics.reporters.SolrJmxReporter@799675c7: rootName = null, domain = solr.jetty, service url = null, agent id = null] for registry solr.jetty / com.codahale.metrics.MetricRegistry@4099d167
   [junit4]   2> 1224261 INFO  (coreCloseExecutor-4824-thread-1) [    x:collection1] o.a.s.c.SolrCore [collection1]  CLOSING SolrCore org.apache.solr.core.SolrCore@5a8bdd4b
   [junit4]   2> 1224262 INFO  (coreCloseExecutor-4824-thread-1) [    x:collection1] o.a.s.m.SolrMetricManager Closing metric reporters for registry=solr.core.collection1, tag=5a8bdd4b
   [junit4]   2> 1224262 INFO  (coreCloseExecutor-4824-thread-1) [    x:collection1] o.a.s.m.r.SolrJmxReporter Closing reporter [org.apache.solr.metrics.reporters.SolrJmxReporter@21b4a67f: rootName = null, domain = solr.core.collection1, service url = null, agent id = null] for registry solr.core.collection1 / com.codahale.metrics.MetricRegistry@6aa858c6
   [junit4]   2> 1224278 INFO  (coreCloseExecutor-4824-thread-1) [    x:collection1] o.a.s.u.DirectUpdateHandler2 Committing on IndexWriter close.
   [junit4]   2> 1224278 INFO  (coreCloseExecutor-4824-thread-1) [    x:collection1] o.a.s.u.SolrIndexWriter Calling setCommitData with IW:org.apache.solr.update.SolrIndexWriter@605033b6 commitCommandVersion:0
   [junit4]   2> NOTE: leaving temporary files on disk at: /Users/jenkins/workspace/Lucene-Solr-master-MacOSX/solr/build/solr-core/test/J0/temp/solr.update.RootFieldTest_DF8DBCAF454B18F5-001
   [junit4]   2> NOTE: test params are: codec=CheapBastard, sim=Asserting(org.apache.lucene.search.similarities.AssertingSimilarity@1457edd3), locale=en-MH, timezone=Africa/Mogadishu
   [junit4]   2> NOTE: Mac OS X 10.11.6 x86_64/Oracle Corporation 9 (64-bit)/cpus=3,threads=1,free=241250632,total=518979584
   [junit4]   2> NOTE: All tests run in this JVM: [CdcrUpdateLogTest, TestLegacyNumericUtils, HdfsWriteToMultipleCollectionsTest, TestRawTransformer, TestImpersonationWithHadoopAuth, MigrateRouteKeyTest, TestCollationFieldDocValues, HdfsNNFailoverTest, SolrJmxReporterTest, SystemInfoHandlerTest, TestMinHashQParser, TestWithCollection, TestSolr4Spatial, SpatialHeatmapFacetsTest, RuleEngineTest, AnalyticsQueryTest, AnalysisAfterCoreReloadTest, StatelessScriptUpdateProcessorFactoryTest, TestJsonRequest, TestMultiValuedNumericRangeQuery, TestManagedSynonymFilterFactory, TestJsonFacetsWithNestedObjects, TestNonDefinedSimilarityFactory, SolrCloudReportersTest, MoveReplicaTest, DisMaxRequestHandlerTest, XmlUpdateRequestHandlerTest, DistanceFunctionTest, QueryParsingTest, ExternalFileFieldSortTest, LegacyCloudClusterPropTest, AutoScalingHandlerTest, TestIndexingPerformance, VersionInfoTest, V2ApiIntegrationTest, TestCloudNestedDocsSort, TestSimDistributedQueue, TestIndexSearcher, TestRandomFaceting, SolrMetricsIntegrationTest, TestReplicaProperties, CdcrBidirectionalTest, TestSimExtremeIndexing, CreateCollectionCleanupTest, TestSchemalessBufferedUpdates, CachingDirectoryFactoryTest, SimpleMLTQParserTest, DistributedSuggestComponentTest, DocValuesMissingTest, TestCoreAdminApis, TestComponentsName, DirectUpdateHandlerTest, TestFileDictionaryLookup, TestCloudRecovery2, DeleteShardTest, EmbeddedSolrNoSerializeTest, TestLegacyField, TestPolicyCloud, TestConfigSetsAPIExclusivity, TestInPlaceUpdatesDistrib, JsonLoaderTest, TestNRTOpen, TestUseDocValuesAsStored, TestImplicitCoreProperties, DistributedFacetPivotLargeTest, SolrInfoBeanTest, TestStressVersions, TestSolrCloudWithSecureImpersonation, TestDocSet, TestCrossCoreJoin, TestPKIAuthenticationPlugin, AdminHandlersProxyTest, HdfsChaosMonkeyNothingIsSafeTest, DateFieldTest, DistributedExpandComponentTest, RollingRestartTest, NodeAddedTriggerIntegrationTest, DocExpirationUpdateProcessorFactoryTest, MultiThreadedOCPTest, ScheduledTriggerTest, SuggestComponentContextFilterQueryTest, AssignTest, TestNamedUpdateProcessors, BlockDirectoryTest, CdcrWithNodesRestartsTest, NodeMarkersRegistrationTest, ReplicaListTransformerTest, TestCloudPhrasesIdentificationComponent, SuggesterWFSTTest, ShardRoutingTest, CoreSorterTest, ZkFailoverTest, BadCopyFieldTest, SolrCmdDistributorTest, TestSolrCoreParser, OutputWriterTest, SpellCheckComponentTest, TestLeaderElectionZkExpiry, TestSQLHandlerNonCloud, SchemaApiFailureTest, TestHashPartitioner, SaslZkACLProviderTest, TestAddFieldRealTimeGet, ConnectionReuseTest, TestTrieFacet, TestDistribIDF, AlternateDirectoryTest, RootFieldTest]
   [junit4] Completed [310/837 (1!)] on J0 in 1.26s, 2 tests, 1 error <<< FAILURES!

[...truncated 44298 lines...]
[repro] Jenkins log URL: https://jenkins.thetaphi.de/job/Lucene-Solr-master-MacOSX/4949/consoleText

[repro] Revision: a346ba0d3c371ec9f314c21fe67afeca64846cf0

[repro] Ant options: "-Dargs=-XX:+UseCompressedOops -XX:+UseSerialGC"
[repro] Repro line:  ant test  -Dtestcase=RootFieldTest -Dtests.method=testLegacyBlockProcessing -Dtests.seed=DF8DBCAF454B18F5 -Dtests.slow=true -Dtests.locale=en-MH -Dtests.timezone=Africa/Mogadishu -Dtests.asserts=true -Dtests.file.encoding=UTF-8

[repro] ant clean

[...truncated 6 lines...]
[repro] Test suites by module:
[repro]    solr/core
[repro]       RootFieldTest
[repro] ant compile-test

[...truncated 3600 lines...]
[repro] ant test-nocompile -Dtests.dups=5 -Dtests.maxfailures=5 -Dtests.class="*.RootFieldTest" -Dtests.showOutput=onerror "-Dargs=-XX:+UseCompressedOops -XX:+UseSerialGC" -Dtests.seed=DF8DBCAF454B18F5 -Dtests.slow=true -Dtests.locale=en-MH -Dtests.timezone=Africa/Mogadishu -Dtests.asserts=true -Dtests.file.encoding=UTF-8

[...truncated 31 lines...]
   [junit4] Suite: org.apache.solr.update.RootFieldTest
   [junit4]   2> Creating dataDir: /Users/jenkins/workspace/Lucene-Solr-master-MacOSX/solr/build/solr-core/test/J0/temp/solr.update.RootFieldTest_DF8DBCAF454B18F5-001/init-core-data-001
   [junit4]   2> 2770 INFO  (SUITE-RootFieldTest-seed#[DF8DBCAF454B18F5]-worker) [    ] o.a.s.SolrTestCaseJ4 Using PointFields (NUMERIC_POINTS_SYSPROP=true) w/NUMERIC_DOCVALUES_SYSPROP=true
   [junit4]   2> 2820 INFO  (SUITE-RootFieldTest-seed#[DF8DBCAF454B18F5]-worker) [    ] o.e.j.u.log Logging initialized @2893ms to org.eclipse.jetty.util.log.Slf4jLog
   [junit4]   2> 2833 INFO  (SUITE-RootFieldTest-seed#[DF8DBCAF454B18F5]-worker) [    ] o.a.s.SolrTestCaseJ4 Randomized ssl (true) and clientAuth (false) via: @org.apache.solr.util.RandomizeSSL(reason="", value=0.0/0.0, ssl=0.0/0.0, clientAuth=0.0/0.0) w/ MAC_OS_X supressed clientAuth
   [junit4]   2> 3047 INFO  (SUITE-RootFieldTest-seed#[DF8DBCAF454B18F5]-worker) [    ] o.a.s.SolrTestCaseJ4 SecureRandom sanity checks: test.solr.allowed.securerandom=null & java.security.egd=file:/dev/./urandom
   [junit4]   2> 3048 INFO  (SUITE-RootFieldTest-seed#[DF8DBCAF454B18F5]-worker) [    ] o.a.s.SolrTestCaseJ4 ####initCore
   [junit4]   2> 3177 INFO  (SUITE-RootFieldTest-seed#[DF8DBCAF454B18F5]-worker) [    ] o.a.s.c.SolrResourceLoader Using system property solr.solr.home: /Users/jenkins/workspace/Lucene-Solr-master-MacOSX/solr/core/src/test-files/solr
   [junit4]   2> 3182 INFO  (SUITE-RootFieldTest-seed#[DF8DBCAF454B18F5]-worker) [    ] o.a.s.c.SolrResourceLoader [null] Added 2 libs to classloader, from paths: [/Users/jenkins/workspace/Lucene-Solr-master-MacOSX/solr/core/src/test-files/solr/collection1/lib, /Users/jenkins/workspace/Lucene-Solr-master-MacOSX/solr/core/src/test-files/solr/collection1/lib/classes]
   [junit4]   2> 3575 INFO  (SUITE-RootFieldTest-seed#[DF8DBCAF454B18F5]-worker) [    ] o.a.s.c.SolrConfig Using Lucene MatchVersion: 8.0.0
   [junit4]   2> 3759 INFO  (SUITE-RootFieldTest-seed#[DF8DBCAF454B18F5]-worker) [    ] o.a.s.s.IndexSchema [null] Schema name=example
   [junit4]   2> 3928 WARN  (SUITE-RootFieldTest-seed#[DF8DBCAF454B18F5]-worker) [    ] o.a.s.c.SolrResourceLoader Solr loaded a deprecated plugin/analysis class [solr.GeoHashField]. Please consult documentation how to replace it accordingly.
   [junit4]   2> 3937 WARN  (SUITE-RootFieldTest-seed#[DF8DBCAF454B18F5]-worker) [    ] o.a.s.c.SolrResourceLoader Solr loaded a deprecated plugin/analysis class [solr.LatLonType]. Please consult documentation how to replace it accordingly.
   [junit4]   2> 3952 WARN  (SUITE-RootFieldTest-seed#[DF8DBCAF454B18F5]-worker) [    ] o.a.s.c.SolrResourceLoader Solr loaded a deprecated plugin/analysis class [solr.TrieDoubleField]. Please consult documentation how to replace it accordingly.
   [junit4]   2> 4048 INFO  (SUITE-RootFieldTest-seed#[DF8DBCAF454B18F5]-worker) [    ] o.a.s.s.IndexSchema Loaded schema example/1.1 with uniqueid field id
   [junit4]   2> 5141 INFO  (SUITE-RootFieldTest-seed#[DF8DBCAF454B18F5]-worker) [    ] o.a.s.c.TransientSolrCoreCacheDefault Allocating transient cache for 2147483647 transient cores
   [junit4]   2> 5145 INFO  (SUITE-RootFieldTest-seed#[DF8DBCAF454B18F5]-worker) [    ] o.a.s.h.a.MetricsHistoryHandler No .system collection, keeping metrics history in memory.
   [junit4]   2> 5311 INFO  (SUITE-RootFieldTest-seed#[DF8DBCAF454B18F5]-worker) [    ] o.a.s.m.r.SolrJmxReporter JMX monitoring for 'solr.node' (registry 'solr.node') enabled at server: com.sun.jmx.mbeanserver.JmxMBeanServer@1f8c1648
   [junit4]   2> 5315 INFO  (SUITE-RootFieldTest-seed#[DF8DBCAF454B18F5]-worker) [    ] o.a.s.m.r.SolrJmxReporter JMX monitoring for 'solr.jvm' (registry 'solr.jvm') enabled at server: com.sun.jmx.mbeanserver.JmxMBeanServer@1f8c1648
   [junit4]   2> 5317 INFO  (SUITE-RootFieldTest-seed#[DF8DBCAF454B18F5]-worker) [    ] o.a.s.m.r.SolrJmxReporter JMX monitoring for 'solr.jetty' (registry 'solr.jetty') enabled at server: com.sun.jmx.mbeanserver.JmxMBeanServer@1f8c1648
   [junit4]   2> 5388 INFO  (coreLoadExecutor-9-thread-1) [    x:collection1] o.a.s.c.SolrResourceLoader [null] Added 2 libs to classloader, from paths: [/Users/jenkins/workspace/Lucene-Solr-master-MacOSX/solr/core/src/test-files/solr/collection1/lib, /Users/jenkins/workspace/Lucene-Solr-master-MacOSX/solr/core/src/test-files/solr/collection1/lib/classes]
   [junit4]   2> 5432 INFO  (coreLoadExecutor-9-thread-1) [    x:collection1] o.a.s.c.SolrConfig Using Lucene MatchVersion: 8.0.0
   [junit4]   2> 5465 INFO  (coreLoadExecutor-9-thread-1) [    x:collection1] o.a.s.s.IndexSchema [collection1] Schema name=example
   [junit4]   2> 5532 INFO  (coreLoadExecutor-9-thread-1) [    x:collection1] o.a.s.s.IndexSchema Loaded schema example/1.1 with uniqueid field id
   [junit4]   2> 5554 INFO  (coreLoadExecutor-9-thread-1) [    x:collection1] o.a.s.c.CoreContainer Creating SolrCore 'collection1' using configuration from instancedir /Users/jenkins/workspace/Lucene-Solr-master-MacOSX/solr/core/src/test-files/solr/collection1, trusted=true
   [junit4]   2> 5643 INFO  (coreLoadExecutor-9-thread-1) [    x:collection1] o.a.s.m.r.SolrJmxReporter JMX monitoring for 'solr.core.collection1' (registry 'solr.core.collection1') enabled at server: com.sun.jmx.mbeanserver.JmxMBeanServer@1f8c1648
   [junit4]   2> 5659 INFO  (coreLoadExecutor-9-thread-1) [    x:collection1] o.a.s.c.SolrCore [[collection1] ] Opening new SolrCore at [/Users/jenkins/workspace/Lucene-Solr-master-MacOSX/solr/core/src/test-files/solr/collection1], dataDir=[/Users/jenkins/workspace/Lucene-Solr-master-MacOSX/solr/build/solr-core/test/J0/temp/solr.update.RootFieldTest_DF8DBCAF454B18F5-001/init-core-data-001/]
   [junit4]   2> 5745 INFO  (coreLoadExecutor-9-thread-1) [    x:collection1] o.a.s.u.RandomMergePolicy RandomMergePolicy wrapping class org.apache.lucene.index.LogByteSizeMergePolicy: [LogByteSizeMergePolicy: minMergeSize=1677721, mergeFactor=48, maxMergeSize=2147483648, maxMergeSizeForForcedMerge=9223372036854775807, calibrateSizeByDeletes=false, maxMergeDocs=2147483647, maxCFSSegmentSizeMB=8.796093022207999E12, noCFSRatio=0.722452340868009]
   [junit4]   2> 6737 INFO  (coreLoadExecutor-9-thread-1) [    x:collection1] o.a.s.u.UpdateHandler Using UpdateLog implementation: org.apache.solr.update.UpdateLog
   [junit4]   2> 6737 INFO  (coreLoadExecutor-9-thread-1) [    x:collection1] o.a.s.u.UpdateLog Initializing UpdateLog: dataDir= defaultSyncLevel=FLUSH numRecordsToKeep=100 maxNumLogsToKeep=10 numVersionBuckets=65536
   [junit4]   2> 6752 INFO  (coreLoadExecutor-9-thread-1) [    x:collection1] o.a.s.u.CommitTracker Hard AutoCommit: disabled
   [junit4]   2> 6752 INFO  (coreLoadExecutor-9-thread-1) [    x:collection1] o.a.s.u.CommitTracker Soft AutoCommit: disabled
   [junit4]   2> 6760 INFO  (coreLoadExecutor-9-thread-1) [    x:collection1] o.a.s.u.RandomMergePolicy RandomMergePolicy wrapping class org.apache.lucene.index.LogDocMergePolicy: [LogDocMergePolicy: minMergeSize=1000, mergeFactor=42, maxMergeSize=9223372036854775807, maxMergeSizeForForcedMerge=9223372036854775807, calibrateSizeByDeletes=true, maxMergeDocs=2147483647, maxCFSSegmentSizeMB=8.796093022207999E12, noCFSRatio=1.0]
   [junit4]   2> 6783 INFO  (coreLoadExecutor-9-thread-1) [    x:collection1] o.a.s.s.SolrIndexSearcher Opening [Searcher@b1ee95a[collection1] main]
   [junit4]   2> 6833 INFO  (coreLoadExecutor-9-thread-1) [    x:collection1] o.a.s.h.c.SpellCheckComponent Initializing spell checkers
   [junit4]   2> 6959 INFO  (coreLoadExecutor-9-thread-1) [    x:collection1] o.a.s.s.DirectSolrSpellChecker init: {name=direct,classname=DirectSolrSpellChecker,field=lowerfilt,minQueryLength=3}
   [junit4]   2> 7084 INFO  (coreLoadExecutor-9-thread-1) [    x:collection1] o.a.s.h.ReplicationHandler Commits will be reserved for 10000ms.
   [junit4]   2> 7085 INFO  (searcherExecutor-10-thread-1-processing-x:collection1) [    x:collection1] o.a.s.h.c.SpellCheckComponent Loading spell index for spellchecker: default
   [junit4]   2> 7087 INFO  (coreLoadExecutor-9-thread-1) [    x:collection1] o.a.s.u.UpdateLog Could not find max version in index or recent updates, using new clock 1618191329005666304
   [junit4]   2> 7095 INFO  (searcherExecutor-10-thread-1-processing-x:collection1) [    x:collection1] o.a.s.h.c.SpellCheckComponent Loading spell index for spellchecker: direct
   [junit4]   2> 7095 INFO  (searcherExecutor-10-thread-1-processing-x:collection1) [    x:collection1] o.a.s.h.c.SpellCheckComponent Loading spell index for spellchecker: wordbreak
   [junit4]   2> 7095 INFO  (SUITE-RootFieldTest-seed#[DF8DBCAF454B18F5]-worker) [    ] o.a.s.SolrTestCaseJ4 ####initCore end
   [junit4]   2> 7095 INFO  (searcherExecutor-10-thread-1-processing-x:collection1) [    x:collection1] o.a.s.h.c.SpellCheckComponent Loading spell index for spellchecker: multipleFields
   [junit4]   2> 7099 INFO  (searcherExecutor-10-thread-1-processing-x:collection1) [    x:collection1] o.a.s.h.c.SpellCheckComponent Loading spell index for spellchecker: jarowinkler
   [junit4]   2> 7110 INFO  (searcherExecutor-10-thread-1-processing-x:collection1) [    x:collection1] o.a.s.h.c.SpellCheckComponent Loading spell index for spellchecker: external
   [junit4]   2> 7112 INFO  (TEST-RootFieldTest.testLegacyBlockProcessing-seed#[DF8DBCAF454B18F5]) [    ] o.a.s.SolrTestCaseJ4 ###Starting testLegacyBlockProcessing
   [junit4]   2> 7122 INFO  (searcherExecutor-10-thread-1-processing-x:collection1) [    x:collection1] o.a.s.h.c.SpellCheckComponent Loading spell index for spellchecker: freq
   [junit4]   2> 7135 INFO  (searcherExecutor-10-thread-1-processing-x:collection1) [    x:collection1] o.a.s.h.c.SpellCheckComponent Loading spell index for spellchecker: fqcn
   [junit4]   2> 7148 INFO  (searcherExecutor-10-thread-1-processing-x:collection1) [    x:collection1] o.a.s.h.c.SpellCheckComponent Loading spell index for spellchecker: perDict
   [junit4]   2> 7158 INFO  (searcherExecutor-10-thread-1-processing-x:collection1) [    x:collection1] o.a.s.c.SolrCore [collection1] Registered new searcher Searcher@b1ee95a[collection1] main{ExitableDirectoryReader(UninvertingDirectoryReader())}
   [junit4]   2> 7239 INFO  (TEST-RootFieldTest.testLegacyBlockProcessing-seed#[DF8DBCAF454B18F5]) [    ] o.a.s.u.p.LogUpdateProcessorFactory [collection1]  webapp=null path=/update params={}{deleteByQuery=*:* (-1618191329098989568)} 0 99
   [junit4]   2> 7258 INFO  (TEST-RootFieldTest.testLegacyBlockProcessing-seed#[DF8DBCAF454B18F5]) [    ] o.a.s.u.p.LogUpdateProcessorFactory [collection1]  webapp=null path=/update params={}{} 0 15
   [junit4]   2> 7260 ERROR (TEST-RootFieldTest.testLegacyBlockProcessing-seed#[DF8DBCAF454B18F5]) [    ] o.a.s.h.RequestHandlerBase org.apache.solr.common.SolrException: ERROR: [doc=11] unknown field 'name'
   [junit4]   2> 	at org.apache.solr.update.DocumentBuilder.toDocument(DocumentBuilder.java:226)
   [junit4]   2> 	at org.apache.solr.update.AddUpdateCommand.getLuceneDocument(AddUpdateCommand.java:105)
   [junit4]   2> 	at org.apache.solr.update.DirectUpdateHandler2.updateDocOrDocValues(DirectUpdateHandler2.java:963)
   [junit4]   2> 	at org.apache.solr.update.DirectUpdateHandler2.doNormalUpdate(DirectUpdateHandler2.java:342)
   [junit4]   2> 	at org.apache.solr.update.DirectUpdateHandler2.addDoc0(DirectUpdateHandler2.java:289)
   [junit4]   2> 	at org.apache.solr.update.DirectUpdateHandler2.addDoc(DirectUpdateHandler2.java:236)
   [junit4]   2> 	at org.apache.solr.update.processor.RunUpdateProcessor.processAdd(RunUpdateProcessorFactory.java:67)
   [junit4]   2> 	at org.apache.solr.update.processor.UpdateRequestProcessor.processAdd(UpdateRequestProcessor.java:55)
   [junit4]   2> 	at org.apache.solr.update.processor.DistributedUpdateProcessor.doLocalAdd(DistributedUpdateProcessor.java:943)
   [junit4]   2> 	at org.apache.solr.update.processor.DistributedUpdateProcessor.versionAdd(DistributedUpdateProcessor.java:1159)
   [junit4]   2> 	at org.apache.solr.update.processor.DistributedUpdateProcessor.processAdd(DistributedUpdateProcessor.java:648)
   [junit4]   2> 	at org.apache.solr.update.processor.LogUpdateProcessorFactory$LogUpdateProcessor.processAdd(LogUpdateProcessorFactory.java:103)
   [junit4]   2> 	at org.apache.solr.handler.loader.JavabinLoader$1.update(JavabinLoader.java:118)
   [junit4]   2> 	at org.apache.solr.client.solrj.request.JavaBinUpdateRequestCodec$1.readOuterMostDocIterator(JavaBinUpdateRequestCodec.java:188)
   [junit4]   2> 	at org.apache.solr.client.solrj.request.JavaBinUpdateRequestCodec$1.readIterator(JavaBinUpdateRequestCodec.java:144)
   [junit4]   2> 	at org.apache.solr.common.util.JavaBinCodec.readObject(JavaBinCodec.java:330)
   [junit4]   2> 	at org.apache.solr.common.util.JavaBinCodec.readVal(JavaBinCodec.java:275)
   [junit4]   2> 	at org.apache.solr.client.solrj.request.JavaBinUpdateRequestCodec$1.readNamedList(JavaBinUpdateRequestCodec.java:130)
   [junit4]   2> 	at org.apache.solr.common.util.JavaBinCodec.readObject(JavaBinCodec.java:295)
   [junit4]   2> 	at org.apache.solr.common.util.JavaBinCodec.readVal(JavaBinCodec.java:275)
   [junit4]   2> 	at org.apache.solr.common.util.JavaBinCodec.unmarshal(JavaBinCodec.java:188)
   [junit4]   2> 	at org.apache.solr.client.solrj.request.JavaBinUpdateRequestCodec.unmarshal(JavaBinUpdateRequestCodec.java:195)
   [junit4]   2> 	at org.apache.solr.handler.loader.JavabinLoader.parseAndLoadDocs(JavabinLoader.java:129)
   [junit4]   2

[...truncated too long message...]

l.java:62)
   [junit4]   2> 	at java.base/jdk.internal.reflect.DelegatingMethodAccessorImpl.invoke(DelegatingMethodAccessorImpl.java:43)
   [junit4]   2> 	at java.base/java.lang.reflect.Method.invoke(Method.java:564)
   [junit4]   2> 	at com.carrotsearch.randomizedtesting.RandomizedRunner.invoke(RandomizedRunner.java:1742)
   [junit4]   2> 	at com.carrotsearch.randomizedtesting.RandomizedRunner$8.evaluate(RandomizedRunner.java:935)
   [junit4]   2> 	at com.carrotsearch.randomizedtesting.RandomizedRunner$9.evaluate(RandomizedRunner.java:971)
   [junit4]   2> 	at com.carrotsearch.randomizedtesting.RandomizedRunner$10.evaluate(RandomizedRunner.java:985)
   [junit4]   2> 	at org.junit.rules.ExpectedException$ExpectedExceptionStatement.evaluate(ExpectedException.java:110)
   [junit4]   2> 	at com.carrotsearch.randomizedtesting.rules.SystemPropertiesRestoreRule$1.evaluate(SystemPropertiesRestoreRule.java:57)
   [junit4]   2> 	at org.apache.lucene.util.TestRuleSetupTeardownChained$1.evaluate(TestRuleSetupTeardownChained.java:49)
   [junit4]   2> 	at org.apache.lucene.util.AbstractBeforeAfterRule$1.evaluate(AbstractBeforeAfterRule.java:45)
   [junit4]   2> 	at org.apache.lucene.util.TestRuleThreadAndTestName$1.evaluate(TestRuleThreadAndTestName.java:48)
   [junit4]   2> 	at org.apache.lucene.util.TestRuleIgnoreAfterMaxFailures$1.evaluate(TestRuleIgnoreAfterMaxFailures.java:64)
   [junit4]   2> 	at org.apache.lucene.util.TestRuleMarkFailure$1.evaluate(TestRuleMarkFailure.java:47)
   [junit4]   2> 	at com.carrotsearch.randomizedtesting.rules.StatementAdapter.evaluate(StatementAdapter.java:36)
   [junit4]   2> 	at com.carrotsearch.randomizedtesting.ThreadLeakControl$StatementRunner.run(ThreadLeakControl.java:368)
   [junit4]   2> 	at com.carrotsearch.randomizedtesting.ThreadLeakControl.forkTimeoutingTask(ThreadLeakControl.java:817)
   [junit4]   2> 	at com.carrotsearch.randomizedtesting.ThreadLeakControl$3.evaluate(ThreadLeakControl.java:468)
   [junit4]   2> 	at com.carrotsearch.randomizedtesting.RandomizedRunner.runSingleTest(RandomizedRunner.java:944)
   [junit4]   2> 	at com.carrotsearch.randomizedtesting.RandomizedRunner$5.evaluate(RandomizedRunner.java:830)
   [junit4]   2> 	at com.carrotsearch.randomizedtesting.RandomizedRunner$6.evaluate(RandomizedRunner.java:880)
   [junit4]   2> 	at com.carrotsearch.randomizedtesting.RandomizedRunner$7.evaluate(RandomizedRunner.java:891)
   [junit4]   2> 	at com.carrotsearch.randomizedtesting.rules.StatementAdapter.evaluate(StatementAdapter.java:36)
   [junit4]   2> 	at com.carrotsearch.randomizedtesting.rules.SystemPropertiesRestoreRule$1.evaluate(SystemPropertiesRestoreRule.java:57)
   [junit4]   2> 	at org.apache.lucene.util.AbstractBeforeAfterRule$1.evaluate(AbstractBeforeAfterRule.java:45)
   [junit4]   2> 	at com.carrotsearch.randomizedtesting.rules.StatementAdapter.evaluate(StatementAdapter.java:36)
   [junit4]   2> 	at org.apache.lucene.util.TestRuleStoreClassName$1.evaluate(TestRuleStoreClassName.java:41)
   [junit4]   2> 	at com.carrotsearch.randomizedtesting.rules.NoShadowingOrOverridesOnMethodsRule$1.evaluate(NoShadowingOrOverridesOnMethodsRule.java:40)
   [junit4]   2> 	at com.carrotsearch.randomizedtesting.rules.NoShadowingOrOverridesOnMethodsRule$1.evaluate(NoShadowingOrOverridesOnMethodsRule.java:40)
   [junit4]   2> 	at com.carrotsearch.randomizedtesting.rules.StatementAdapter.evaluate(StatementAdapter.java:36)
   [junit4]   2> 	at com.carrotsearch.randomizedtesting.rules.StatementAdapter.evaluate(StatementAdapter.java:36)
   [junit4]   2> 	at org.apache.lucene.util.TestRuleAssertionsRequired$1.evaluate(TestRuleAssertionsRequired.java:53)
   [junit4]   2> 	at org.apache.lucene.util.TestRuleMarkFailure$1.evaluate(TestRuleMarkFailure.java:47)
   [junit4]   2> 	at org.apache.lucene.util.TestRuleIgnoreAfterMaxFailures$1.evaluate(TestRuleIgnoreAfterMaxFailures.java:64)
   [junit4]   2> 	at org.apache.lucene.util.TestRuleIgnoreTestSuites$1.evaluate(TestRuleIgnoreTestSuites.java:54)
   [junit4]   2> 	at com.carrotsearch.randomizedtesting.rules.StatementAdapter.evaluate(StatementAdapter.java:36)
   [junit4]   2> 	at com.carrotsearch.randomizedtesting.ThreadLeakControl$StatementRunner.run(ThreadLeakControl.java:368)
   [junit4]   2> 	at java.base/java.lang.Thread.run(Thread.java:844)
   [junit4]   2> 
   [junit4]   2> 9459 INFO  (TEST-RootFieldTest.testUpdateWithChildDocs-seed#[DF8DBCAF454B18F5]) [    ] o.a.s.SolrTestCaseJ4 ###Ending testUpdateWithChildDocs
   [junit4] OK      0.01s J0 | RootFieldTest.testUpdateWithChildDocs
   [junit4]   2> 9460 INFO  (SUITE-RootFieldTest-seed#[DF8DBCAF454B18F5]-worker) [    ] o.a.s.SolrTestCaseJ4 ###deleteCore
   [junit4]   2> 9460 INFO  (SUITE-RootFieldTest-seed#[DF8DBCAF454B18F5]-worker) [    ] o.a.s.c.CoreContainer Shutting down CoreContainer instance=1678448441
   [junit4]   2> 9461 INFO  (SUITE-RootFieldTest-seed#[DF8DBCAF454B18F5]-worker) [    ] o.a.s.m.SolrMetricManager Closing metric reporters for registry=solr.node, tag=null
   [junit4]   2> 9461 INFO  (SUITE-RootFieldTest-seed#[DF8DBCAF454B18F5]-worker) [    ] o.a.s.m.r.SolrJmxReporter Closing reporter [org.apache.solr.metrics.reporters.SolrJmxReporter@25375911: rootName = null, domain = solr.node, service url = null, agent id = null] for registry solr.node / com.codahale.metrics.MetricRegistry@42e5ef10
   [junit4]   2> 9468 INFO  (SUITE-RootFieldTest-seed#[DF8DBCAF454B18F5]-worker) [    ] o.a.s.m.SolrMetricManager Closing metric reporters for registry=solr.jvm, tag=null
   [junit4]   2> 9468 INFO  (SUITE-RootFieldTest-seed#[DF8DBCAF454B18F5]-worker) [    ] o.a.s.m.r.SolrJmxReporter Closing reporter [org.apache.solr.metrics.reporters.SolrJmxReporter@603e974b: rootName = null, domain = solr.jvm, service url = null, agent id = null] for registry solr.jvm / com.codahale.metrics.MetricRegistry@16d8cf27
   [junit4]   2> 9469 INFO  (SUITE-RootFieldTest-seed#[DF8DBCAF454B18F5]-worker) [    ] o.a.s.m.SolrMetricManager Closing metric reporters for registry=solr.jetty, tag=null
   [junit4]   2> 9469 INFO  (SUITE-RootFieldTest-seed#[DF8DBCAF454B18F5]-worker) [    ] o.a.s.m.r.SolrJmxReporter Closing reporter [org.apache.solr.metrics.reporters.SolrJmxReporter@7e45893c: rootName = null, domain = solr.jetty, service url = null, agent id = null] for registry solr.jetty / com.codahale.metrics.MetricRegistry@61073826
   [junit4]   2> 9469 INFO  (coreCloseExecutor-47-thread-1) [    x:collection1] o.a.s.c.SolrCore [collection1]  CLOSING SolrCore org.apache.solr.core.SolrCore@75abd3c3
   [junit4]   2> 9470 INFO  (coreCloseExecutor-47-thread-1) [    x:collection1] o.a.s.m.SolrMetricManager Closing metric reporters for registry=solr.core.collection1, tag=75abd3c3
   [junit4]   2> 9470 INFO  (coreCloseExecutor-47-thread-1) [    x:collection1] o.a.s.m.r.SolrJmxReporter Closing reporter [org.apache.solr.metrics.reporters.SolrJmxReporter@1c06694e: rootName = null, domain = solr.core.collection1, service url = null, agent id = null] for registry solr.core.collection1 / com.codahale.metrics.MetricRegistry@146fe6d
   [junit4]   2> 9485 INFO  (coreCloseExecutor-47-thread-1) [    x:collection1] o.a.s.u.DirectUpdateHandler2 Committing on IndexWriter close.
   [junit4]   2> 9485 INFO  (coreCloseExecutor-47-thread-1) [    x:collection1] o.a.s.u.SolrIndexWriter Calling setCommitData with IW:org.apache.solr.update.SolrIndexWriter@bbe951d commitCommandVersion:0
   [junit4]   2> NOTE: leaving temporary files on disk at: /Users/jenkins/workspace/Lucene-Solr-master-MacOSX/solr/build/solr-core/test/J0/temp/solr.update.RootFieldTest_DF8DBCAF454B18F5-003
   [junit4]   2> NOTE: test params are: codec=CheapBastard, sim=Asserting(org.apache.lucene.search.similarities.AssertingSimilarity@62002293), locale=en-MH, timezone=Africa/Mogadishu
   [junit4]   2> NOTE: Mac OS X 10.11.6 x86_64/Oracle Corporation 9 (64-bit)/cpus=3,threads=1,free=4899472,total=58953728
   [junit4]   2> NOTE: All tests run in this JVM: [RootFieldTest, RootFieldTest, RootFieldTest]
   [junit4] Completed [5/5 (5!)] on J0 in 0.71s, 2 tests, 1 error <<< FAILURES!

[...truncated 14 lines...]
BUILD FAILED
/Users/jenkins/workspace/Lucene-Solr-master-MacOSX/lucene/common-build.xml:1567: The following error occurred while executing this line:
/Users/jenkins/workspace/Lucene-Solr-master-MacOSX/lucene/common-build.xml:1092: There were test failures: 5 suites, 10 tests, 5 errors [seed: DF8DBCAF454B18F5]

Total time: 12 seconds

[repro] Setting last failure code to 256

[repro] Failures:
[repro]   5/5 failed: org.apache.solr.update.RootFieldTest
[repro] Exiting with code 256
+ mv lucene/build lucene/build.repro
+ mv solr/build solr/build.repro
+ mv lucene/build.orig lucene/build
+ mv solr/build.orig solr/build
Archiving artifacts
Setting ANT_1_8_2_HOME=/Users/jenkins/tools/hudson.tasks.Ant_AntInstallation/ANT_1.8.2
[WARNINGS] Parsing warnings in console log with parser Java Compiler (javac)
Setting ANT_1_8_2_HOME=/Users/jenkins/tools/hudson.tasks.Ant_AntInstallation/ANT_1.8.2
Setting ANT_1_8_2_HOME=/Users/jenkins/tools/hudson.tasks.Ant_AntInstallation/ANT_1.8.2
<Git Blamer> Using GitBlamer to create author and commit information for all warnings.
<Git Blamer> GIT_COMMIT=a346ba0d3c371ec9f314c21fe67afeca64846cf0, workspace=/Users/jenkins/workspace/Lucene-Solr-master-MacOSX
[WARNINGS] Computing warning deltas based on reference build #4948
Recording test results
Setting ANT_1_8_2_HOME=/Users/jenkins/tools/hudson.tasks.Ant_AntInstallation/ANT_1.8.2
Build step 'Publish JUnit test result report' changed build result to UNSTABLE
Email was triggered for: Unstable (Test Failures)
Sending email for trigger: Unstable (Test Failures)
Setting ANT_1_8_2_HOME=/Users/jenkins/tools/hudson.tasks.Ant_AntInstallation/ANT_1.8.2
Setting ANT_1_8_2_HOME=/Users/jenkins/tools/hudson.tasks.Ant_AntInstallation/ANT_1.8.2
Setting ANT_1_8_2_HOME=/Users/jenkins/tools/hudson.tasks.Ant_AntInstallation/ANT_1.8.2
Setting ANT_1_8_2_HOME=/Users/jenkins/tools/hudson.tasks.Ant_AntInstallation/ANT_1.8.2