You are viewing a plain text version of this content. The canonical link for it is here.
Posted to commits@beam.apache.org by Apache Jenkins Server <je...@builds.apache.org> on 2018/06/26 18:50:09 UTC
Build failed in Jenkins:
beam_PostCommit_Java_ValidatesRunner_Flink_Gradle #939
See <https://builds.apache.org/job/beam_PostCommit_Java_ValidatesRunner_Flink_Gradle/939/display/redirect?page=changes>
Changes:
[yifanzou] [BEAM-4302] Add Jenkins job to check Beam dependencies and generate
------------------------------------------
[...truncated 86.91 KB...]
Compiling with error-prone compiler
Note: Some input files use unchecked or unsafe operations.
Note: Recompile with -Xlint:unchecked for details.
Packing task ':beam-sdks-java-fn-execution:compileJava'
:beam-sdks-java-fn-execution:compileJava (Thread[Task worker for ':' Thread 15,5,main]) completed. Took 6.835 secs.
:beam-sdks-java-fn-execution:classes (Thread[Task worker for ':' Thread 15,5,main]) started.
> Task :beam-sdks-java-fn-execution:classes
Skipping task ':beam-sdks-java-fn-execution:classes' as it has no actions.
:beam-sdks-java-fn-execution:classes (Thread[Task worker for ':' Thread 15,5,main]) completed. Took 0.0 secs.
:beam-sdks-java-fn-execution:shadowJar (Thread[Task worker for ':' Thread 15,5,main]) started.
> Task :beam-sdks-java-extensions-google-cloud-platform-core:compileJava
Build cache key for task ':beam-sdks-java-extensions-google-cloud-platform-core:compileJava' is f6cdb9e9f59c8a0cbed276d9f347fb1f
Task ':beam-sdks-java-extensions-google-cloud-platform-core:compileJava' is not up-to-date because:
No history is available.
Custom actions are attached to task ':beam-sdks-java-extensions-google-cloud-platform-core:compileJava'.
All input files are considered out-of-date for incremental task ':beam-sdks-java-extensions-google-cloud-platform-core:compileJava'.
Compiling with error-prone compiler
Packing task ':beam-sdks-java-extensions-google-cloud-platform-core:compileJava'
:beam-sdks-java-extensions-google-cloud-platform-core:compileJava (Thread[Task worker for ':' Thread 3,5,main]) completed. Took 7.003 secs.
:beam-sdks-java-extensions-google-cloud-platform-core:classes (Thread[Task worker for ':' Thread 3,5,main]) started.
> Task :beam-sdks-java-extensions-google-cloud-platform-core:classes
Skipping task ':beam-sdks-java-extensions-google-cloud-platform-core:classes' as it has no actions.
:beam-sdks-java-extensions-google-cloud-platform-core:classes (Thread[Task worker for ':' Thread 3,5,main]) completed. Took 0.0 secs.
:beam-sdks-java-extensions-google-cloud-platform-core:shadowJar (Thread[Task worker for ':' Thread 3,5,main]) started.
> Task :beam-sdks-java-core:compileTestJava
Build cache key for task ':beam-sdks-java-core:compileTestJava' is 1b2ca8deaeb01d9d27e34223b32ffc2c
Task ':beam-sdks-java-core:compileTestJava' is not up-to-date because:
No history is available.
Custom actions are attached to task ':beam-sdks-java-core:compileTestJava'.
All input files are considered out-of-date for incremental task ':beam-sdks-java-core:compileTestJava'.
Compiling with error-prone compiler
> Task :beam-sdks-java-fn-execution:shadowJar
Build cache key for task ':beam-sdks-java-fn-execution:shadowJar' is 99de5d02b1af5b45dac38a7cfd640f99
Caching disabled for task ':beam-sdks-java-fn-execution:shadowJar': Caching has not been enabled for the task
Task ':beam-sdks-java-fn-execution:shadowJar' is not up-to-date because:
No history is available.
*******************
GRADLE SHADOW STATS
Total Jars: 2 (includes project)
Total Time: 2.597s [2597ms]
Average Time/Jar: 1.2985s [1298.5ms]
*******************
:beam-sdks-java-fn-execution:shadowJar (Thread[Task worker for ':' Thread 15,5,main]) completed. Took 2.726 secs.
> Task :beam-sdks-java-extensions-google-cloud-platform-core:shadowJar
Build cache key for task ':beam-sdks-java-extensions-google-cloud-platform-core:shadowJar' is 398d029d822744ebbdbbca2962d0d613
Caching disabled for task ':beam-sdks-java-extensions-google-cloud-platform-core:shadowJar': Caching has not been enabled for the task
Task ':beam-sdks-java-extensions-google-cloud-platform-core:shadowJar' is not up-to-date because:
No history is available.
*******************
GRADLE SHADOW STATS
Total Jars: 2 (includes project)
Total Time: 2.794s [2794ms]
Average Time/Jar: 1.397s [1397.0ms]
*******************
:beam-sdks-java-extensions-google-cloud-platform-core:shadowJar (Thread[Task worker for ':' Thread 3,5,main]) completed. Took 2.918 secs.
> Task :beam-runners-core-construction-java:compileJava
Note: Some input files use or override a deprecated API.
Note: Recompile with -Xlint:deprecation for details.
Note: Some input files use unchecked or unsafe operations.
Note: Recompile with -Xlint:unchecked for details.
Packing task ':beam-runners-core-construction-java:compileJava'
:beam-runners-core-construction-java:compileJava (Thread[Task worker for ':' Thread 7,5,main]) completed. Took 10.788 secs.
:beam-runners-core-construction-java:classes (Thread[Task worker for ':' Thread 7,5,main]) started.
> Task :beam-runners-core-construction-java:classes
Skipping task ':beam-runners-core-construction-java:classes' as it has no actions.
:beam-runners-core-construction-java:classes (Thread[Task worker for ':' Thread 7,5,main]) completed. Took 0.0 secs.
:beam-runners-core-construction-java:shadowJar (Thread[Task worker for ':' Thread 7,5,main]) started.
> Task :beam-runners-core-construction-java:shadowJar
Build cache key for task ':beam-runners-core-construction-java:shadowJar' is a8a6119c1cd6fa16030e4f7d3835a446
Caching disabled for task ':beam-runners-core-construction-java:shadowJar': Caching has not been enabled for the task
Task ':beam-runners-core-construction-java:shadowJar' is not up-to-date because:
No history is available.
*******************
GRADLE SHADOW STATS
Total Jars: 2 (includes project)
Total Time: 2.059s [2059ms]
Average Time/Jar: 1.0295s [1029.5ms]
*******************
:beam-runners-core-construction-java:shadowJar (Thread[Task worker for ':' Thread 7,5,main]) completed. Took 2.341 secs.
:beam-runners-core-java:compileJava (Thread[Task worker for ':' Thread 7,5,main]) started.
> Task :beam-runners-core-java:compileJava
Build cache key for task ':beam-runners-core-java:compileJava' is d6730071c38583d56cae2eed31585dcc
Task ':beam-runners-core-java:compileJava' is not up-to-date because:
No history is available.
Custom actions are attached to task ':beam-runners-core-java:compileJava'.
All input files are considered out-of-date for incremental task ':beam-runners-core-java:compileJava'.
Compiling with error-prone compiler
Note: Some input files use or override a deprecated API.
Note: Recompile with -Xlint:deprecation for details.
Note: Some input files use unchecked or unsafe operations.
Note: Recompile with -Xlint:unchecked for details.
Packing task ':beam-runners-core-java:compileJava'
:beam-runners-core-java:compileJava (Thread[Task worker for ':' Thread 7,5,main]) completed. Took 7.198 secs.
:beam-runners-core-java:classes (Thread[Task worker for ':' Thread 7,5,main]) started.
> Task :beam-runners-core-java:classes
Skipping task ':beam-runners-core-java:classes' as it has no actions.
:beam-runners-core-java:classes (Thread[Task worker for ':' Thread 7,5,main]) completed. Took 0.0 secs.
:beam-runners-core-java:shadowJar (Thread[Task worker for ':' Thread 7,5,main]) started.
> Task :beam-runners-core-java:shadowJar
Build cache key for task ':beam-runners-core-java:shadowJar' is cd873a76945c08a36c0cf208ec3745bc
Caching disabled for task ':beam-runners-core-java:shadowJar': Caching has not been enabled for the task
Task ':beam-runners-core-java:shadowJar' is not up-to-date because:
No history is available.
*******************
GRADLE SHADOW STATS
Total Jars: 2 (includes project)
Total Time: 1.869s [1869ms]
Average Time/Jar: 0.9345s [934.5ms]
*******************
:beam-runners-core-java:shadowJar (Thread[Task worker for ':' Thread 7,5,main]) completed. Took 2.205 secs.
:beam-sdks-java-harness:compileJava (Thread[Task worker for ':' Thread 7,5,main]) started.
> Task :beam-sdks-java-core:compileTestJava
Note: Some input files use or override a deprecated API.
Note: Recompile with -Xlint:deprecation for details.
Note: Some input files use unchecked or unsafe operations.
Note: Recompile with -Xlint:unchecked for details.
Packing task ':beam-sdks-java-core:compileTestJava'
:beam-sdks-java-core:compileTestJava (Thread[Task worker for ':',5,main]) completed. Took 23.047 secs.
:beam-sdks-java-core:processTestResources (Thread[Task worker for ':',5,main]) started.
> Task :beam-sdks-java-core:processTestResources NO-SOURCE
file or directory '<https://builds.apache.org/job/beam_PostCommit_Java_ValidatesRunner_Flink_Gradle/ws/src/sdks/java/core/src/test/resources',> not found
Skipping task ':beam-sdks-java-core:processTestResources' as it has no source files and no previous output files.
:beam-sdks-java-core:processTestResources (Thread[Task worker for ':',5,main]) completed. Took 0.001 secs.
:beam-sdks-java-core:testClasses (Thread[Task worker for ':',5,main]) started.
> Task :beam-sdks-java-core:testClasses
Skipping task ':beam-sdks-java-core:testClasses' as it has no actions.
:beam-sdks-java-core:testClasses (Thread[Task worker for ':',5,main]) completed. Took 0.0 secs.
:beam-sdks-java-core:shadowTestJar (Thread[Task worker for ':',5,main]) started.
> Task :beam-sdks-java-harness:compileJava
Build cache key for task ':beam-sdks-java-harness:compileJava' is 7588dbe2ca4b2e6b6f47f0511f7bc0cc
Task ':beam-sdks-java-harness:compileJava' is not up-to-date because:
No history is available.
Custom actions are attached to task ':beam-sdks-java-harness:compileJava'.
All input files are considered out-of-date for incremental task ':beam-sdks-java-harness:compileJava'.
Compiling with error-prone compiler
<https://builds.apache.org/job/beam_PostCommit_Java_ValidatesRunner_Flink_Gradle/ws/src/sdks/java/harness/src/main/java/org/apache/beam/fn/harness/CombineRunners.java>:53: error: cannot find symbol
BeamUrns.getUrn(StandardPTransforms.Composites.COMBINE_GROUPED_VALUES),
^
symbol: variable COMBINE_GROUPED_VALUES
location: class Composites
Note: <https://builds.apache.org/job/beam_PostCommit_Java_ValidatesRunner_Flink_Gradle/ws/src/sdks/java/harness/src/main/java/org/apache/beam/fn/harness/state/FnApiStateAccessor.java> uses or overrides a deprecated API.
Note: Recompile with -Xlint:deprecation for details.
Note: Some input files use unchecked or unsafe operations.
Note: Recompile with -Xlint:unchecked for details.
1 error
> Task :beam-sdks-java-harness:compileJava FAILED
:beam-sdks-java-harness:compileJava (Thread[Task worker for ':' Thread 7,5,main]) completed. Took 4.365 secs.
> Task :beam-sdks-java-core:shadowTestJar
Build cache key for task ':beam-sdks-java-core:shadowTestJar' is 18ff9b219c37566b386d0c0c1bd34189
Caching disabled for task ':beam-sdks-java-core:shadowTestJar': Caching has not been enabled for the task
Task ':beam-sdks-java-core:shadowTestJar' is not up-to-date because:
No history is available.
*******************
GRADLE SHADOW STATS
Total Jars: 6 (includes project)
Total Time: 5.841s [5841ms]
Average Time/Jar: 0.9735s [973.5ms]
*******************
:beam-sdks-java-core:shadowTestJar (Thread[Task worker for ':',5,main]) completed. Took 7.633 secs.
:beam-runners-core-java:compileTestJava (Thread[Task worker for ':',5,main]) started.
> Task :beam-runners-core-java:compileTestJava
Build cache key for task ':beam-runners-core-java:compileTestJava' is 67301231b397b7f91767fa5482234b74
Task ':beam-runners-core-java:compileTestJava' is not up-to-date because:
No history is available.
Custom actions are attached to task ':beam-runners-core-java:compileTestJava'.
All input files are considered out-of-date for incremental task ':beam-runners-core-java:compileTestJava'.
Compiling with error-prone compiler
Note: Some input files use or override a deprecated API.
Note: Recompile with -Xlint:deprecation for details.
Note: Some input files use unchecked or unsafe operations.
Note: Recompile with -Xlint:unchecked for details.
Packing task ':beam-runners-core-java:compileTestJava'
:beam-runners-core-java:compileTestJava (Thread[Task worker for ':',5,main]) completed. Took 7.811 secs.
:beam-runners-core-java:testClasses (Thread[Task worker for ':',5,main]) started.
> Task :beam-runners-core-java:testClasses
Skipping task ':beam-runners-core-java:testClasses' as it has no actions.
:beam-runners-core-java:testClasses (Thread[Task worker for ':',5,main]) completed. Took 0.0 secs.
:beam-runners-core-java:shadowTestJar (Thread[Task worker for ':',5,main]) started.
> Task :beam-runners-core-java:shadowTestJar
Build cache key for task ':beam-runners-core-java:shadowTestJar' is 146c3e97821dc4c4e2ec4c53a9799df3
Caching disabled for task ':beam-runners-core-java:shadowTestJar': Caching has not been enabled for the task
Task ':beam-runners-core-java:shadowTestJar' is not up-to-date because:
No history is available.
*******************
GRADLE SHADOW STATS
Total Jars: 2 (includes project)
Total Time: 1.815s [1815ms]
Average Time/Jar: 0.9075s [907.5ms]
*******************
:beam-runners-core-java:shadowTestJar (Thread[Task worker for ':',5,main]) completed. Took 2.02 secs.
FAILURE: Build failed with an exception.
* What went wrong:
Execution failed for task ':beam-sdks-java-harness:compileJava'.
> Compilation failed with exit code 1; see the compiler error output for details.
* Try:
Run with --stacktrace option to get the stack trace. Run with --debug option to get more log output. Run with --scan to get full insights.
* Get more help at https://help.gradle.org
Deprecated Gradle features were used in this build, making it incompatible with Gradle 5.0.
See https://docs.gradle.org/4.8/userguide/command_line_interface.html#sec:command_line_warnings
BUILD FAILED in 1m 21s
36 actionable tasks: 36 executed
Publishing build scan...
https://gradle.com/s/q6haf3gcrgupu
Build step 'Invoke Gradle script' changed build result to FAILURE
Build step 'Invoke Gradle script' marked build as failure
Not sending mail to unregistered user daniel.o.programmer@gmail.com
Not sending mail to unregistered user apilloud@google.com
Not sending mail to unregistered user ekirpichov@gmail.com
Not sending mail to unregistered user github@alasdairhodge.co.uk
Not sending mail to unregistered user aaltay@gmail.com
Not sending mail to unregistered user yifanzou@yifanzou-linuxworkstation.sea.corp.google.com
Not sending mail to unregistered user jiangkai@gmail.com
Not sending mail to unregistered user kirpichov@google.com
Not sending mail to unregistered user sidhom@google.com
Jenkins build is back to normal :
beam_PostCommit_Java_ValidatesRunner_Flink_Gradle #941
Posted by Apache Jenkins Server <je...@builds.apache.org>.
See <https://builds.apache.org/job/beam_PostCommit_Java_ValidatesRunner_Flink_Gradle/941/display/redirect?page=changes>
Build failed in Jenkins:
beam_PostCommit_Java_ValidatesRunner_Flink_Gradle #940
Posted by Apache Jenkins Server <je...@builds.apache.org>.
See <https://builds.apache.org/job/beam_PostCommit_Java_ValidatesRunner_Flink_Gradle/940/display/redirect?page=changes>
Changes:
[altay] improvements to fanout
------------------------------------------
[...truncated 79.70 KB...]
Compiling with error-prone compiler
Note: Some input files use unchecked or unsafe operations.
Note: Recompile with -Xlint:unchecked for details.
Packing task ':beam-sdks-java-fn-execution:compileJava'
:beam-sdks-java-fn-execution:compileJava (Thread[Task worker for ':',5,main]) completed. Took 9.408 secs.
:beam-sdks-java-fn-execution:classes (Thread[Task worker for ':',5,main]) started.
> Task :beam-sdks-java-fn-execution:classes
Skipping task ':beam-sdks-java-fn-execution:classes' as it has no actions.
:beam-sdks-java-fn-execution:classes (Thread[Task worker for ':',5,main]) completed. Took 0.0 secs.
:beam-sdks-java-fn-execution:shadowJar (Thread[Task worker for ':',5,main]) started.
> Task :beam-sdks-java-extensions-google-cloud-platform-core:compileJava
Build cache key for task ':beam-sdks-java-extensions-google-cloud-platform-core:compileJava' is bc285d9b1923b6128bc5ada1ce5e7cbc
Task ':beam-sdks-java-extensions-google-cloud-platform-core:compileJava' is not up-to-date because:
No history is available.
Custom actions are attached to task ':beam-sdks-java-extensions-google-cloud-platform-core:compileJava'.
All input files are considered out-of-date for incremental task ':beam-sdks-java-extensions-google-cloud-platform-core:compileJava'.
Compiling with error-prone compiler
Packing task ':beam-sdks-java-extensions-google-cloud-platform-core:compileJava'
:beam-sdks-java-extensions-google-cloud-platform-core:compileJava (Thread[Task worker for ':' Thread 3,5,main]) completed. Took 10.808 secs.
:beam-sdks-java-extensions-google-cloud-platform-core:classes (Thread[Task worker for ':' Thread 13,5,main]) started.
> Task :beam-sdks-java-extensions-google-cloud-platform-core:classes
Skipping task ':beam-sdks-java-extensions-google-cloud-platform-core:classes' as it has no actions.
:beam-sdks-java-extensions-google-cloud-platform-core:classes (Thread[Task worker for ':' Thread 13,5,main]) completed. Took 0.0 secs.
:beam-sdks-java-extensions-google-cloud-platform-core:shadowJar (Thread[Task worker for ':' Thread 13,5,main]) started.
> Task :beam-sdks-java-core:compileTestJava
Build cache key for task ':beam-sdks-java-core:compileTestJava' is 041869390f9b6b95fa2c4655e069772d
Task ':beam-sdks-java-core:compileTestJava' is not up-to-date because:
No history is available.
Custom actions are attached to task ':beam-sdks-java-core:compileTestJava'.
All input files are considered out-of-date for incremental task ':beam-sdks-java-core:compileTestJava'.
Compiling with error-prone compiler
> Task :beam-sdks-java-fn-execution:shadowJar
Build cache key for task ':beam-sdks-java-fn-execution:shadowJar' is 9af4f6a8768f3095c0c9950bd24cb149
Caching disabled for task ':beam-sdks-java-fn-execution:shadowJar': Caching has not been enabled for the task
Task ':beam-sdks-java-fn-execution:shadowJar' is not up-to-date because:
No history is available.
*******************
GRADLE SHADOW STATS
Total Jars: 2 (includes project)
Total Time: 3.166s [3166ms]
Average Time/Jar: 1.583s [1583.0ms]
*******************
:beam-sdks-java-fn-execution:shadowJar (Thread[Task worker for ':',5,main]) completed. Took 3.342 secs.
> Task :beam-sdks-java-extensions-google-cloud-platform-core:shadowJar
Build cache key for task ':beam-sdks-java-extensions-google-cloud-platform-core:shadowJar' is bd921e1a0e139f456dcd29adb652d098
Caching disabled for task ':beam-sdks-java-extensions-google-cloud-platform-core:shadowJar': Caching has not been enabled for the task
Task ':beam-sdks-java-extensions-google-cloud-platform-core:shadowJar' is not up-to-date because:
No history is available.
*******************
GRADLE SHADOW STATS
Total Jars: 2 (includes project)
Total Time: 3.428s [3428ms]
Average Time/Jar: 1.714s [1714.0ms]
*******************
:beam-sdks-java-extensions-google-cloud-platform-core:shadowJar (Thread[Task worker for ':' Thread 13,5,main]) completed. Took 3.598 secs.
> Task :beam-runners-core-construction-java:compileJava
Note: Some input files use or override a deprecated API.
Note: Recompile with -Xlint:deprecation for details.
Note: Some input files use unchecked or unsafe operations.
Note: Recompile with -Xlint:unchecked for details.
Packing task ':beam-runners-core-construction-java:compileJava'
:beam-runners-core-construction-java:compileJava (Thread[Daemon worker,5,main]) completed. Took 16.976 secs.
:beam-runners-core-construction-java:classes (Thread[Daemon worker,5,main]) started.
> Task :beam-runners-core-construction-java:classes
Skipping task ':beam-runners-core-construction-java:classes' as it has no actions.
:beam-runners-core-construction-java:classes (Thread[Daemon worker,5,main]) completed. Took 0.0 secs.
:beam-runners-core-construction-java:shadowJar (Thread[Daemon worker,5,main]) started.
> Task :beam-runners-core-construction-java:shadowJar
Build cache key for task ':beam-runners-core-construction-java:shadowJar' is 6f6f2ab94c6df2a6390b935ec3683e7b
Caching disabled for task ':beam-runners-core-construction-java:shadowJar': Caching has not been enabled for the task
Task ':beam-runners-core-construction-java:shadowJar' is not up-to-date because:
No history is available.
*******************
GRADLE SHADOW STATS
Total Jars: 2 (includes project)
Total Time: 2.95s [2950ms]
Average Time/Jar: 1.475s [1475.0ms]
*******************
:beam-runners-core-construction-java:shadowJar (Thread[Daemon worker,5,main]) completed. Took 3.435 secs.
:beam-runners-core-java:compileJava (Thread[Task worker for ':' Thread 5,5,main]) started.
> Task :beam-runners-core-java:compileJava
Build cache key for task ':beam-runners-core-java:compileJava' is 457c8ba87c0edc274104e09b83591203
Task ':beam-runners-core-java:compileJava' is not up-to-date because:
No history is available.
Custom actions are attached to task ':beam-runners-core-java:compileJava'.
All input files are considered out-of-date for incremental task ':beam-runners-core-java:compileJava'.
Compiling with error-prone compiler
Note: Some input files use or override a deprecated API.
Note: Recompile with -Xlint:deprecation for details.
Note: Some input files use unchecked or unsafe operations.
Note: Recompile with -Xlint:unchecked for details.
Packing task ':beam-runners-core-java:compileJava'
:beam-runners-core-java:compileJava (Thread[Task worker for ':' Thread 5,5,main]) completed. Took 10.384 secs.
:beam-runners-core-java:classes (Thread[Daemon worker,5,main]) started.
> Task :beam-runners-core-java:classes
Skipping task ':beam-runners-core-java:classes' as it has no actions.
:beam-runners-core-java:classes (Thread[Daemon worker,5,main]) completed. Took 0.0 secs.
:beam-runners-core-java:shadowJar (Thread[Daemon worker,5,main]) started.
> Task :beam-runners-core-java:shadowJar
Build cache key for task ':beam-runners-core-java:shadowJar' is 7afc7e88443db927bf43e1af198cfcd7
Caching disabled for task ':beam-runners-core-java:shadowJar': Caching has not been enabled for the task
Task ':beam-runners-core-java:shadowJar' is not up-to-date because:
No history is available.
*******************
GRADLE SHADOW STATS
Total Jars: 2 (includes project)
Total Time: 2.228s [2228ms]
Average Time/Jar: 1.114s [1114.0ms]
*******************
:beam-runners-core-java:shadowJar (Thread[Daemon worker,5,main]) completed. Took 2.591 secs.
:beam-sdks-java-harness:compileJava (Thread[Task worker for ':' Thread 5,5,main]) started.
> Task :beam-sdks-java-core:compileTestJava
Note: Some input files use or override a deprecated API.
Note: Recompile with -Xlint:deprecation for details.
Note: Some input files use unchecked or unsafe operations.
Note: Recompile with -Xlint:unchecked for details.
Packing task ':beam-sdks-java-core:compileTestJava'
:beam-sdks-java-core:compileTestJava (Thread[Task worker for ':' Thread 12,5,main]) completed. Took 33.645 secs.
:beam-sdks-java-core:processTestResources (Thread[Task worker for ':' Thread 12,5,main]) started.
> Task :beam-sdks-java-core:processTestResources NO-SOURCE
file or directory '<https://builds.apache.org/job/beam_PostCommit_Java_ValidatesRunner_Flink_Gradle/ws/src/sdks/java/core/src/test/resources',> not found
Skipping task ':beam-sdks-java-core:processTestResources' as it has no source files and no previous output files.
:beam-sdks-java-core:processTestResources (Thread[Task worker for ':' Thread 12,5,main]) completed. Took 0.001 secs.
:beam-sdks-java-core:testClasses (Thread[Task worker for ':' Thread 12,5,main]) started.
> Task :beam-sdks-java-core:testClasses
Skipping task ':beam-sdks-java-core:testClasses' as it has no actions.
:beam-sdks-java-core:testClasses (Thread[Task worker for ':' Thread 12,5,main]) completed. Took 0.0 secs.
:beam-sdks-java-core:shadowTestJar (Thread[Task worker for ':' Thread 12,5,main]) started.
> Task :beam-sdks-java-harness:compileJava
Build cache key for task ':beam-sdks-java-harness:compileJava' is 2f5b2530041378e04ff8119c9289ca38
Task ':beam-sdks-java-harness:compileJava' is not up-to-date because:
No history is available.
Custom actions are attached to task ':beam-sdks-java-harness:compileJava'.
All input files are considered out-of-date for incremental task ':beam-sdks-java-harness:compileJava'.
Compiling with error-prone compiler
<https://builds.apache.org/job/beam_PostCommit_Java_ValidatesRunner_Flink_Gradle/ws/src/sdks/java/harness/src/main/java/org/apache/beam/fn/harness/CombineRunners.java>:53: error: cannot find symbol
BeamUrns.getUrn(StandardPTransforms.Composites.COMBINE_GROUPED_VALUES),
^
symbol: variable COMBINE_GROUPED_VALUES
location: class Composites
Note: <https://builds.apache.org/job/beam_PostCommit_Java_ValidatesRunner_Flink_Gradle/ws/src/sdks/java/harness/src/main/java/org/apache/beam/fn/harness/state/FnApiStateAccessor.java> uses or overrides a deprecated API.
Note: Recompile with -Xlint:deprecation for details.
Note: Some input files use unchecked or unsafe operations.
Note: Recompile with -Xlint:unchecked for details.
1 error
> Task :beam-sdks-java-harness:compileJava FAILED
:beam-sdks-java-harness:compileJava (Thread[Task worker for ':' Thread 5,5,main]) completed. Took 5.212 secs.
> Task :beam-sdks-java-core:shadowTestJar
Build cache key for task ':beam-sdks-java-core:shadowTestJar' is 73319d8389820d55c1d17127ca1392de
Caching disabled for task ':beam-sdks-java-core:shadowTestJar': Caching has not been enabled for the task
Task ':beam-sdks-java-core:shadowTestJar' is not up-to-date because:
No history is available.
*******************
GRADLE SHADOW STATS
Total Jars: 6 (includes project)
Total Time: 6.086s [6086ms]
Average Time/Jar: 1.0143333333333s [1014.3333333333ms]
*******************
:beam-sdks-java-core:shadowTestJar (Thread[Task worker for ':' Thread 12,5,main]) completed. Took 8.118 secs.
:beam-runners-core-java:compileTestJava (Thread[Task worker for ':' Thread 12,5,main]) started.
> Task :beam-runners-core-java:compileTestJava
Build cache key for task ':beam-runners-core-java:compileTestJava' is 208d82a5f2de87485da05d27f5954edf
Task ':beam-runners-core-java:compileTestJava' is not up-to-date because:
No history is available.
Custom actions are attached to task ':beam-runners-core-java:compileTestJava'.
All input files are considered out-of-date for incremental task ':beam-runners-core-java:compileTestJava'.
Compiling with error-prone compiler
Note: Some input files use or override a deprecated API.
Note: Recompile with -Xlint:deprecation for details.
Note: Some input files use unchecked or unsafe operations.
Note: Recompile with -Xlint:unchecked for details.
Packing task ':beam-runners-core-java:compileTestJava'
:beam-runners-core-java:compileTestJava (Thread[Task worker for ':' Thread 12,5,main]) completed. Took 10.452 secs.
:beam-runners-core-java:testClasses (Thread[Task worker for ':' Thread 12,5,main]) started.
> Task :beam-runners-core-java:testClasses
Skipping task ':beam-runners-core-java:testClasses' as it has no actions.
:beam-runners-core-java:testClasses (Thread[Task worker for ':' Thread 12,5,main]) completed. Took 0.0 secs.
:beam-runners-core-java:shadowTestJar (Thread[Task worker for ':' Thread 12,5,main]) started.
> Task :beam-runners-core-java:shadowTestJar
Build cache key for task ':beam-runners-core-java:shadowTestJar' is b6837cae2beb349b5807c04d47d74256
Caching disabled for task ':beam-runners-core-java:shadowTestJar': Caching has not been enabled for the task
Task ':beam-runners-core-java:shadowTestJar' is not up-to-date because:
No history is available.
*******************
GRADLE SHADOW STATS
Total Jars: 2 (includes project)
Total Time: 1.914s [1914ms]
Average Time/Jar: 0.957s [957.0ms]
*******************
:beam-runners-core-java:shadowTestJar (Thread[Task worker for ':' Thread 12,5,main]) completed. Took 2.122 secs.
FAILURE: Build failed with an exception.
* What went wrong:
Execution failed for task ':beam-sdks-java-harness:compileJava'.
> Compilation failed with exit code 1; see the compiler error output for details.
* Try:
Run with --stacktrace option to get the stack trace. Run with --debug option to get more log output. Run with --scan to get full insights.
* Get more help at https://help.gradle.org
Deprecated Gradle features were used in this build, making it incompatible with Gradle 5.0.
See https://docs.gradle.org/4.8/userguide/command_line_interface.html#sec:command_line_warnings
BUILD FAILED in 1m 20s
36 actionable tasks: 32 executed, 4 from cache
Publishing build scan...
https://gradle.com/s/3iuilxmlgytd2
Build step 'Invoke Gradle script' changed build result to FAILURE
Build step 'Invoke Gradle script' marked build as failure
Not sending mail to unregistered user daniel.o.programmer@gmail.com
Not sending mail to unregistered user apilloud@google.com
Not sending mail to unregistered user ekirpichov@gmail.com
Not sending mail to unregistered user github@alasdairhodge.co.uk
Not sending mail to unregistered user aaltay@gmail.com
Not sending mail to unregistered user yifanzou@yifanzou-linuxworkstation.sea.corp.google.com
Not sending mail to unregistered user jiangkai@gmail.com
Not sending mail to unregistered user kirpichov@google.com
Not sending mail to unregistered user sidhom@google.com