You are viewing a plain text version of this content. The canonical link for it is here.
Posted to dev@opennlp.apache.org by Apache Jenkins Server <je...@builds.apache.org> on 2012/04/03 10:06:21 UTC
Build failed in Jenkins: OpenNLP #312
See <https://builds.apache.org/job/OpenNLP/312/>
------------------------------------------
Started by user joern
Building remotely on ubuntu1 in workspace <https://builds.apache.org/job/OpenNLP/ws/>
Location 'https://svn.apache.org/repos/asf/incubator/opennlp/trunk' does not exist
Cleaning local Directory trunk
Checking out https://svn.apache.org/repos/asf/incubator/opennlp/trunk
ERROR: Failed to check out https://svn.apache.org/repos/asf/incubator/opennlp/trunk
org.tmatesoft.svn.core.SVNException: svn: URL 'https://svn.apache.org/repos/asf/incubator/opennlp/trunk' doesn't exist
at org.tmatesoft.svn.core.internal.wc.SVNErrorManager.error(SVNErrorManager.java:64)
at org.tmatesoft.svn.core.internal.wc.SVNErrorManager.error(SVNErrorManager.java:51)
at org.tmatesoft.svn.core.wc.SVNUpdateClient.doCheckout(SVNUpdateClient.java:910)
at hudson.scm.subversion.CheckoutUpdater$1.perform(CheckoutUpdater.java:84)
at hudson.scm.subversion.WorkspaceUpdater$UpdateTask.delegateTo(WorkspaceUpdater.java:136)
at hudson.scm.SubversionSCM$CheckOutTask.perform(SubversionSCM.java:788)
at hudson.scm.SubversionSCM$CheckOutTask.invoke(SubversionSCM.java:769)
at hudson.scm.SubversionSCM$CheckOutTask.invoke(SubversionSCM.java:753)
at hudson.FilePath$FileCallableWrapper.call(FilePath.java:2154)
at hudson.remoting.UserRequest.perform(UserRequest.java:118)
at hudson.remoting.UserRequest.perform(UserRequest.java:48)
at hudson.remoting.Request$2.run(Request.java:287)
at hudson.remoting.InterceptingExecutorService$1.call(InterceptingExecutorService.java:72)
at java.util.concurrent.FutureTask$Sync.innerRun(FutureTask.java:334)
at java.util.concurrent.FutureTask.run(FutureTask.java:166)
at java.util.concurrent.ThreadPoolExecutor.runWorker(ThreadPoolExecutor.java:1110)
at java.util.concurrent.ThreadPoolExecutor$Worker.run(ThreadPoolExecutor.java:603)
at java.lang.Thread.run(Thread.java:679)
Caused by: org.tmatesoft.svn.core.SVNErrorMessage: svn: URL 'https://svn.apache.org/repos/asf/incubator/opennlp/trunk' doesn't exist
at org.tmatesoft.svn.core.SVNErrorMessage.create(SVNErrorMessage.java:163)
at org.tmatesoft.svn.core.SVNErrorMessage.create(SVNErrorMessage.java:118)
at org.tmatesoft.svn.core.wc.SVNUpdateClient.doCheckout(SVNUpdateClient.java:909)
... 15 more
FATAL: null
java.lang.NullPointerException
at java.util.ArrayList.addAll(ArrayList.java:530)
at hudson.scm.SubversionSCM.checkout(SubversionSCM.java:743)
at hudson.scm.SubversionSCM.checkout(SubversionSCM.java:685)
at hudson.model.AbstractProject.checkout(AbstractProject.java:1212)
at hudson.model.AbstractBuild$AbstractRunner.checkout(AbstractBuild.java:579)
at hudson.model.AbstractBuild$AbstractRunner.run(AbstractBuild.java:468)
at hudson.model.Run.run(Run.java:1410)
at hudson.maven.MavenModuleSetBuild.run(MavenModuleSetBuild.java:481)
at hudson.model.ResourceController.execute(ResourceController.java:88)
at hudson.model.Executor.run(Executor.java:238)
Jenkins build is back to normal : OpenNLP #317
Posted by Apache Jenkins Server <je...@builds.apache.org>.
See <https://builds.apache.org/job/OpenNLP/317/changes>
Build failed in Jenkins: OpenNLP #316
Posted by Apache Jenkins Server <je...@builds.apache.org>.
See <https://builds.apache.org/job/OpenNLP/316/changes>
Changes:
[joern] OPENNLP-342 Fixed java 1.5 compatibility issue.
------------------------------------------
[...truncated 2192 lines...]
Performing 500 iterations.
1: . (16068/20801) 0.7724628623623864
2: . (17530/20801) 0.8427479448103457
3: . (18163/20801) 0.8731791740781694
4: . (18508/20801) 0.8897649151483101
5: . (18702/20801) 0.8990913898370271
6: . (18878/20801) 0.9075525215133888
7: . (19043/20801) 0.9154848324599779
8: . (19158/20801) 0.9210134128166915
9: . (19230/20801) 0.9244747848661122
10: . (19356/20801) 0.9305321859525985
20: . (19774/20801) 0.9506273736839576
30: . (19977/20801) 0.9603865198788519
40: . (20076/20801) 0.9651459064468054
50: . (20079/20801) 0.965290130282198
60: . (20119/20801) 0.9672131147540983
70: . (20114/20801) 0.9669727416951108
80: . (20020/20801) 0.9624537281861449
90: . (19952/20801) 0.9591846545839142
100: . (19994/20801) 0.9612037882794097
110: . (20051/20801) 0.9639440411518677
120: . (20057/20801) 0.9642324888226528
130: . (20094/20801) 0.9660112494591606
140: . (20092/20801) 0.9659151002355656
150: . (20087/20801) 0.9656747271765781
160: . (20093/20801) 0.9659631748473632
170: . (20096/20801) 0.9661073986827556
180: . (20093/20801) 0.9659631748473632
190: . (20081/20801) 0.965386279505793
200: . (20101/20801) 0.9663477717417431
210: . (20102/20801) 0.9663958463535407
220: . (20089/20801) 0.9657708764001731
230: . (20088/20801) 0.9657228017883756
240: . (20102/20801) 0.9663958463535407
250: . (20108/20801) 0.9666842940243258
260: . (20092/20801) 0.9659151002355656
270: . (20097/20801) 0.9661554732945531
280: . (20098/20801) 0.9662035479063507
290: . (20077/20801) 0.965193981058603
300: . (20084/20801) 0.9655305033411855
310: . (20083/20801) 0.965482428729388
320: . (20084/20801) 0.9655305033411855
330: . (20097/20801) 0.9661554732945531
340: . (20079/20801) 0.965290130282198
350: . (20097/20801) 0.9661554732945531
360: . (20086/20801) 0.9656266525647805
370: . (20085/20801) 0.9655785779529831
380: . (20088/20801) 0.9657228017883756
390: . (20101/20801) 0.9663477717417431
400: . (20084/20801) 0.9655305033411855
410: . (20081/20801) 0.965386279505793
420: . (20095/20801) 0.9660593240709582
430: . (20080/20801) 0.9653382048939955
440: . (20097/20801) 0.9661554732945531
450: . (20086/20801) 0.9656266525647805
460: . (20090/20801) 0.9658189510119706
470: . (20090/20801) 0.9658189510119706
480: . (20093/20801) 0.9659631748473632
490: . (20089/20801) 0.9657708764001731
500: . (20093/20801) 0.9659631748473632
Stats: (20087/20801) 0.9656747271765781
...done.
Accuracy on PPA devset: (3133/4039) 0.7756870512503095
Tests run: 4, Failures: 0, Errors: 0, Skipped: 0, Time elapsed: 6.174 sec
Running opennlp.model.IndexHashTableTest
Tests run: 2, Failures: 0, Errors: 0, Skipped: 0, Time elapsed: 0.001 sec
Results :
Tests run: 13, Failures: 0, Errors: 0, Skipped: 0
[JENKINS] Recording test results
[INFO]
[INFO] --- maven-bundle-plugin:2.3.4:bundle (default-bundle) @ opennlp-maxent ---
[INFO]
[INFO] --- maven-site-plugin:3.0:attach-descriptor (attach-descriptor) @ opennlp-maxent ---
[INFO]
[INFO] --- maven-javadoc-plugin:2.8:jar (create-javadoc-jar) @ opennlp-maxent ---
[INFO] Building jar: <https://builds.apache.org/job/OpenNLP/ws/trunk/opennlp-maxent/target/opennlp-maxent-3.0.3-SNAPSHOT-javadoc.jar>
Apr 3, 2012 8:28:32 AM hudson.maven.ExecutedMojo <init>
WARNING: Failed to getClass for org.apache.maven.plugin.source.SourceJarMojo
[INFO]
[INFO] --- maven-source-plugin:2.1.2:jar (create-source-jar) @ opennlp-maxent ---
[INFO] META-INF already added, skipping
[INFO] META-INF/LICENSE already added, skipping
[INFO] META-INF/NOTICE already added, skipping
[INFO] META-INF/DEPENDENCIES already added, skipping
[INFO] Building jar: <https://builds.apache.org/job/OpenNLP/ws/trunk/opennlp-maxent/target/opennlp-maxent-3.0.3-SNAPSHOT-sources.jar>
[INFO] META-INF already added, skipping
[INFO] META-INF/LICENSE already added, skipping
[INFO] META-INF/NOTICE already added, skipping
[INFO] META-INF/DEPENDENCIES already added, skipping
[INFO] [INFO] Exclude: META-INF/MANIFEST.MF
[INFO] Exclude: samples/sports/*.test
[INFO] Exclude: src/main/java/opennlp/maxent/AllEnglishAffixes.txt
[INFO] Exclude: src/test/resources/data/opennlp/maxent/io/*.txt
[INFO] Exclude: src/test/resources/data/opennlp/maxent/*.txt
[INFO] Exclude: src/test/resources/data/ppa/*
[INFO] --- apache-rat-plugin:0.7:check (default-cli) @ opennlp-maxent ---
[INFO] [INFO] Installing <https://builds.apache.org/job/OpenNLP/ws/trunk/opennlp-maxent/target/opennlp-maxent-3.0.3-SNAPSHOT.jar> to /home/jenkins/jenkins-slave/maven-repositories/1/org/apache/opennlp/opennlp-maxent/3.0.3-SNAPSHOT/opennlp-maxent-3.0.3-SNAPSHOT.jar
[INFO] Installing <https://builds.apache.org/job/OpenNLP/ws/trunk/opennlp-maxent/pom.xml> to /home/jenkins/jenkins-slave/maven-repositories/1/org/apache/opennlp/opennlp-maxent/3.0.3-SNAPSHOT/opennlp-maxent-3.0.3-SNAPSHOT.pom
[INFO] Installing <https://builds.apache.org/job/OpenNLP/ws/trunk/opennlp-maxent/target/opennlp-maxent-3.0.3-SNAPSHOT-javadoc.jar> to /home/jenkins/jenkins-slave/maven-repositories/1/org/apache/opennlp/opennlp-maxent/3.0.3-SNAPSHOT/opennlp-maxent-3.0.3-SNAPSHOT-javadoc.jar
[INFO] Installing <https://builds.apache.org/job/OpenNLP/ws/trunk/opennlp-maxent/target/opennlp-maxent-3.0.3-SNAPSHOT-sources.jar> to /home/jenkins/jenkins-slave/maven-repositories/1/org/apache/opennlp/opennlp-maxent/3.0.3-SNAPSHOT/opennlp-maxent-3.0.3-SNAPSHOT-sources.jar
[INFO] --- maven-install-plugin:2.3.1:install (default-install) @ opennlp-maxent ---
[INFO]
[INFO] --- maven-bundle-plugin:2.3.4:install (default-install) @ opennlp-maxent ---
[INFO] Installing org/apache/opennlp/opennlp-maxent/3.0.3-SNAPSHOT/opennlp-maxent-3.0.3-SNAPSHOT.jar
[INFO] Writing OBR metadata
[JENKINS] Archiving <https://builds.apache.org/job/OpenNLP/ws/trunk/opennlp-maxent/pom.xml> to /home/hudson/hudson/jobs/OpenNLP/modules/org.apache.opennlp$opennlp-maxent/builds/2012-04-03_08-27-25/archive/org.apache.opennlp/opennlp-maxent/3.0.3-SNAPSHOT/opennlp-maxent-3.0.3-SNAPSHOT.pom
[JENKINS] Archiving <https://builds.apache.org/job/OpenNLP/ws/trunk/opennlp-maxent/target/opennlp-maxent-3.0.3-SNAPSHOT.jar> to /home/hudson/hudson/jobs/OpenNLP/modules/org.apache.opennlp$opennlp-maxent/builds/2012-04-03_08-27-25/archive/org.apache.opennlp/opennlp-maxent/3.0.3-SNAPSHOT/opennlp-maxent-3.0.3-SNAPSHOT.jar
[JENKINS] Archiving <https://builds.apache.org/job/OpenNLP/ws/trunk/opennlp-maxent/target/opennlp-maxent-3.0.3-SNAPSHOT-javadoc.jar> to /home/hudson/hudson/jobs/OpenNLP/modules/org.apache.opennlp$opennlp-maxent/builds/2012-04-03_08-27-25/archive/org.apache.opennlp/opennlp-maxent/3.0.3-SNAPSHOT/opennlp-maxent-3.0.3-SNAPSHOT-javadoc.jar
[JENKINS] Archiving <https://builds.apache.org/job/OpenNLP/ws/trunk/opennlp-maxent/target/opennlp-maxent-3.0.3-SNAPSHOT-sources.jar> to /home/hudson/hudson/jobs/OpenNLP/modules/org.apache.opennlp$opennlp-maxent/builds/2012-04-03_08-27-25/archive/org.apache.opennlp/opennlp-maxent/3.0.3-SNAPSHOT/opennlp-maxent-3.0.3-SNAPSHOT-sources.jar
[INFO]
[INFO] ------------------------------------------------------------------------
[INFO] Building Apache OpenNLP Tools 1.5.3-SNAPSHOT
[INFO] ------------------------------------------------------------------------
[INFO]
[INFO] --- maven-clean-plugin:2.4.1:clean (default-clean) @ opennlp-tools ---
[INFO]
[INFO] --- maven-remote-resources-plugin:1.2.1:process (default) @ opennlp-tools ---
[debug] execute contextualize
[INFO] [INFO] Using 'UTF-8' encoding to copy filtered resources.
[INFO] Copying 1 resource
[INFO] Copying 3 resources
[INFO] --- maven-resources-plugin:2.5:resources (default-resources) @ opennlp-tools ---
[INFO]
[INFO] --- maven-compiler-plugin:2.3.2:compile (default-compile) @ opennlp-tools ---
[INFO] Compiling 433 source files to <https://builds.apache.org/job/OpenNLP/ws/trunk/opennlp-tools/target/classes>
[INFO] -------------------------------------------------------------
[WARNING] COMPILATION WARNING :
[INFO] -------------------------------------------------------------
[WARNING] <https://builds.apache.org/job/OpenNLP/ws/trunk/opennlp-tools/src/main/java/opennlp/tools/util/model/FeatureGeneratorFactorySerializer.java>:[26,37] [deprecation] opennlp.tools.util.featuregen.FeatureGeneratorFactory in opennlp.tools.util.featuregen has been deprecated
[WARNING] <https://builds.apache.org/job/OpenNLP/ws/trunk/opennlp-tools/src/main/java/opennlp/tools/util/model/FeatureGeneratorFactorySerializer.java>:[30,34] [deprecation] opennlp.tools.util.featuregen.FeatureGeneratorFactory in opennlp.tools.util.featuregen has been deprecated
[WARNING] <https://builds.apache.org/job/OpenNLP/ws/trunk/opennlp-tools/src/main/java/opennlp/tools/util/model/FeatureGeneratorFactorySerializer.java>:[38,9] [deprecation] opennlp.tools.util.featuregen.FeatureGeneratorFactory in opennlp.tools.util.featuregen has been deprecated
[WARNING] <https://builds.apache.org/job/OpenNLP/ws/trunk/opennlp-tools/src/main/java/opennlp/tools/util/model/FeatureGeneratorFactorySerializer.java>:[52,24] [deprecation] opennlp.tools.util.featuregen.FeatureGeneratorFactory in opennlp.tools.util.featuregen has been deprecated
[WARNING] <https://builds.apache.org/job/OpenNLP/ws/trunk/opennlp-tools/src/main/java/opennlp/tools/cmdline/parser/CheckModelUpdaterTool.java>:[52,39] [deprecation] train(opennlp.model.EventStream,int,int) in opennlp.tools.parser.chunking.Parser has been deprecated
[WARNING] <https://builds.apache.org/job/OpenNLP/ws/trunk/opennlp-tools/src/main/java/opennlp/tools/parser/treeinsert/Parser.java>:[452,35] [deprecation] train(java.lang.String,opennlp.tools.util.ObjectStream<opennlp.tools.postag.POSSample>,opennlp.tools.util.TrainingParameters,opennlp.tools.postag.POSDictionary,opennlp.tools.dictionary.Dictionary) in opennlp.tools.postag.POSTaggerME has been deprecated
[WARNING] <https://builds.apache.org/job/OpenNLP/ws/trunk/opennlp-tools/src/main/java/opennlp/tools/parser/treeinsert/AttachContextGenerator.java>:[40,61] [unchecked] unchecked conversion
found : java.util.List
required: java.util.List<opennlp.tools.parser.Parse>
[WARNING] <https://builds.apache.org/job/OpenNLP/ws/trunk/opennlp-tools/src/main/java/opennlp/tools/lang/spanish/TokenChunker.java>:[37,15] [deprecation] NameFinderME(opennlp.model.MaxentModel) in opennlp.tools.namefind.NameFinderME has been deprecated
[WARNING] <https://builds.apache.org/job/OpenNLP/ws/trunk/opennlp-tools/src/main/java/opennlp/tools/lang/english/TreebankNameFinder.java>:[131,49] [deprecation] SimpleTokenizer() in opennlp.tools.tokenize.SimpleTokenizer has been deprecated
[WARNING] <https://builds.apache.org/job/OpenNLP/ws/trunk/opennlp-tools/src/main/java/opennlp/tools/namefind/NameFinderEventStream.java>:[64,27] [deprecation] DefaultNameContextGenerator() in opennlp.tools.namefind.DefaultNameContextGenerator has been deprecated
[WARNING] <https://builds.apache.org/job/OpenNLP/ws/trunk/opennlp-tools/src/main/java/opennlp/tools/parser/AbstractParserEventStream.java>:[54,36] [deprecation] CHUNK in opennlp.tools.parser.ParserEventTypeEnum has been deprecated
[WARNING] <https://builds.apache.org/job/OpenNLP/ws/trunk/opennlp-tools/src/main/java/opennlp/tools/parser/AbstractParserEventStream.java>:[57,41] [deprecation] TAG in opennlp.tools.parser.ParserEventTypeEnum has been deprecated
[WARNING] <https://builds.apache.org/job/OpenNLP/ws/trunk/opennlp-tools/src/main/java/opennlp/tools/parser/AbstractParserEventStream.java>:[77,36] [deprecation] TAG in opennlp.tools.parser.ParserEventTypeEnum has been deprecated
[WARNING] <https://builds.apache.org/job/OpenNLP/ws/trunk/opennlp-tools/src/main/java/opennlp/tools/parser/AbstractParserEventStream.java>:[80,41] [deprecation] CHUNK in opennlp.tools.parser.ParserEventTypeEnum has been deprecated
[WARNING] <https://builds.apache.org/job/OpenNLP/ws/trunk/opennlp-tools/src/main/java/opennlp/tools/parser/treeinsert/ParserEventStream.java>:[353,35] [deprecation] CHUNK in opennlp.tools.parser.ParserEventTypeEnum has been deprecated
[WARNING] <https://builds.apache.org/job/OpenNLP/ws/trunk/opennlp-tools/src/main/java/opennlp/tools/parser/treeinsert/ParserEventStream.java>:[359,35] [deprecation] TAG in opennlp.tools.parser.ParserEventTypeEnum has been deprecated
[WARNING] <https://builds.apache.org/job/OpenNLP/ws/trunk/opennlp-tools/src/main/java/opennlp/tools/parser/treeinsert/ParserEventStream.java>:[378,22] [deprecation] HeadRules(java.lang.String) in opennlp.tools.parser.lang.en.HeadRules has been deprecated
[WARNING] <https://builds.apache.org/job/OpenNLP/ws/trunk/opennlp-tools/src/main/java/opennlp/tools/util/model/FeatureGeneratorFactorySerializer.java>:[35,26] [deprecation] opennlp.tools.util.model.ClassSerializer in opennlp.tools.util.model has been deprecated
[WARNING] <https://builds.apache.org/job/OpenNLP/ws/trunk/opennlp-tools/src/main/java/opennlp/tools/util/model/FeatureGeneratorFactorySerializer.java>:[44,14] [deprecation] opennlp.tools.util.featuregen.FeatureGeneratorFactory in opennlp.tools.util.featuregen has been deprecated
[WARNING] <https://builds.apache.org/job/OpenNLP/ws/trunk/opennlp-tools/src/main/java/opennlp/tools/parser/chunking/Parser.java>:[304,35] [deprecation] train(java.lang.String,opennlp.tools.util.ObjectStream<opennlp.tools.postag.POSSample>,opennlp.tools.util.TrainingParameters,opennlp.tools.postag.POSDictionary,opennlp.tools.dictionary.Dictionary) in opennlp.tools.postag.POSTaggerME has been deprecated
[WARNING] <https://builds.apache.org/job/OpenNLP/ws/trunk/opennlp-tools/src/main/java/opennlp/tools/postag/POSTaggerTrainer.java>:[75,11] [deprecation] POSModel(java.lang.String,opennlp.model.AbstractModel,opennlp.tools.postag.POSDictionary,opennlp.tools.dictionary.Dictionary) in opennlp.tools.postag.POSModel has been deprecated
[WARNING] <https://builds.apache.org/job/OpenNLP/ws/trunk/opennlp-tools/src/main/java/opennlp/tools/sentdetect/lang/th/SentenceContextGenerator.java>:[35,17] [deprecation] collectFeatures(java.lang.String,java.lang.String,java.lang.String,java.lang.String) in opennlp.tools.sentdetect.DefaultSDContextGenerator has been deprecated
[WARNING] <https://builds.apache.org/job/OpenNLP/ws/trunk/opennlp-tools/src/main/java/opennlp/tools/cmdline/parser/BuildModelUpdaterTool.java>:[51,39] [deprecation] train(opennlp.model.EventStream,int,int) in opennlp.tools.parser.chunking.Parser has been deprecated
[WARNING] <https://builds.apache.org/job/OpenNLP/ws/trunk/opennlp-tools/src/main/java/opennlp/tools/parser/chunking/ParserEventStream.java>:[185,35] [deprecation] CHUNK in opennlp.tools.parser.ParserEventTypeEnum has been deprecated
[WARNING] <https://builds.apache.org/job/OpenNLP/ws/trunk/opennlp-tools/src/main/java/opennlp/tools/parser/chunking/ParserEventStream.java>:[188,35] [deprecation] TAG in opennlp.tools.parser.ParserEventTypeEnum has been deprecated
[WARNING] <https://builds.apache.org/job/OpenNLP/ws/trunk/opennlp-tools/src/main/java/opennlp/tools/parser/chunking/ParserEventStream.java>:[199,22] [deprecation] HeadRules(java.lang.String) in opennlp.tools.parser.lang.en.HeadRules has been deprecated
[WARNING] <https://builds.apache.org/job/OpenNLP/ws/trunk/opennlp-tools/src/main/java/opennlp/tools/parser/chunking/ParserEventStream.java>:[202,13] [deprecation] Dictionary(java.io.InputStream,boolean) in opennlp.tools.dictionary.Dictionary has been deprecated
[WARNING] <https://builds.apache.org/job/OpenNLP/ws/trunk/opennlp-tools/src/main/java/opennlp/tools/util/featuregen/FeatureGeneratorUtil.java>:[48,11] [deprecation] opennlp.tools.util.featuregen.FastTokenClassFeatureGenerator in opennlp.tools.util.featuregen has been deprecated
[INFO] 28 warnings
[INFO] -------------------------------------------------------------
[INFO] -------------------------------------------------------------
[ERROR] COMPILATION ERROR :
[INFO] -------------------------------------------------------------
[ERROR] <https://builds.apache.org/job/OpenNLP/ws/trunk/opennlp-tools/src/main/java/opennlp/tools/formats/frenchtreebank/ConstitParseSampleStream.java>:[66,16] cannot find symbol
symbol : constructor IOException(java.lang.String,org.xml.sax.SAXException)
location: class java.io.IOException
[INFO] 1 error
[INFO] -------------------------------------------------------------
[JENKINS] Archiving <https://builds.apache.org/job/OpenNLP/ws/trunk/opennlp-tools/pom.xml> to /home/hudson/hudson/jobs/OpenNLP/modules/org.apache.opennlp$opennlp-tools/builds/2012-04-03_08-27-25/archive/org.apache.opennlp/opennlp-tools/1.5.3-SNAPSHOT/opennlp-tools-1.5.3-SNAPSHOT.pom
[INFO] ------------------------------------------------------------------------
[INFO] Reactor Summary:
[INFO]
[INFO] Apache OpenNLP Reactor ............................ SUCCESS [20.310s]
[INFO] Apache OpenNLP Maxent ............................. SUCCESS [33.205s]
[INFO] Apache OpenNLP Tools .............................. FAILURE [3.566s]
[INFO] Apache OpenNLP UIMA Annotators .................... SKIPPED
[INFO] Apache OpenNLP Documentation ...................... SKIPPED
[INFO] Apache OpenNLP Distribution ....................... SKIPPED
[INFO] ------------------------------------------------------------------------
[INFO] BUILD FAILURE
[INFO] ------------------------------------------------------------------------
[INFO] Total time: 1:05.594s
[INFO] Finished at: Tue Apr 03 08:28:43 UTC 2012
[INFO] Final Memory: 22M/209M
[INFO] ------------------------------------------------------------------------
mavenExecutionResult exceptions not empty
message : Failed to execute goal org.apache.maven.plugins:maven-compiler-plugin:2.3.2:compile (default-compile) on project opennlp-tools: Compilation failure
<https://builds.apache.org/job/OpenNLP/ws/trunk/opennlp-tools/src/main/java/opennlp/tools/formats/frenchtreebank/ConstitParseSampleStream.java>:[66,16] cannot find symbol
symbol : constructor IOException(java.lang.String,org.xml.sax.SAXException)
location: class java.io.IOException
cause : Compilation failure
<https://builds.apache.org/job/OpenNLP/ws/trunk/opennlp-tools/src/main/java/opennlp/tools/formats/frenchtreebank/ConstitParseSampleStream.java>:[66,16] cannot find symbol
symbol : constructor IOException(java.lang.String,org.xml.sax.SAXException)
location: class java.io.IOException
Stack trace :
org.apache.maven.lifecycle.LifecycleExecutionException: Failed to execute goal org.apache.maven.plugins:maven-compiler-plugin:2.3.2:compile (default-compile) on project opennlp-tools: Compilation failure
<https://builds.apache.org/job/OpenNLP/ws/trunk/opennlp-tools/src/main/java/opennlp/tools/formats/frenchtreebank/ConstitParseSampleStream.java>:[66,16] cannot find symbol
symbol : constructor IOException(java.lang.String,org.xml.sax.SAXException)
location: class java.io.IOException
at org.apache.maven.lifecycle.internal.MojoExecutor.execute(MojoExecutor.java:213)
at org.apache.maven.lifecycle.internal.MojoExecutor.execute(MojoExecutor.java:153)
at org.apache.maven.lifecycle.internal.MojoExecutor.execute(MojoExecutor.java:145)
at org.apache.maven.lifecycle.internal.LifecycleModuleBuilder.buildProject(LifecycleModuleBuilder.java:84)
at org.apache.maven.lifecycle.internal.LifecycleModuleBuilder.buildProject(LifecycleModuleBuilder.java:59)
at org.apache.maven.lifecycle.internal.LifecycleStarter.singleThreadedBuild(LifecycleStarter.java:183)
at org.apache.maven.lifecycle.internal.LifecycleStarter.execute(LifecycleStarter.java:161)
at org.apache.maven.DefaultMaven.doExecute(DefaultMaven.java:319)
at org.apache.maven.DefaultMaven.execute(DefaultMaven.java:156)
at org.jvnet.hudson.maven3.launcher.Maven3Launcher.main(Maven3Launcher.java:79)
at sun.reflect.NativeMethodAccessorImpl.invoke0(Native Method)
at sun.reflect.NativeMethodAccessorImpl.invoke(NativeMethodAccessorImpl.java:39)
at sun.reflect.DelegatingMethodAccessorImpl.invoke(DelegatingMethodAccessorImpl.java:25)
at java.lang.reflect.Method.invoke(Method.java:592)
at org.codehaus.plexus.classworlds.launcher.Launcher.launchStandard(Launcher.java:329)
at org.codehaus.plexus.classworlds.launcher.Launcher.launch(Launcher.java:239)
at org.jvnet.hudson.maven3.agent.Maven3Main.launch(Maven3Main.java:158)
at hudson.maven.Maven3Builder.call(Maven3Builder.java:104)
at hudson.maven.Maven3Builder.call(Maven3Builder.java:70)
at hudson.remoting.UserRequest.perform(UserRequest.java:118)
at hudson.remoting.UserRequest.perform(UserRequest.java:48)
at hudson.remoting.Request$2.run(Request.java:287)
at hudson.remoting.InterceptingExecutorService$1.call(InterceptingExecutorService.java:72)
at java.util.concurrent.FutureTask$Sync.innerRun(FutureTask.java:269)
at java.util.concurrent.FutureTask.run(FutureTask.java:123)
at java.util.concurrent.ThreadPoolExecutor$Worker.runTask(ThreadPoolExecutor.java:651)
at java.util.concurrent.ThreadPoolExecutor$Worker.run(ThreadPoolExecutor.java:676)
at java.lang.Thread.run(Thread.java:595)
Caused by: org.apache.maven.plugin.CompilationFailureException: Compilation failure
<https://builds.apache.org/job/OpenNLP/ws/trunk/opennlp-tools/src/main/java/opennlp/tools/formats/frenchtreebank/ConstitParseSampleStream.java>:[66,16] cannot find symbol
symbol : constructor IOException(java.lang.String,org.xml.sax.SAXException)
location: class java.io.IOException
at org.apache.maven.plugin.AbstractCompilerMojo.execute(AbstractCompilerMojo.java:656)
at org.apache.maven.plugin.CompilerMojo.execute(CompilerMojo.java:128)
at org.apache.maven.plugin.DefaultBuildPluginManager.executeMojo(DefaultBuildPluginManager.java:107)
at org.apache.maven.lifecycle.internal.MojoExecutor.execute(MojoExecutor.java:209)
... 27 more
Sending e-mails to: opennlp-dev@incubator.apache.org
channel stopped
[WARNINGS] Skipping publisher since build result is FAILURE
Build failed in Jenkins: OpenNLP #315
Posted by Apache Jenkins Server <je...@builds.apache.org>.
See <https://builds.apache.org/job/OpenNLP/315/>
------------------------------------------
[...truncated 2194 lines...]
Performing 500 iterations.
1: . (16068/20801) 0.7724628623623864
2: . (17530/20801) 0.8427479448103457
3: . (18163/20801) 0.8731791740781694
4: . (18508/20801) 0.8897649151483101
5: . (18702/20801) 0.8990913898370271
6: . (18878/20801) 0.9075525215133888
7: . (19043/20801) 0.9154848324599779
8: . (19158/20801) 0.9210134128166915
9: . (19230/20801) 0.9244747848661122
10: . (19356/20801) 0.9305321859525985
20: . (19774/20801) 0.9506273736839576
30: . (19977/20801) 0.9603865198788519
40: . (20076/20801) 0.9651459064468054
50: . (20079/20801) 0.965290130282198
60: . (20119/20801) 0.9672131147540983
70: . (20114/20801) 0.9669727416951108
80: . (20020/20801) 0.9624537281861449
90: . (19952/20801) 0.9591846545839142
100: . (19994/20801) 0.9612037882794097
110: . (20051/20801) 0.9639440411518677
120: . (20057/20801) 0.9642324888226528
130: . (20094/20801) 0.9660112494591606
140: . (20092/20801) 0.9659151002355656
150: . (20087/20801) 0.9656747271765781
160: . (20093/20801) 0.9659631748473632
170: . (20096/20801) 0.9661073986827556
180: . (20093/20801) 0.9659631748473632
190: . (20081/20801) 0.965386279505793
200: . (20101/20801) 0.9663477717417431
210: . (20102/20801) 0.9663958463535407
220: . (20089/20801) 0.9657708764001731
230: . (20088/20801) 0.9657228017883756
240: . (20102/20801) 0.9663958463535407
250: . (20108/20801) 0.9666842940243258
260: . (20092/20801) 0.9659151002355656
270: . (20097/20801) 0.9661554732945531
280: . (20098/20801) 0.9662035479063507
290: . (20077/20801) 0.965193981058603
300: . (20084/20801) 0.9655305033411855
310: . (20083/20801) 0.965482428729388
320: . (20084/20801) 0.9655305033411855
330: . (20097/20801) 0.9661554732945531
340: . (20079/20801) 0.965290130282198
350: . (20097/20801) 0.9661554732945531
360: . (20086/20801) 0.9656266525647805
370: . (20085/20801) 0.9655785779529831
380: . (20088/20801) 0.9657228017883756
390: . (20101/20801) 0.9663477717417431
400: . (20084/20801) 0.9655305033411855
410: . (20081/20801) 0.965386279505793
420: . (20095/20801) 0.9660593240709582
430: . (20080/20801) 0.9653382048939955
440: . (20097/20801) 0.9661554732945531
450: . (20086/20801) 0.9656266525647805
460: . (20090/20801) 0.9658189510119706
470: . (20090/20801) 0.9658189510119706
480: . (20093/20801) 0.9659631748473632
490: . (20089/20801) 0.9657708764001731
500: . (20093/20801) 0.9659631748473632
Stats: (20087/20801) 0.9656747271765781
...done.
Accuracy on PPA devset: (3133/4039) 0.7756870512503095
Tests run: 4, Failures: 0, Errors: 0, Skipped: 0, Time elapsed: 6.134 sec
Running opennlp.model.IndexHashTableTest
Tests run: 2, Failures: 0, Errors: 0, Skipped: 0, Time elapsed: 0 sec
Results :
Tests run: 13, Failures: 0, Errors: 0, Skipped: 0
[JENKINS] Recording test results
[INFO]
[INFO] --- maven-bundle-plugin:2.3.4:bundle (default-bundle) @ opennlp-maxent ---
[INFO]
[INFO] --- maven-site-plugin:3.0:attach-descriptor (attach-descriptor) @ opennlp-maxent ---
[INFO]
[INFO] --- maven-javadoc-plugin:2.8:jar (create-javadoc-jar) @ opennlp-maxent ---
[INFO] Building jar: <https://builds.apache.org/job/OpenNLP/ws/trunk/opennlp-maxent/target/opennlp-maxent-3.0.3-SNAPSHOT-javadoc.jar>
Apr 3, 2012 8:10:40 AM hudson.maven.ExecutedMojo <init>
WARNING: Failed to getClass for org.apache.maven.plugin.source.SourceJarMojo
[INFO]
[INFO] --- maven-source-plugin:2.1.2:jar (create-source-jar) @ opennlp-maxent ---
[INFO] META-INF already added, skipping
[INFO] META-INF/LICENSE already added, skipping
[INFO] META-INF/NOTICE already added, skipping
[INFO] META-INF/DEPENDENCIES already added, skipping
[INFO] Building jar: <https://builds.apache.org/job/OpenNLP/ws/trunk/opennlp-maxent/target/opennlp-maxent-3.0.3-SNAPSHOT-sources.jar>
[INFO] META-INF already added, skipping
[INFO] META-INF/LICENSE already added, skipping
[INFO] META-INF/NOTICE already added, skipping
[INFO] META-INF/DEPENDENCIES already added, skipping
[INFO] [INFO] Exclude: META-INF/MANIFEST.MF
[INFO] Exclude: samples/sports/*.test
[INFO] Exclude: src/main/java/opennlp/maxent/AllEnglishAffixes.txt
[INFO] Exclude: src/test/resources/data/opennlp/maxent/io/*.txt
[INFO] Exclude: src/test/resources/data/opennlp/maxent/*.txt
[INFO] Exclude: src/test/resources/data/ppa/*
[INFO] --- apache-rat-plugin:0.7:check (default-cli) @ opennlp-maxent ---
[INFO] [INFO] Installing <https://builds.apache.org/job/OpenNLP/ws/trunk/opennlp-maxent/target/opennlp-maxent-3.0.3-SNAPSHOT.jar> to /home/jenkins/jenkins-slave/maven-repositories/1/org/apache/opennlp/opennlp-maxent/3.0.3-SNAPSHOT/opennlp-maxent-3.0.3-SNAPSHOT.jar
[INFO] Installing <https://builds.apache.org/job/OpenNLP/ws/trunk/opennlp-maxent/pom.xml> to /home/jenkins/jenkins-slave/maven-repositories/1/org/apache/opennlp/opennlp-maxent/3.0.3-SNAPSHOT/opennlp-maxent-3.0.3-SNAPSHOT.pom
[INFO] Installing <https://builds.apache.org/job/OpenNLP/ws/trunk/opennlp-maxent/target/opennlp-maxent-3.0.3-SNAPSHOT-javadoc.jar> to /home/jenkins/jenkins-slave/maven-repositories/1/org/apache/opennlp/opennlp-maxent/3.0.3-SNAPSHOT/opennlp-maxent-3.0.3-SNAPSHOT-javadoc.jar
[INFO] Installing <https://builds.apache.org/job/OpenNLP/ws/trunk/opennlp-maxent/target/opennlp-maxent-3.0.3-SNAPSHOT-sources.jar> to /home/jenkins/jenkins-slave/maven-repositories/1/org/apache/opennlp/opennlp-maxent/3.0.3-SNAPSHOT/opennlp-maxent-3.0.3-SNAPSHOT-sources.jar
[INFO] --- maven-install-plugin:2.3.1:install (default-install) @ opennlp-maxent ---
[INFO]
[INFO] --- maven-bundle-plugin:2.3.4:install (default-install) @ opennlp-maxent ---
[INFO] Installing org/apache/opennlp/opennlp-maxent/3.0.3-SNAPSHOT/opennlp-maxent-3.0.3-SNAPSHOT.jar
[INFO] Writing OBR metadata
[JENKINS] Archiving <https://builds.apache.org/job/OpenNLP/ws/trunk/opennlp-maxent/pom.xml> to /home/hudson/hudson/jobs/OpenNLP/modules/org.apache.opennlp$opennlp-maxent/builds/2012-04-03_08-09-28/archive/org.apache.opennlp/opennlp-maxent/3.0.3-SNAPSHOT/opennlp-maxent-3.0.3-SNAPSHOT.pom
[JENKINS] Archiving <https://builds.apache.org/job/OpenNLP/ws/trunk/opennlp-maxent/target/opennlp-maxent-3.0.3-SNAPSHOT.jar> to /home/hudson/hudson/jobs/OpenNLP/modules/org.apache.opennlp$opennlp-maxent/builds/2012-04-03_08-09-28/archive/org.apache.opennlp/opennlp-maxent/3.0.3-SNAPSHOT/opennlp-maxent-3.0.3-SNAPSHOT.jar
[JENKINS] Archiving <https://builds.apache.org/job/OpenNLP/ws/trunk/opennlp-maxent/target/opennlp-maxent-3.0.3-SNAPSHOT-javadoc.jar> to /home/hudson/hudson/jobs/OpenNLP/modules/org.apache.opennlp$opennlp-maxent/builds/2012-04-03_08-09-28/archive/org.apache.opennlp/opennlp-maxent/3.0.3-SNAPSHOT/opennlp-maxent-3.0.3-SNAPSHOT-javadoc.jar
[JENKINS] Archiving <https://builds.apache.org/job/OpenNLP/ws/trunk/opennlp-maxent/target/opennlp-maxent-3.0.3-SNAPSHOT-sources.jar> to /home/hudson/hudson/jobs/OpenNLP/modules/org.apache.opennlp$opennlp-maxent/builds/2012-04-03_08-09-28/archive/org.apache.opennlp/opennlp-maxent/3.0.3-SNAPSHOT/opennlp-maxent-3.0.3-SNAPSHOT-sources.jar
[INFO]
[INFO] ------------------------------------------------------------------------
[INFO] Building Apache OpenNLP Tools 1.5.3-SNAPSHOT
[INFO] ------------------------------------------------------------------------
[INFO]
[INFO] --- maven-clean-plugin:2.4.1:clean (default-clean) @ opennlp-tools ---
[INFO]
[INFO] --- maven-remote-resources-plugin:1.2.1:process (default) @ opennlp-tools ---
[INFO] [debug] execute contextualize
[INFO] Using 'UTF-8' encoding to copy filtered resources.
[INFO] Copying 1 resource
[INFO] Copying 3 resources
[INFO] --- maven-resources-plugin:2.5:resources (default-resources) @ opennlp-tools ---
[INFO]
[INFO] --- maven-compiler-plugin:2.3.2:compile (default-compile) @ opennlp-tools ---
[INFO] Compiling 433 source files to <https://builds.apache.org/job/OpenNLP/ws/trunk/opennlp-tools/target/classes>
[INFO] -------------------------------------------------------------
[WARNING] COMPILATION WARNING :
[INFO] -------------------------------------------------------------
[WARNING] <https://builds.apache.org/job/OpenNLP/ws/trunk/opennlp-tools/src/main/java/opennlp/tools/util/model/FeatureGeneratorFactorySerializer.java>:[26,37] [deprecation] opennlp.tools.util.featuregen.FeatureGeneratorFactory in opennlp.tools.util.featuregen has been deprecated
[WARNING] <https://builds.apache.org/job/OpenNLP/ws/trunk/opennlp-tools/src/main/java/opennlp/tools/util/model/FeatureGeneratorFactorySerializer.java>:[30,34] [deprecation] opennlp.tools.util.featuregen.FeatureGeneratorFactory in opennlp.tools.util.featuregen has been deprecated
[WARNING] <https://builds.apache.org/job/OpenNLP/ws/trunk/opennlp-tools/src/main/java/opennlp/tools/util/model/FeatureGeneratorFactorySerializer.java>:[38,9] [deprecation] opennlp.tools.util.featuregen.FeatureGeneratorFactory in opennlp.tools.util.featuregen has been deprecated
[WARNING] <https://builds.apache.org/job/OpenNLP/ws/trunk/opennlp-tools/src/main/java/opennlp/tools/util/model/FeatureGeneratorFactorySerializer.java>:[52,24] [deprecation] opennlp.tools.util.featuregen.FeatureGeneratorFactory in opennlp.tools.util.featuregen has been deprecated
[WARNING] <https://builds.apache.org/job/OpenNLP/ws/trunk/opennlp-tools/src/main/java/opennlp/tools/cmdline/parser/CheckModelUpdaterTool.java>:[52,39] [deprecation] train(opennlp.model.EventStream,int,int) in opennlp.tools.parser.chunking.Parser has been deprecated
[WARNING] <https://builds.apache.org/job/OpenNLP/ws/trunk/opennlp-tools/src/main/java/opennlp/tools/parser/treeinsert/Parser.java>:[452,35] [deprecation] train(java.lang.String,opennlp.tools.util.ObjectStream<opennlp.tools.postag.POSSample>,opennlp.tools.util.TrainingParameters,opennlp.tools.postag.POSDictionary,opennlp.tools.dictionary.Dictionary) in opennlp.tools.postag.POSTaggerME has been deprecated
[WARNING] <https://builds.apache.org/job/OpenNLP/ws/trunk/opennlp-tools/src/main/java/opennlp/tools/parser/treeinsert/AttachContextGenerator.java>:[40,61] [unchecked] unchecked conversion
found : java.util.List
required: java.util.List<opennlp.tools.parser.Parse>
[WARNING] <https://builds.apache.org/job/OpenNLP/ws/trunk/opennlp-tools/src/main/java/opennlp/tools/lang/spanish/TokenChunker.java>:[37,15] [deprecation] NameFinderME(opennlp.model.MaxentModel) in opennlp.tools.namefind.NameFinderME has been deprecated
[WARNING] <https://builds.apache.org/job/OpenNLP/ws/trunk/opennlp-tools/src/main/java/opennlp/tools/lang/english/TreebankNameFinder.java>:[131,49] [deprecation] SimpleTokenizer() in opennlp.tools.tokenize.SimpleTokenizer has been deprecated
[WARNING] <https://builds.apache.org/job/OpenNLP/ws/trunk/opennlp-tools/src/main/java/opennlp/tools/namefind/NameFinderEventStream.java>:[64,27] [deprecation] DefaultNameContextGenerator() in opennlp.tools.namefind.DefaultNameContextGenerator has been deprecated
[WARNING] <https://builds.apache.org/job/OpenNLP/ws/trunk/opennlp-tools/src/main/java/opennlp/tools/parser/AbstractParserEventStream.java>:[54,36] [deprecation] CHUNK in opennlp.tools.parser.ParserEventTypeEnum has been deprecated
[WARNING] <https://builds.apache.org/job/OpenNLP/ws/trunk/opennlp-tools/src/main/java/opennlp/tools/parser/AbstractParserEventStream.java>:[57,41] [deprecation] TAG in opennlp.tools.parser.ParserEventTypeEnum has been deprecated
[WARNING] <https://builds.apache.org/job/OpenNLP/ws/trunk/opennlp-tools/src/main/java/opennlp/tools/parser/AbstractParserEventStream.java>:[77,36] [deprecation] TAG in opennlp.tools.parser.ParserEventTypeEnum has been deprecated
[WARNING] <https://builds.apache.org/job/OpenNLP/ws/trunk/opennlp-tools/src/main/java/opennlp/tools/parser/AbstractParserEventStream.java>:[80,41] [deprecation] CHUNK in opennlp.tools.parser.ParserEventTypeEnum has been deprecated
[WARNING] <https://builds.apache.org/job/OpenNLP/ws/trunk/opennlp-tools/src/main/java/opennlp/tools/parser/treeinsert/ParserEventStream.java>:[353,35] [deprecation] CHUNK in opennlp.tools.parser.ParserEventTypeEnum has been deprecated
[WARNING] <https://builds.apache.org/job/OpenNLP/ws/trunk/opennlp-tools/src/main/java/opennlp/tools/parser/treeinsert/ParserEventStream.java>:[359,35] [deprecation] TAG in opennlp.tools.parser.ParserEventTypeEnum has been deprecated
[WARNING] <https://builds.apache.org/job/OpenNLP/ws/trunk/opennlp-tools/src/main/java/opennlp/tools/parser/treeinsert/ParserEventStream.java>:[378,22] [deprecation] HeadRules(java.lang.String) in opennlp.tools.parser.lang.en.HeadRules has been deprecated
[WARNING] <https://builds.apache.org/job/OpenNLP/ws/trunk/opennlp-tools/src/main/java/opennlp/tools/util/model/FeatureGeneratorFactorySerializer.java>:[35,26] [deprecation] opennlp.tools.util.model.ClassSerializer in opennlp.tools.util.model has been deprecated
[WARNING] <https://builds.apache.org/job/OpenNLP/ws/trunk/opennlp-tools/src/main/java/opennlp/tools/util/model/FeatureGeneratorFactorySerializer.java>:[44,14] [deprecation] opennlp.tools.util.featuregen.FeatureGeneratorFactory in opennlp.tools.util.featuregen has been deprecated
[WARNING] <https://builds.apache.org/job/OpenNLP/ws/trunk/opennlp-tools/src/main/java/opennlp/tools/parser/chunking/Parser.java>:[304,35] [deprecation] train(java.lang.String,opennlp.tools.util.ObjectStream<opennlp.tools.postag.POSSample>,opennlp.tools.util.TrainingParameters,opennlp.tools.postag.POSDictionary,opennlp.tools.dictionary.Dictionary) in opennlp.tools.postag.POSTaggerME has been deprecated
[WARNING] <https://builds.apache.org/job/OpenNLP/ws/trunk/opennlp-tools/src/main/java/opennlp/tools/postag/POSTaggerTrainer.java>:[75,11] [deprecation] POSModel(java.lang.String,opennlp.model.AbstractModel,opennlp.tools.postag.POSDictionary,opennlp.tools.dictionary.Dictionary) in opennlp.tools.postag.POSModel has been deprecated
[WARNING] <https://builds.apache.org/job/OpenNLP/ws/trunk/opennlp-tools/src/main/java/opennlp/tools/sentdetect/lang/th/SentenceContextGenerator.java>:[35,17] [deprecation] collectFeatures(java.lang.String,java.lang.String,java.lang.String,java.lang.String) in opennlp.tools.sentdetect.DefaultSDContextGenerator has been deprecated
[WARNING] <https://builds.apache.org/job/OpenNLP/ws/trunk/opennlp-tools/src/main/java/opennlp/tools/cmdline/parser/BuildModelUpdaterTool.java>:[51,39] [deprecation] train(opennlp.model.EventStream,int,int) in opennlp.tools.parser.chunking.Parser has been deprecated
[WARNING] <https://builds.apache.org/job/OpenNLP/ws/trunk/opennlp-tools/src/main/java/opennlp/tools/parser/chunking/ParserEventStream.java>:[185,35] [deprecation] CHUNK in opennlp.tools.parser.ParserEventTypeEnum has been deprecated
[WARNING] <https://builds.apache.org/job/OpenNLP/ws/trunk/opennlp-tools/src/main/java/opennlp/tools/parser/chunking/ParserEventStream.java>:[188,35] [deprecation] TAG in opennlp.tools.parser.ParserEventTypeEnum has been deprecated
[WARNING] <https://builds.apache.org/job/OpenNLP/ws/trunk/opennlp-tools/src/main/java/opennlp/tools/parser/chunking/ParserEventStream.java>:[199,22] [deprecation] HeadRules(java.lang.String) in opennlp.tools.parser.lang.en.HeadRules has been deprecated
[WARNING] <https://builds.apache.org/job/OpenNLP/ws/trunk/opennlp-tools/src/main/java/opennlp/tools/parser/chunking/ParserEventStream.java>:[202,13] [deprecation] Dictionary(java.io.InputStream,boolean) in opennlp.tools.dictionary.Dictionary has been deprecated
[WARNING] <https://builds.apache.org/job/OpenNLP/ws/trunk/opennlp-tools/src/main/java/opennlp/tools/util/featuregen/FeatureGeneratorUtil.java>:[48,11] [deprecation] opennlp.tools.util.featuregen.FastTokenClassFeatureGenerator in opennlp.tools.util.featuregen has been deprecated
[INFO] 28 warnings
[INFO] -------------------------------------------------------------
[INFO] -------------------------------------------------------------
[ERROR] COMPILATION ERROR :
[INFO] -------------------------------------------------------------
[ERROR] <https://builds.apache.org/job/OpenNLP/ws/trunk/opennlp-tools/src/main/java/opennlp/tools/formats/frenchtreebank/ConstitParseSampleStream.java>:[66,16] cannot find symbol
symbol : constructor IOException(org.xml.sax.SAXException)
location: class java.io.IOException
[INFO] 1 error
[INFO] -------------------------------------------------------------
[JENKINS] Archiving <https://builds.apache.org/job/OpenNLP/ws/trunk/opennlp-tools/pom.xml> to /home/hudson/hudson/jobs/OpenNLP/modules/org.apache.opennlp$opennlp-tools/builds/2012-04-03_08-09-28/archive/org.apache.opennlp/opennlp-tools/1.5.3-SNAPSHOT/opennlp-tools-1.5.3-SNAPSHOT.pom
[INFO] ------------------------------------------------------------------------
[INFO] Reactor Summary:
[INFO]
[INFO] Apache OpenNLP Reactor ............................ SUCCESS [22.498s]
[INFO] Apache OpenNLP Maxent ............................. SUCCESS [33.354s]
[INFO] Apache OpenNLP Tools .............................. FAILURE [3.399s]
[INFO] Apache OpenNLP UIMA Annotators .................... SKIPPED
[INFO] Apache OpenNLP Documentation ...................... SKIPPED
[INFO] Apache OpenNLP Distribution ....................... SKIPPED
[INFO] ------------------------------------------------------------------------
[INFO] BUILD FAILURE
[INFO] ------------------------------------------------------------------------
[INFO] Total time: 1:10.914s
[INFO] Finished at: Tue Apr 03 08:10:53 UTC 2012
[INFO] Final Memory: 23M/189M
[INFO] ------------------------------------------------------------------------
mavenExecutionResult exceptions not empty
message : Failed to execute goal org.apache.maven.plugins:maven-compiler-plugin:2.3.2:compile (default-compile) on project opennlp-tools: Compilation failure
<https://builds.apache.org/job/OpenNLP/ws/trunk/opennlp-tools/src/main/java/opennlp/tools/formats/frenchtreebank/ConstitParseSampleStream.java>:[66,16] cannot find symbol
symbol : constructor IOException(org.xml.sax.SAXException)
location: class java.io.IOException
cause : Compilation failure
<https://builds.apache.org/job/OpenNLP/ws/trunk/opennlp-tools/src/main/java/opennlp/tools/formats/frenchtreebank/ConstitParseSampleStream.java>:[66,16] cannot find symbol
symbol : constructor IOException(org.xml.sax.SAXException)
location: class java.io.IOException
Stack trace :
org.apache.maven.lifecycle.LifecycleExecutionException: Failed to execute goal org.apache.maven.plugins:maven-compiler-plugin:2.3.2:compile (default-compile) on project opennlp-tools: Compilation failure
<https://builds.apache.org/job/OpenNLP/ws/trunk/opennlp-tools/src/main/java/opennlp/tools/formats/frenchtreebank/ConstitParseSampleStream.java>:[66,16] cannot find symbol
symbol : constructor IOException(org.xml.sax.SAXException)
location: class java.io.IOException
at org.apache.maven.lifecycle.internal.MojoExecutor.execute(MojoExecutor.java:213)
at org.apache.maven.lifecycle.internal.MojoExecutor.execute(MojoExecutor.java:153)
at org.apache.maven.lifecycle.internal.MojoExecutor.execute(MojoExecutor.java:145)
at org.apache.maven.lifecycle.internal.LifecycleModuleBuilder.buildProject(LifecycleModuleBuilder.java:84)
at org.apache.maven.lifecycle.internal.LifecycleModuleBuilder.buildProject(LifecycleModuleBuilder.java:59)
at org.apache.maven.lifecycle.internal.LifecycleStarter.singleThreadedBuild(LifecycleStarter.java:183)
at org.apache.maven.lifecycle.internal.LifecycleStarter.execute(LifecycleStarter.java:161)
at org.apache.maven.DefaultMaven.doExecute(DefaultMaven.java:319)
at org.apache.maven.DefaultMaven.execute(DefaultMaven.java:156)
at org.jvnet.hudson.maven3.launcher.Maven3Launcher.main(Maven3Launcher.java:79)
at sun.reflect.NativeMethodAccessorImpl.invoke0(Native Method)
at sun.reflect.NativeMethodAccessorImpl.invoke(NativeMethodAccessorImpl.java:39)
at sun.reflect.DelegatingMethodAccessorImpl.invoke(DelegatingMethodAccessorImpl.java:25)
at java.lang.reflect.Method.invoke(Method.java:592)
at org.codehaus.plexus.classworlds.launcher.Launcher.launchStandard(Launcher.java:329)
at org.codehaus.plexus.classworlds.launcher.Launcher.launch(Launcher.java:239)
at org.jvnet.hudson.maven3.agent.Maven3Main.launch(Maven3Main.java:158)
at hudson.maven.Maven3Builder.call(Maven3Builder.java:104)
at hudson.maven.Maven3Builder.call(Maven3Builder.java:70)
at hudson.remoting.UserRequest.perform(UserRequest.java:118)
at hudson.remoting.UserRequest.perform(UserRequest.java:48)
at hudson.remoting.Request$2.run(Request.java:287)
at hudson.remoting.InterceptingExecutorService$1.call(InterceptingExecutorService.java:72)
at java.util.concurrent.FutureTask$Sync.innerRun(FutureTask.java:269)
at java.util.concurrent.FutureTask.run(FutureTask.java:123)
at java.util.concurrent.ThreadPoolExecutor$Worker.runTask(ThreadPoolExecutor.java:651)
at java.util.concurrent.ThreadPoolExecutor$Worker.run(ThreadPoolExecutor.java:676)
at java.lang.Thread.run(Thread.java:595)
Caused by: org.apache.maven.plugin.CompilationFailureException: Compilation failure
<https://builds.apache.org/job/OpenNLP/ws/trunk/opennlp-tools/src/main/java/opennlp/tools/formats/frenchtreebank/ConstitParseSampleStream.java>:[66,16] cannot find symbol
symbol : constructor IOException(org.xml.sax.SAXException)
location: class java.io.IOException
at org.apache.maven.plugin.AbstractCompilerMojo.execute(AbstractCompilerMojo.java:656)
at org.apache.maven.plugin.CompilerMojo.execute(CompilerMojo.java:128)
at org.apache.maven.plugin.DefaultBuildPluginManager.executeMojo(DefaultBuildPluginManager.java:107)
at org.apache.maven.lifecycle.internal.MojoExecutor.execute(MojoExecutor.java:209)
... 27 more
Sending e-mails to: opennlp-dev@incubator.apache.org
channel stopped
[WARNINGS] Skipping publisher since build result is FAILURE
Build failed in Jenkins: OpenNLP #314
Posted by Apache Jenkins Server <je...@builds.apache.org>.
See <https://builds.apache.org/job/OpenNLP/314/>
------------------------------------------
Started by user joern
Building remotely on ubuntu1 in workspace <https://builds.apache.org/job/OpenNLP/ws/>
Location 'https://svn.apache.org/repos/asf/incubator/opennlp/trunk' does not exist
Cleaning local Directory trunk
Checking out https://svn.apache.org/repos/asf/incubator/opennlp/trunk
ERROR: Failed to check out https://svn.apache.org/repos/asf/incubator/opennlp/trunk
org.tmatesoft.svn.core.SVNException: svn: URL 'https://svn.apache.org/repos/asf/incubator/opennlp/trunk' doesn't exist
at org.tmatesoft.svn.core.internal.wc.SVNErrorManager.error(SVNErrorManager.java:64)
at org.tmatesoft.svn.core.internal.wc.SVNErrorManager.error(SVNErrorManager.java:51)
at org.tmatesoft.svn.core.wc.SVNUpdateClient.doCheckout(SVNUpdateClient.java:910)
at hudson.scm.subversion.CheckoutUpdater$1.perform(CheckoutUpdater.java:84)
at hudson.scm.subversion.WorkspaceUpdater$UpdateTask.delegateTo(WorkspaceUpdater.java:136)
at hudson.scm.SubversionSCM$CheckOutTask.perform(SubversionSCM.java:788)
at hudson.scm.SubversionSCM$CheckOutTask.invoke(SubversionSCM.java:769)
at hudson.scm.SubversionSCM$CheckOutTask.invoke(SubversionSCM.java:753)
at hudson.FilePath$FileCallableWrapper.call(FilePath.java:2154)
at hudson.remoting.UserRequest.perform(UserRequest.java:118)
at hudson.remoting.UserRequest.perform(UserRequest.java:48)
at hudson.remoting.Request$2.run(Request.java:287)
at hudson.remoting.InterceptingExecutorService$1.call(InterceptingExecutorService.java:72)
at java.util.concurrent.FutureTask$Sync.innerRun(FutureTask.java:334)
at java.util.concurrent.FutureTask.run(FutureTask.java:166)
at java.util.concurrent.ThreadPoolExecutor.runWorker(ThreadPoolExecutor.java:1110)
at java.util.concurrent.ThreadPoolExecutor$Worker.run(ThreadPoolExecutor.java:603)
at java.lang.Thread.run(Thread.java:679)
Caused by: org.tmatesoft.svn.core.SVNErrorMessage: svn: URL 'https://svn.apache.org/repos/asf/incubator/opennlp/trunk' doesn't exist
at org.tmatesoft.svn.core.SVNErrorMessage.create(SVNErrorMessage.java:163)
at org.tmatesoft.svn.core.SVNErrorMessage.create(SVNErrorMessage.java:118)
at org.tmatesoft.svn.core.wc.SVNUpdateClient.doCheckout(SVNUpdateClient.java:909)
... 15 more
FATAL: null
java.lang.NullPointerException
at java.util.ArrayList.addAll(ArrayList.java:530)
at hudson.scm.SubversionSCM.checkout(SubversionSCM.java:743)
at hudson.scm.SubversionSCM.checkout(SubversionSCM.java:685)
at hudson.model.AbstractProject.checkout(AbstractProject.java:1212)
at hudson.model.AbstractBuild$AbstractRunner.checkout(AbstractBuild.java:579)
at hudson.model.AbstractBuild$AbstractRunner.run(AbstractBuild.java:468)
at hudson.model.Run.run(Run.java:1410)
at hudson.maven.MavenModuleSetBuild.run(MavenModuleSetBuild.java:481)
at hudson.model.ResourceController.execute(ResourceController.java:88)
at hudson.model.Executor.run(Executor.java:238)
Build failed in Jenkins: OpenNLP #313
Posted by Apache Jenkins Server <je...@builds.apache.org>.
See <https://builds.apache.org/job/OpenNLP/313/>
------------------------------------------
Started by user joern
Building remotely on ubuntu1 in workspace <https://builds.apache.org/job/OpenNLP/ws/>
Location 'https://svn.apache.org/repos/asf/incubator/opennlp/trunk' does not exist
Cleaning local Directory trunk
Checking out https://svn.apache.org/repos/asf/incubator/opennlp/trunk
ERROR: Failed to check out https://svn.apache.org/repos/asf/incubator/opennlp/trunk
org.tmatesoft.svn.core.SVNException: svn: URL 'https://svn.apache.org/repos/asf/incubator/opennlp/trunk' doesn't exist
at org.tmatesoft.svn.core.internal.wc.SVNErrorManager.error(SVNErrorManager.java:64)
at org.tmatesoft.svn.core.internal.wc.SVNErrorManager.error(SVNErrorManager.java:51)
at org.tmatesoft.svn.core.wc.SVNUpdateClient.doCheckout(SVNUpdateClient.java:910)
at hudson.scm.subversion.CheckoutUpdater$1.perform(CheckoutUpdater.java:84)
at hudson.scm.subversion.WorkspaceUpdater$UpdateTask.delegateTo(WorkspaceUpdater.java:136)
at hudson.scm.SubversionSCM$CheckOutTask.perform(SubversionSCM.java:788)
at hudson.scm.SubversionSCM$CheckOutTask.invoke(SubversionSCM.java:769)
at hudson.scm.SubversionSCM$CheckOutTask.invoke(SubversionSCM.java:753)
at hudson.FilePath$FileCallableWrapper.call(FilePath.java:2154)
at hudson.remoting.UserRequest.perform(UserRequest.java:118)
at hudson.remoting.UserRequest.perform(UserRequest.java:48)
at hudson.remoting.Request$2.run(Request.java:287)
at hudson.remoting.InterceptingExecutorService$1.call(InterceptingExecutorService.java:72)
at java.util.concurrent.FutureTask$Sync.innerRun(FutureTask.java:334)
at java.util.concurrent.FutureTask.run(FutureTask.java:166)
at java.util.concurrent.ThreadPoolExecutor.runWorker(ThreadPoolExecutor.java:1110)
at java.util.concurrent.ThreadPoolExecutor$Worker.run(ThreadPoolExecutor.java:603)
at java.lang.Thread.run(Thread.java:679)
Caused by: org.tmatesoft.svn.core.SVNErrorMessage: svn: URL 'https://svn.apache.org/repos/asf/incubator/opennlp/trunk' doesn't exist
at org.tmatesoft.svn.core.SVNErrorMessage.create(SVNErrorMessage.java:163)
at org.tmatesoft.svn.core.SVNErrorMessage.create(SVNErrorMessage.java:118)
at org.tmatesoft.svn.core.wc.SVNUpdateClient.doCheckout(SVNUpdateClient.java:909)
... 15 more
FATAL: null
java.lang.NullPointerException
at java.util.ArrayList.addAll(ArrayList.java:530)
at hudson.scm.SubversionSCM.checkout(SubversionSCM.java:743)
at hudson.scm.SubversionSCM.checkout(SubversionSCM.java:685)
at hudson.model.AbstractProject.checkout(AbstractProject.java:1212)
at hudson.model.AbstractBuild$AbstractRunner.checkout(AbstractBuild.java:579)
at hudson.model.AbstractBuild$AbstractRunner.run(AbstractBuild.java:468)
at hudson.model.Run.run(Run.java:1410)
at hudson.maven.MavenModuleSetBuild.run(MavenModuleSetBuild.java:481)
at hudson.model.ResourceController.execute(ResourceController.java:88)
at hudson.model.Executor.run(Executor.java:238)