You are viewing a plain text version of this content. The canonical link for it is here.
Posted to dev@activemq.apache.org by Apache Jenkins Server <je...@builds.apache.org> on 2014/03/11 06:58:38 UTC
Build failed in Jenkins: ActiveMQ » ActiveMQ :: Unit Tests #1444
See <https://builds.apache.org/job/ActiveMQ/org.apache.activemq$activemq-unit-tests/1444/changes>
Changes:
[gtully] https://issues.apache.org/jira/browse/AMQ-5087 fix and test
[hadrian] [minor] Use MemoryPersistenceAdapter for testing when choice of persistence adapter is indifferent
------------------------------------------
[...truncated 287 lines...]
[04:02:41] Tests run: 1, Failures: 0, Errors: 0, Skipped: 0, Time elapsed: 3.313 sec - in org.apache.activemq.broker.ReconnectWithJMXEnabledTest
[04:02:42] Running org.apache.activemq.broker.RecoveryBrokerTest
[04:03:34] Tests run: 9, Failures: 0, Errors: 0, Skipped: 0, Time elapsed: 52.138 sec - in org.apache.activemq.broker.RecoveryBrokerTest
[04:03:34] Running org.apache.activemq.broker.RedeliveryRestartTest
[04:03:56] Tests run: 2, Failures: 0, Errors: 0, Skipped: 0, Time elapsed: 21.358 sec - in org.apache.activemq.broker.RedeliveryRestartTest
[04:03:56] Running org.apache.activemq.broker.SpringTest
[04:04:00] Tests run: 1, Failures: 0, Errors: 0, Skipped: 0, Time elapsed: 3.421 sec - in org.apache.activemq.broker.SpringTest
[04:04:01] Running org.apache.activemq.broker.TopicSubscriptionTest
[04:04:11] Tests run: 8, Failures: 0, Errors: 0, Skipped: 0, Time elapsed: 10.286 sec - in org.apache.activemq.broker.TopicSubscriptionTest
[04:04:12] Running org.apache.activemq.broker.XARecoveryBrokerTest
[04:07:05] Tests run: 17, Failures: 0, Errors: 0, Skipped: 0, Time elapsed: 173.169 sec - in org.apache.activemq.broker.XARecoveryBrokerTest
[04:07:06] Running org.apache.activemq.broker.advisory.AdvisoryBrokerTest
[04:07:07] Tests run: 6, Failures: 0, Errors: 0, Skipped: 0, Time elapsed: 1.331 sec - in org.apache.activemq.broker.advisory.AdvisoryBrokerTest
[04:07:07] Running org.apache.activemq.broker.advisory.AdvisoryDuplexNetworkBridgeTest
[04:07:15] Tests run: 2, Failures: 0, Errors: 0, Skipped: 0, Time elapsed: 7.06 sec - in org.apache.activemq.broker.advisory.AdvisoryDuplexNetworkBridgeTest
[04:07:15] Running org.apache.activemq.broker.advisory.AdvisoryJmxTest
[04:07:16] Tests run: 1, Failures: 0, Errors: 0, Skipped: 0, Time elapsed: 1.207 sec - in org.apache.activemq.broker.advisory.AdvisoryJmxTest
[04:07:17] Running org.apache.activemq.broker.advisory.AdvisoryNetworkBridgeTest
[04:07:24] Tests run: 2, Failures: 0, Errors: 0, Skipped: 0, Time elapsed: 7.224 sec - in org.apache.activemq.broker.advisory.AdvisoryNetworkBridgeTest
[04:07:26] Running org.apache.activemq.broker.ft.DbRestartJDBCQueueMasterSlaveLeaseQuiesceTest
[04:08:31] Tests run: 4, Failures: 0, Errors: 0, Skipped: 0, Time elapsed: 64.948 sec - in org.apache.activemq.broker.ft.DbRestartJDBCQueueMasterSlaveLeaseQuiesceTest
[04:08:31] Running org.apache.activemq.broker.ft.DbRestartJDBCQueueMasterSlaveLeaseTest
[04:10:29] Tests run: 3, Failures: 0, Errors: 0, Skipped: 0, Time elapsed: 117.809 sec - in org.apache.activemq.broker.ft.DbRestartJDBCQueueMasterSlaveLeaseTest
[04:10:30] Running org.apache.activemq.broker.ft.DbRestartJDBCQueueMasterSlaveTest
[04:11:54] Tests run: 3, Failures: 0, Errors: 0, Skipped: 0, Time elapsed: 84.398 sec - in org.apache.activemq.broker.ft.DbRestartJDBCQueueMasterSlaveTest
[04:11:54] Running org.apache.activemq.broker.ft.DbRestartJDBCQueueTest
[04:12:32] Tests run: 1, Failures: 0, Errors: 0, Skipped: 0, Time elapsed: 37.813 sec - in org.apache.activemq.broker.ft.DbRestartJDBCQueueTest
[04:12:32] Running org.apache.activemq.broker.ft.JDBCQueueMasterSlaveTest
[04:13:59] Tests run: 3, Failures: 0, Errors: 0, Skipped: 0, Time elapsed: 86.354 sec - in org.apache.activemq.broker.ft.JDBCQueueMasterSlaveTest
[04:13:59] Running org.apache.activemq.broker.ft.QueueMasterSlaveSingleUrlTest
[04:14:55] Tests run: 3, Failures: 1, Errors: 0, Skipped: 0, Time elapsed: 55.907 sec <<< FAILURE! - in org.apache.activemq.broker.ft.QueueMasterSlaveSingleUrlTest
[04:14:55] testAdvisory(org.apache.activemq.broker.ft.QueueMasterSlaveSingleUrlTest) Time elapsed: 17.14 sec <<< FAILURE!
[04:14:55] junit.framework.AssertionFailedError: Didn't received advisory
[04:14:55] at junit.framework.Assert.fail(Assert.java:57)
[04:14:55] at junit.framework.Assert.assertTrue(Assert.java:22)
[04:14:55] at junit.framework.Assert.assertNotNull(Assert.java:256)
[04:14:55] at junit.framework.TestCase.assertNotNull(TestCase.java:426)
[04:14:55] at org.apache.activemq.broker.ft.QueueMasterSlaveTestSupport.testAdvisory(QueueMasterSlaveTestSupport.java:153)
[04:14:55] at sun.reflect.NativeMethodAccessorImpl.invoke0(Native Method)
[04:14:55] at sun.reflect.NativeMethodAccessorImpl.invoke(NativeMethodAccessorImpl.java:39)
[04:14:55] at sun.reflect.DelegatingMethodAccessorImpl.invoke(DelegatingMethodAccessorImpl.java:25)
[04:14:55] at java.lang.reflect.Method.invoke(Method.java:597)
[04:14:55] at junit.framework.TestCase.runTest(TestCase.java:176)
[04:14:55] at junit.framework.TestCase.runBare(TestCase.java:141)
[04:14:55] at org.apache.activemq.CombinationTestSupport.runBare(CombinationTestSupport.java:107)
[04:14:55] at org.apache.activemq.CombinationTestSupport.runBare(CombinationTestSupport.java:113)
[04:14:55] at junit.framework.TestResult$1.protect(TestResult.java:122)
[04:14:55] at junit.framework.TestResult.runProtected(TestResult.java:142)
[04:14:55] at junit.framework.TestResult.run(TestResult.java:125)
[04:14:55] at junit.framework.TestCase.run(TestCase.java:129)
[04:14:55] at junit.framework.TestSuite.runTest(TestSuite.java:255)
[04:14:55] at junit.framework.TestSuite.run(TestSuite.java:250)
[04:14:55] at org.junit.internal.runners.JUnit38ClassRunner.run(JUnit38ClassRunner.java:84)
[04:14:55] at org.apache.maven.surefire.junit4.JUnit4Provider.execute(JUnit4Provider.java:264)
[04:14:55] at org.apache.maven.surefire.junit4.JUnit4Provider.executeTestSet(JUnit4Provider.java:153)
[04:14:55] at org.apache.maven.surefire.junit4.JUnit4Provider.invoke(JUnit4Provider.java:124)
[04:14:55] at org.apache.maven.surefire.booter.ForkedBooter.invokeProviderInSameClassLoader(ForkedBooter.java:200)
[04:14:55] at org.apache.maven.surefire.booter.ForkedBooter.runSuitesInProcess(ForkedBooter.java:153)
[04:14:55] at org.apache.maven.surefire.booter.ForkedBooter.main(ForkedBooter.java:103)
[04:14:55]
[04:14:56] Running org.apache.activemq.broker.ft.QueueMasterSlaveTestUsingSharedFileTest
[04:15:48] Tests run: 3, Failures: 0, Errors: 0, Skipped: 0, Time elapsed: 52.486 sec - in org.apache.activemq.broker.ft.QueueMasterSlaveTestUsingSharedFileTest
[04:15:48] Running org.apache.activemq.broker.ft.kahaDbJdbcLeaseQueueMasterSlaveTest
[04:16:27] Tests run: 3, Failures: 0, Errors: 0, Skipped: 0, Time elapsed: 38.584 sec - in org.apache.activemq.broker.ft.kahaDbJdbcLeaseQueueMasterSlaveTest
[04:16:27] Running org.apache.activemq.broker.ft.mKahaDbQueueMasterSlaveTest
[04:17:13] Tests run: 3, Failures: 0, Errors: 0, Skipped: 0, Time elapsed: 45.741 sec - in org.apache.activemq.broker.ft.mKahaDbQueueMasterSlaveTest
[04:17:13] Running org.apache.activemq.broker.jmx.BrokerViewSlowStoreStartupTest
[04:17:16] Tests run: 1, Failures: 0, Errors: 0, Skipped: 0, Time elapsed: 2.218 sec - in org.apache.activemq.broker.jmx.BrokerViewSlowStoreStartupTest
[04:17:16] Running org.apache.activemq.broker.jmx.HealthViewMBeanTest
[04:17:23] Tests run: 1, Failures: 0, Errors: 0, Skipped: 0, Time elapsed: 6.495 sec - in org.apache.activemq.broker.jmx.HealthViewMBeanTest
[04:17:23] Running org.apache.activemq.broker.jmx.MBeanOperationTimeoutTest
[04:17:53] Tests run: 1, Failures: 0, Errors: 0, Skipped: 0, Time elapsed: 29.45 sec - in org.apache.activemq.broker.jmx.MBeanOperationTimeoutTest
[04:17:54] Running org.apache.activemq.broker.jmx.MBeanTest
[04:18:27] Tests run: 24, Failures: 0, Errors: 0, Skipped: 0, Time elapsed: 33.473 sec - in org.apache.activemq.broker.jmx.MBeanTest
[04:18:28] Running org.apache.activemq.broker.jmx.PurgeTest
[04:19:27] Tests run: 4, Failures: 0, Errors: 0, Skipped: 0, Time elapsed: 59.767 sec - in org.apache.activemq.broker.jmx.PurgeTest
[04:19:28] Running org.apache.activemq.broker.jmx.TransportConnectorMBeanTest
[04:19:30] Tests run: 4, Failures: 0, Errors: 0, Skipped: 0, Time elapsed: 2.058 sec - in org.apache.activemq.broker.jmx.TransportConnectorMBeanTest
[04:19:31] Running org.apache.activemq.broker.mKahaDBXARecoveryBrokerTest
[04:22:41] Tests run: 17, Failures: 0, Errors: 0, Skipped: 0, Time elapsed: 190.748 sec - in org.apache.activemq.broker.mKahaDBXARecoveryBrokerTest
[04:22:42] Running org.apache.activemq.broker.mLevelDBXARecoveryBrokerTest
[04:25:26] Tests run: 17, Failures: 0, Errors: 0, Skipped: 0, Time elapsed: 163.725 sec - in org.apache.activemq.broker.mLevelDBXARecoveryBrokerTest
[04:25:26] Running org.apache.activemq.broker.message.security.MessageAuthenticationTest
[04:25:28] Tests run: 1, Failures: 0, Errors: 0, Skipped: 0, Time elapsed: 1.14 sec - in org.apache.activemq.broker.message.security.MessageAuthenticationTest
[04:25:28] Running org.apache.activemq.broker.partition.SpringPartitionBrokerTest
[04:25:30] Tests run: 1, Failures: 0, Errors: 0, Skipped: 0, Time elapsed: 1.852 sec - in org.apache.activemq.broker.partition.SpringPartitionBrokerTest
[04:25:30] Running org.apache.activemq.broker.policy.AbortSlowAckConsumer0Test
[04:26:39] Tests run: 8, Failures: 0, Errors: 0, Skipped: 0, Time elapsed: 68.738 sec - in org.apache.activemq.broker.policy.AbortSlowAckConsumer0Test
[04:26:40] Running org.apache.activemq.broker.policy.AbortSlowAckConsumer1Test
[04:28:02] Tests run: 12, Failures: 0, Errors: 0, Skipped: 0, Time elapsed: 81.835 sec - in org.apache.activemq.broker.policy.AbortSlowAckConsumer1Test
[04:28:02] Running org.apache.activemq.broker.policy.AbortSlowAckConsumer2Test
[04:28:13] Tests run: 2, Failures: 0, Errors: 0, Skipped: 0, Time elapsed: 11.171 sec - in org.apache.activemq.broker.policy.AbortSlowAckConsumer2Test
[04:28:14] Running org.apache.activemq.broker.policy.AbortSlowConsumer0Test
[04:28:38] Tests run: 5, Failures: 0, Errors: 0, Skipped: 0, Time elapsed: 23.526 sec - in org.apache.activemq.broker.policy.AbortSlowConsumer0Test
[04:28:38] Running org.apache.activemq.broker.policy.AbortSlowConsumer1Test
[04:30:00] Tests run: 12, Failures: 0, Errors: 0, Skipped: 0, Time elapsed: 81.845 sec - in org.apache.activemq.broker.policy.AbortSlowConsumer1Test
[04:30:01] Running org.apache.activemq.broker.policy.AbortSlowConsumer2Test
[04:30:12] Tests run: 2, Failures: 0, Errors: 0, Skipped: 0, Time elapsed: 11.698 sec - in org.apache.activemq.broker.policy.AbortSlowConsumer2Test
[04:30:13] Running org.apache.activemq.broker.policy.DeadLetterTest
[04:31:36] Tests run: 4, Failures: 0, Errors: 0, Skipped: 0, Time elapsed: 82.601 sec - in org.apache.activemq.broker.policy.DeadLetterTest
[04:31:36] Running org.apache.activemq.broker.policy.DestinationCursorConfigTest
[04:31:38] Tests run: 2, Failures: 0, Errors: 0, Skipped: 0, Time elapsed: 2.086 sec - in org.apache.activemq.broker.policy.DestinationCursorConfigTest
[04:31:39] Running org.apache.activemq.broker.policy.DiscardingDeadLetterPolicyTest
[04:33:41] Tests run: 4, Failures: 0, Errors: 0, Skipped: 0, Time elapsed: 122.467 sec - in org.apache.activemq.broker.policy.DiscardingDeadLetterPolicyTest
[04:33:42] Running org.apache.activemq.broker.policy.IndividualDeadLetterTest
[04:35:37] Tests run: 5, Failures: 0, Errors: 0, Skipped: 0, Time elapsed: 114.785 sec - in org.apache.activemq.broker.policy.IndividualDeadLetterTest
[04:35:38] Running org.apache.activemq.broker.policy.IndividualDeadLetterViaXmlTest
[04:37:02] Tests run: 4, Failures: 0, Errors: 0, Skipped: 0, Time elapsed: 84.297 sec - in org.apache.activemq.broker.policy.IndividualDeadLetterViaXmlTest
[04:37:02] Running org.apache.activemq.broker.policy.MessageGroupConfigTest
[04:37:08] Tests run: 5, Failures: 0, Errors: 0, Skipped: 0, Time elapsed: 5.26 sec - in org.apache.activemq.broker.policy.MessageGroupConfigTest
[04:37:08] Running org.apache.activemq.broker.policy.MessageListenerDeadLetterTest
[04:37:12] Tests run: 4, Failures: 0, Errors: 0, Skipped: 0, Time elapsed: 3.502 sec - in org.apache.activemq.broker.policy.MessageListenerDeadLetterTest
[04:37:13] Running org.apache.activemq.broker.policy.NoConsumerDeadLetterTest
[04:37:15] Tests run: 5, Failures: 0, Errors: 0, Skipped: 0, Time elapsed: 2.44 sec - in org.apache.activemq.broker.policy.NoConsumerDeadLetterTest
[04:37:16] Running org.apache.activemq.broker.policy.NoRetryDeadLetterTest
[04:37:17] Tests run: 4, Failures: 0, Errors: 0, Skipped: 0, Time elapsed: 1.662 sec - in org.apache.activemq.broker.policy.NoRetryDeadLetterTest
[04:37:18] Running org.apache.activemq.broker.policy.PerDurableConsumerDeadLetterTest
[04:38:40] Tests run: 4, Failures: 0, Errors: 0, Skipped: 0, Time elapsed: 82.537 sec - in org.apache.activemq.broker.policy.PerDurableConsumerDeadLetterTest
[04:38:41] Running org.apache.activemq.broker.policy.PriorityNetworkDispatchPolicyTest
[04:38:42] Tests run: 1, Failures: 0, Errors: 0, Skipped: 0, Time elapsed: 0.857 sec - in org.apache.activemq.broker.policy.PriorityNetworkDispatchPolicyTest
[04:38:42] Running org.apache.activemq.broker.policy.StrictOrderDispatchPolicyTest
[04:38:50] Tests run: 8, Failures: 0, Errors: 0, Skipped: 0, Time elapsed: 7.661 sec - in org.apache.activemq.broker.policy.StrictOrderDispatchPolicyTest
[04:38:51] Running org.apache.activemq.broker.region.DestinationGCTest
[04:39:06] Tests run: 2, Failures: 0, Errors: 0, Skipped: 0, Time elapsed: 15.068 sec - in org.apache.activemq.broker.region.DestinationGCTest
[04:39:06] Running org.apache.activemq.broker.region.DestinationRemoveRestartTest
[04:39:11] Tests run: 2, Failures: 0, Errors: 0, Skipped: 0, Time elapsed: 4.743 sec - in org.apache.activemq.broker.region.DestinationRemoveRestartTest
[04:39:11] Running org.apache.activemq.broker.region.QueueDuplicatesFromStoreTest
[04:42:41] Tests run: 2, Failures: 0, Errors: 0, Skipped: 0, Time elapsed: 209.225 sec - in org.apache.activemq.broker.region.QueueDuplicatesFromStoreTest
[04:42:41] Running org.apache.activemq.broker.region.QueueOptimizedDispatchExceptionTest
[04:42:42] Tests run: 1, Failures: 0, Errors: 0, Skipped: 0, Time elapsed: 0.764 sec - in org.apache.activemq.broker.region.QueueOptimizedDispatchExceptionTest
[04:42:42] Running org.apache.activemq.broker.region.QueuePurgeTest
[04:52:43] Running org.apache.activemq.broker.region.SubscriptionAddRemoveQueueTest
[04:52:47] Tests run: 1, Failures: 0, Errors: 0, Skipped: 0, Time elapsed: 4.224 sec - in org.apache.activemq.broker.region.SubscriptionAddRemoveQueueTest
[04:52:48] Running org.apache.activemq.broker.region.UniquePropertyMessageEvictionStrategyTest
[04:53:00] Tests run: 1, Failures: 0, Errors: 0, Skipped: 0, Time elapsed: 12.185 sec - in org.apache.activemq.broker.region.UniquePropertyMessageEvictionStrategyTest
[04:53:01] Running org.apache.activemq.broker.region.cursors.CursorDurableTest
[04:53:12] Tests run: 2, Failures: 0, Errors: 0, Skipped: 0, Time elapsed: 11.573 sec - in org.apache.activemq.broker.region.cursors.CursorDurableTest
[04:53:13] Running org.apache.activemq.broker.region.cursors.CursorQueueStoreTest
[04:55:04] Tests run: 5, Failures: 0, Errors: 0, Skipped: 0, Time elapsed: 110.889 sec - in org.apache.activemq.broker.region.cursors.CursorQueueStoreTest
[04:55:04] Running org.apache.activemq.broker.region.cursors.NegativeQueueTest
[05:05:23] Tests run: 4, Failures: 0, Errors: 0, Skipped: 0, Time elapsed: 618.872 sec - in org.apache.activemq.broker.region.cursors.NegativeQueueTest
[05:05:24] Running org.apache.activemq.broker.region.cursors.OrderPendingListTest
[05:05:24] Tests run: 9, Failures: 0, Errors: 0, Skipped: 0, Time elapsed: 0.263 sec - in org.apache.activemq.broker.region.cursors.OrderPendingListTest
[05:05:24] Running org.apache.activemq.broker.region.cursors.PrioritizedPendingListTest
[05:05:25] Tests run: 7, Failures: 0, Errors: 0, Skipped: 0, Time elapsed: 0.277 sec - in org.apache.activemq.broker.region.cursors.PrioritizedPendingListTest
[05:05:25] Running org.apache.activemq.broker.region.cursors.StoreBasedCursorTest
[05:05:49] Tests run: 5, Failures: 0, Errors: 0, Skipped: 0, Time elapsed: 24.249 sec - in org.apache.activemq.broker.region.cursors.StoreBasedCursorTest
[05:05:50] Running org.apache.activemq.broker.region.cursors.StoreQueueCursorJDBCNoDuplicateTest
[05:05:59] Tests run: 1, Failures: 0, Errors: 0, Skipped: 0, Time elapsed: 8.618 sec - in org.apache.activemq.broker.region.cursors.StoreQueueCursorJDBCNoDuplicateTest
[05:05:59] Running org.apache.activemq.broker.region.cursors.StoreQueueCursorKahaDBNoDuplicateTest
[05:06:01] Tests run: 1, Failures: 0, Errors: 0, Skipped: 0, Time elapsed: 2.214 sec - in org.apache.activemq.broker.region.cursors.StoreQueueCursorKahaDBNoDuplicateTest
[05:06:01] Running org.apache.activemq.broker.region.cursors.StoreQueueCursorLevelDBNoDuplicateTest
[05:06:03] Tests run: 1, Failures: 0, Errors: 0, Skipped: 0, Time elapsed: 1.979 sec - in org.apache.activemq.broker.region.cursors.StoreQueueCursorLevelDBNoDuplicateTest
[05:06:04] Running org.apache.activemq.broker.region.cursors.StoreQueueCursorMemoryNoDuplicateTest
[05:06:05] Tests run: 1, Failures: 0, Errors: 0, Skipped: 0, Time elapsed: 0.743 sec - in org.apache.activemq.broker.region.cursors.StoreQueueCursorMemoryNoDuplicateTest
[05:06:05] Running org.apache.activemq.broker.region.cursors.StoreQueueCursorNoDuplicateTest
[05:06:07] Tests run: 1, Failures: 0, Errors: 0, Skipped: 0, Time elapsed: 1.97 sec - in org.apache.activemq.broker.region.cursors.StoreQueueCursorNoDuplicateTest
[05:06:07] Running org.apache.activemq.broker.region.group.MessageGroupHashBucketTest
[05:06:07] Tests run: 2, Failures: 0, Errors: 0, Skipped: 0, Time elapsed: 0.054 sec - in org.apache.activemq.broker.region.group.MessageGroupHashBucketTest
[05:06:08] Running org.apache.activemq.broker.region.group.MessageGroupMapTest
[05:06:08] Tests run: 2, Failures: 0, Errors: 0, Skipped: 0, Time elapsed: 0.053 sec - in org.apache.activemq.broker.region.group.MessageGroupMapTest
[05:06:08] Running org.apache.activemq.broker.region.group.MessageGroupTest
[05:06:10] Tests run: 3, Failures: 0, Errors: 0, Skipped: 0, Time elapsed: 1.584 sec - in org.apache.activemq.broker.region.group.MessageGroupTest
[05:06:10] Running org.apache.activemq.broker.scheduler.JmsCronSchedulerTest
[05:09:02] Tests run: 2, Failures: 0, Errors: 0, Skipped: 0, Time elapsed: 171.232 sec - in org.apache.activemq.broker.scheduler.JmsCronSchedulerTest
[05:09:02] Running org.apache.activemq.broker.scheduler.JmsSchedulerTest
[05:10:52] Tests run: 6, Failures: 0, Errors: 0, Skipped: 0, Time elapsed: 110.45 sec - in org.apache.activemq.broker.scheduler.JmsSchedulerTest
[05:10:53] Running org.apache.activemq.broker.scheduler.JobSchedulerBrokerShutdownTest
[05:11:01] Tests run: 1, Failures: 0, Errors: 0, Skipped: 0, Time elapsed: 8.537 sec - in org.apache.activemq.broker.scheduler.JobSchedulerBrokerShutdownTest
[05:11:02] Running org.apache.activemq.broker.scheduler.JobSchedulerManagementTest
[05:12:32] Tests run: 7, Failures: 0, Errors: 0, Skipped: 0, Time elapsed: 90.239 sec - in org.apache.activemq.broker.scheduler.JobSchedulerManagementTest
[05:12:32] Running org.apache.activemq.broker.scheduler.JobSchedulerStoreTest
[05:12:59] Tests run: 1, Failures: 0, Errors: 0, Skipped: 0, Time elapsed: 26.526 sec - in org.apache.activemq.broker.scheduler.JobSchedulerStoreTest
[05:12:59] Running org.apache.activemq.broker.scheduler.JobSchedulerTest
[05:14:17] Tests run: 9, Failures: 0, Errors: 0, Skipped: 0, Time elapsed: 77.936 sec - in org.apache.activemq.broker.scheduler.JobSchedulerTest
[05:14:18] Running org.apache.activemq.broker.scheduler.JobSchedulerTxTest
[05:14:34] Tests run: 2, Failures: 0, Errors: 0, Skipped: 0, Time elapsed: 16.385 sec - in org.apache.activemq.broker.scheduler.JobSchedulerTxTest
[05:14:34] Running org.apache.activemq.broker.scheduler.LostScheduledMessagesTest
[05:15:09] Tests run: 2, Failures: 0, Errors: 0, Skipped: 0, Time elapsed: 34.894 sec - in org.apache.activemq.broker.scheduler.LostScheduledMessagesTest
[05:15:09] Running org.apache.activemq.broker.store.DefaultStoreBrokerTest
[05:18:03] Tests run: 129, Failures: 0, Errors: 0, Skipped: 0, Time elapsed: 173.105 sec - in org.apache.activemq.broker.store.DefaultStoreBrokerTest
[05:18:03] Running org.apache.activemq.broker.store.DefaultStoreRecoveryBrokerTest
[05:18:55] Tests run: 9, Failures: 0, Errors: 0, Skipped: 0, Time elapsed: 52.015 sec - in org.apache.activemq.broker.store.DefaultStoreRecoveryBrokerTest
[05:18:56] Running org.apache.activemq.broker.store.RecoverExpiredMessagesTest
[05:19:46] Tests run: 4, Failures: 0, Errors: 0, Skipped: 0, Time elapsed: 50.62 sec - in org.apache.activemq.broker.store.RecoverExpiredMessagesTest
[05:19:47] Running org.apache.activemq.broker.util.PluginBrokerTest
[05:19:50] Tests run: 1, Failures: 0, Errors: 0, Skipped: 0, Time elapsed: 2.887 sec - in org.apache.activemq.broker.util.PluginBrokerTest
[05:19:50] Running org.apache.activemq.broker.util.RedeliveryPluginTest
[05:19:51] Tests run: 1, Failures: 0, Errors: 0, Skipped: 0, Time elapsed: 0.483 sec - in org.apache.activemq.broker.util.RedeliveryPluginTest
[05:19:51] Running org.apache.activemq.broker.util.TimeStampingBrokerPluginTest
[05:19:54] Tests run: 3, Failures: 0, Errors: 0, Skipped: 0, Time elapsed: 3.082 sec - in org.apache.activemq.broker.util.TimeStampingBrokerPluginTest
[05:19:55] Running org.apache.activemq.broker.util.TraceBrokerPathPluginTest
[05:19:56] Tests run: 1, Failures: 0, Errors: 0, Skipped: 0, Time elapsed: 1.282 sec - in org.apache.activemq.broker.util.TraceBrokerPathPluginTest
[05:19:57] Running org.apache.activemq.broker.virtual.CompositeQueueTest
[05:19:59] Tests run: 1, Failures: 0, Errors: 0, Skipped: 0, Time elapsed: 2.292 sec - in org.apache.activemq.broker.virtual.CompositeQueueTest
[05:19:59] Running org.apache.activemq.broker.virtual.CompositeTopicTest
[05:20:03] Tests run: 1, Failures: 0, Errors: 0, Skipped: 0, Time elapsed: 3.351 sec - in org.apache.activemq.broker.virtual.CompositeTopicTest
[05:20:03] Running org.apache.activemq.broker.virtual.DestinationInterceptorDurableSubTest
[05:20:06] Tests run: 1, Failures: 0, Errors: 0, Skipped: 0, Time elapsed: 2.161 sec - in org.apache.activemq.broker.virtual.DestinationInterceptorDurableSubTest
[05:20:06] Running org.apache.activemq.broker.virtual.FilteredQueueTest
[05:20:10] Tests run: 1, Failures: 0, Errors: 0, Skipped: 0, Time elapsed: 3.653 sec - in org.apache.activemq.broker.virtual.FilteredQueueTest
[05:20:11] Running org.apache.activemq.broker.virtual.MirroredQueueCorrectMemoryUsageTest
[05:29:10] Tests run: 1, Failures: 0, Errors: 0, Skipped: 0, Time elapsed: 538.901 sec - in org.apache.activemq.broker.virtual.MirroredQueueCorrectMemoryUsageTest
[05:29:10] Running org.apache.activemq.broker.virtual.MirroredQueueTest
[05:29:11] Tests run: 2, Failures: 0, Errors: 0, Skipped: 0, Time elapsed: 1.219 sec - in org.apache.activemq.broker.virtual.MirroredQueueTest
[05:29:12] Running org.apache.activemq.broker.virtual.MirroredQueueUsingVirtualTopicQueueTest
[05:29:13] Tests run: 2, Failures: 0, Errors: 0, Skipped: 0, Time elapsed: 1.251 sec - in org.apache.activemq.broker.virtual.MirroredQueueUsingVirtualTopicQueueTest
[05:29:14] Running org.apache.activemq.broker.virtual.VirtualTopicDLQTest
[05:29:23] Tests run: 1, Failures: 0, Errors: 0, Skipped: 0, Time elapsed: 8.564 sec - in org.apache.activemq.broker.virtual.VirtualTopicDLQTest
[05:29:23] Running org.apache.activemq.broker.virtual.VirtualTopicDisconnectSelectorTest
[05:29:28] Tests run: 2, Failures: 0, Errors: 0, Skipped: 0, Time elapsed: 4.777 sec - in org.apache.activemq.broker.virtual.VirtualTopicDisconnectSelectorTest
[05:29:28] Running org.apache.activemq.broker.virtual.VirtualTopicPubSubTest
[05:29:30] Tests run: 2, Failures: 0, Errors: 0, Skipped: 0, Time elapsed: 1.36 sec - in org.apache.activemq.broker.virtual.VirtualTopicPubSubTest
[05:29:30] Running org.apache.activemq.broker.virtual.VirtualTopicPubSubUsingXBeanTest
[05:29:32] Tests run: 2, Failures: 0, Errors: 0, Skipped: 0, Time elapsed: 1.355 sec - in org.apache.activemq.broker.virtual.VirtualTopicPubSubUsingXBeanTest
[05:29:32] Running org.apache.activemq.broker.virtual.VirtualTopicSelectorTest
[05:29:33] Tests run: 1, Failures: 0, Errors: 0, Skipped: 0, Time elapsed: 1.189 sec - in org.apache.activemq.broker.virtual.VirtualTopicSelectorTest
[05:29:34] Running org.apache.activemq.broker.virtual.VirtualTopicsAndDurableSubsTest
[05:29:54] Tests run: 25, Failures: 0, Errors: 0, Skipped: 0, Time elapsed: 20.319 sec - in org.apache.activemq.broker.virtual.VirtualTopicsAndDurableSubsTest
[05:29:55] Running org.apache.activemq.bugs.AMQ1687Test
[05:29:56] Tests run: 1, Failures: 0, Errors: 0, Skipped: 0, Time elapsed: 1.402 sec - in org.apache.activemq.bugs.AMQ1687Test
[05:29:57] Running org.apache.activemq.bugs.AMQ1853Test
[05:30:05] Tests run: 1, Failures: 0, Errors: 0, Skipped: 0, Time elapsed: 7.781 sec - in org.apache.activemq.bugs.AMQ1853Test
[05:30:05] Running org.apache.activemq.bugs.AMQ1893Test
[05:41:24] Tests run: 1, Failures: 0, Errors: 0, Skipped: 0, Time elapsed: 678.7 sec - in org.apache.activemq.bugs.AMQ1893Test
[05:41:24] Running org.apache.activemq.bugs.AMQ1917Test
[05:41:31] Tests run: 1, Failures: 0, Errors: 0, Skipped: 0, Time elapsed: 6.215 sec - in org.apache.activemq.bugs.AMQ1917Test
[05:41:31] Running org.apache.activemq.bugs.AMQ1936Test
[05:47:26] Tests run: 1, Failures: 0, Errors: 0, Skipped: 0, Time elapsed: 354.664 sec - in org.apache.activemq.bugs.AMQ1936Test
[05:47:27] Running org.apache.activemq.bugs.AMQ2021Test
[05:48:13] Tests run: 1, Failures: 0, Errors: 0, Skipped: 0, Time elapsed: 46.802 sec - in org.apache.activemq.bugs.AMQ2021Test
[05:48:14] Running org.apache.activemq.bugs.AMQ2084Test
[05:48:21] Tests run: 2, Failures: 0, Errors: 0, Skipped: 0, Time elapsed: 6.502 sec - in org.apache.activemq.bugs.AMQ2084Test
[05:48:21] Running org.apache.activemq.bugs.AMQ2103Test
[05:48:24] Tests run: 2, Failures: 0, Errors: 0, Skipped: 0, Time elapsed: 2.859 sec - in org.apache.activemq.bugs.AMQ2103Test
[05:48:25] Running org.apache.activemq.bugs.AMQ2149LevelDBTest
[05:52:42]
[05:52:42] Results :
[05:52:42]
[05:52:42] Failed tests:
[05:52:42] OnePrefetchAsyncConsumerTest>CombinationTestSupport.runBare:113->CombinationTestSupport.runBare:107->testPrefetchExtension:70 test completed on time
[05:52:42] BrokerRedeliveryTest>CombinationTestSupport.runBare:113->CombinationTestSupport.runBare:107->testInfiniteRedelivery:52->doTestScheduledRedelivery:81 got message via broker redelivery after delay
[05:52:42] BrokerRedeliveryTest>CombinationTestSupport.runBare:113->CombinationTestSupport.runBare:107->testScheduledRedelivery:47->doTestScheduledRedelivery:75 did not get message after redelivery count exceeded: ActiveMQMessage {commandId = 5, responseRequired = true, messageId = ID:quirinus.apache.org-47899-1394510095392-7:1:1:1:1, originalDestination = null, originalTransactionId = null, producerId = ID:quirinus.apache.org-47899-1394510095392-7:1:1:1, destination = queue://Redelivery, transactionId = null, expiration = 0, timestamp = 1394510101317, arrival = 0, brokerInTime = 1394510101317, brokerOutTime = 1394510101412, correlationId = null, replyTo = null, persistent = true, type = null, priority = 4, groupID = null, groupSequence = 0, targetConsumerId = null, compressed = false, userID = null, content = null, marshalledProperties = org.apache.activemq.util.ByteSequence@13a0212, dataStructure = null, redeliveryCounter = 0, size = 1024, properties = {data=hi}, readOnlyProperties = true, readOnlyBody = true, droppable = false, jmsXGroupFirstForConsumer = false}
[05:52:42] QueueMasterSlaveSingleUrlTest>CombinationTestSupport.runBare:113->CombinationTestSupport.runBare:107->QueueMasterSlaveTestSupport.testAdvisory:153 Didn't received advisory
[05:52:42]
[05:52:42] Tests run: 1368, Failures: 4, Errors: 0, Skipped: 0
[05:52:42]
[JENKINS] Recording test results
[05:52:57]
Build failed in Jenkins: ActiveMQ » ActiveMQ :: Unit Tests #1445
Posted by Apache Jenkins Server <je...@builds.apache.org>.
See <https://builds.apache.org/job/ActiveMQ/org.apache.activemq$activemq-unit-tests/1445/changes>
Changes:
[gtully] https://issues.apache.org/jira/browse/AMQ-5087 - fix up test use of initial delay
[gtully] https://issues.apache.org/jira/browse/AMQ-4656 - fix regression for FilePendingDurableSubscriberMessageStoragePolicy
------------------------------------------
[...truncated 357 lines...]
[08:17:12] Tests run: 1, Failures: 0, Errors: 0, Skipped: 0, Time elapsed: 1.546 sec - in org.apache.activemq.broker.jmx.BrokerViewSlowStoreStartupTest
[08:17:12] Running org.apache.activemq.broker.jmx.HealthViewMBeanTest
[08:17:17] Tests run: 1, Failures: 0, Errors: 0, Skipped: 0, Time elapsed: 4.783 sec - in org.apache.activemq.broker.jmx.HealthViewMBeanTest
[08:17:18] Running org.apache.activemq.broker.jmx.MBeanOperationTimeoutTest
[08:17:34] Tests run: 1, Failures: 0, Errors: 0, Skipped: 0, Time elapsed: 16.754 sec - in org.apache.activemq.broker.jmx.MBeanOperationTimeoutTest
[08:17:35] Running org.apache.activemq.broker.jmx.MBeanTest
[08:18:08] Tests run: 24, Failures: 0, Errors: 0, Skipped: 0, Time elapsed: 33.3 sec - in org.apache.activemq.broker.jmx.MBeanTest
[08:18:09] Running org.apache.activemq.broker.jmx.PurgeTest
[08:18:47] Tests run: 4, Failures: 0, Errors: 0, Skipped: 0, Time elapsed: 37.966 sec - in org.apache.activemq.broker.jmx.PurgeTest
[08:18:48] Running org.apache.activemq.broker.jmx.TransportConnectorMBeanTest
[08:18:50] Tests run: 4, Failures: 0, Errors: 0, Skipped: 0, Time elapsed: 2.048 sec - in org.apache.activemq.broker.jmx.TransportConnectorMBeanTest
[08:18:50] Running org.apache.activemq.broker.mKahaDBXARecoveryBrokerTest
[08:21:55] Tests run: 17, Failures: 0, Errors: 0, Skipped: 0, Time elapsed: 184.797 sec - in org.apache.activemq.broker.mKahaDBXARecoveryBrokerTest
[08:21:56] Running org.apache.activemq.broker.mLevelDBXARecoveryBrokerTest
[08:24:29] Tests run: 17, Failures: 0, Errors: 0, Skipped: 0, Time elapsed: 152.753 sec - in org.apache.activemq.broker.mLevelDBXARecoveryBrokerTest
[08:24:29] Running org.apache.activemq.broker.message.security.MessageAuthenticationTest
[08:24:30] Tests run: 1, Failures: 0, Errors: 0, Skipped: 0, Time elapsed: 1.124 sec - in org.apache.activemq.broker.message.security.MessageAuthenticationTest
[08:24:31] Running org.apache.activemq.broker.partition.SpringPartitionBrokerTest
[08:24:33] Tests run: 1, Failures: 0, Errors: 0, Skipped: 0, Time elapsed: 1.857 sec - in org.apache.activemq.broker.partition.SpringPartitionBrokerTest
[08:24:33] Running org.apache.activemq.broker.policy.AbortSlowAckConsumer0Test
[08:25:42] Tests run: 8, Failures: 0, Errors: 0, Skipped: 0, Time elapsed: 68.675 sec - in org.apache.activemq.broker.policy.AbortSlowAckConsumer0Test
[08:25:42] Running org.apache.activemq.broker.policy.AbortSlowAckConsumer1Test
[08:27:04] Tests run: 12, Failures: 0, Errors: 0, Skipped: 0, Time elapsed: 81.807 sec - in org.apache.activemq.broker.policy.AbortSlowAckConsumer1Test
[08:27:05] Running org.apache.activemq.broker.policy.AbortSlowAckConsumer2Test
[08:27:16] Tests run: 2, Failures: 0, Errors: 0, Skipped: 0, Time elapsed: 11.195 sec - in org.apache.activemq.broker.policy.AbortSlowAckConsumer2Test
[08:27:17] Running org.apache.activemq.broker.policy.AbortSlowConsumer0Test
[08:27:40] Tests run: 5, Failures: 0, Errors: 0, Skipped: 0, Time elapsed: 23.469 sec - in org.apache.activemq.broker.policy.AbortSlowConsumer0Test
[08:27:41] Running org.apache.activemq.broker.policy.AbortSlowConsumer1Test
[08:29:03] Tests run: 12, Failures: 0, Errors: 0, Skipped: 0, Time elapsed: 81.826 sec - in org.apache.activemq.broker.policy.AbortSlowConsumer1Test
[08:29:03] Running org.apache.activemq.broker.policy.AbortSlowConsumer2Test
[08:29:14] Tests run: 2, Failures: 0, Errors: 0, Skipped: 0, Time elapsed: 11.179 sec - in org.apache.activemq.broker.policy.AbortSlowConsumer2Test
[08:29:15] Running org.apache.activemq.broker.policy.DeadLetterTest
[08:30:37] Tests run: 4, Failures: 0, Errors: 0, Skipped: 0, Time elapsed: 82.311 sec - in org.apache.activemq.broker.policy.DeadLetterTest
[08:30:38] Running org.apache.activemq.broker.policy.DestinationCursorConfigTest
[08:30:40] Tests run: 2, Failures: 0, Errors: 0, Skipped: 0, Time elapsed: 2.106 sec - in org.apache.activemq.broker.policy.DestinationCursorConfigTest
[08:30:41] Running org.apache.activemq.broker.policy.DiscardingDeadLetterPolicyTest
[08:32:43] Tests run: 4, Failures: 0, Errors: 0, Skipped: 0, Time elapsed: 122.287 sec - in org.apache.activemq.broker.policy.DiscardingDeadLetterPolicyTest
[08:32:44] Running org.apache.activemq.broker.policy.IndividualDeadLetterTest
[08:34:38] Tests run: 5, Failures: 0, Errors: 0, Skipped: 0, Time elapsed: 114.447 sec - in org.apache.activemq.broker.policy.IndividualDeadLetterTest
[08:34:39] Running org.apache.activemq.broker.policy.IndividualDeadLetterViaXmlTest
[08:36:03] Tests run: 4, Failures: 0, Errors: 0, Skipped: 0, Time elapsed: 83.842 sec - in org.apache.activemq.broker.policy.IndividualDeadLetterViaXmlTest
[08:36:03] Running org.apache.activemq.broker.policy.MessageGroupConfigTest
[08:36:08] Tests run: 5, Failures: 0, Errors: 0, Skipped: 0, Time elapsed: 5.092 sec - in org.apache.activemq.broker.policy.MessageGroupConfigTest
[08:36:09] Running org.apache.activemq.broker.policy.MessageListenerDeadLetterTest
[08:36:12] Tests run: 4, Failures: 0, Errors: 0, Skipped: 0, Time elapsed: 3.452 sec - in org.apache.activemq.broker.policy.MessageListenerDeadLetterTest
[08:36:13] Running org.apache.activemq.broker.policy.NoConsumerDeadLetterTest
[08:36:15] Tests run: 5, Failures: 0, Errors: 0, Skipped: 0, Time elapsed: 2.424 sec - in org.apache.activemq.broker.policy.NoConsumerDeadLetterTest
[08:36:16] Running org.apache.activemq.broker.policy.NoRetryDeadLetterTest
[08:36:18] Tests run: 4, Failures: 0, Errors: 0, Skipped: 0, Time elapsed: 1.672 sec - in org.apache.activemq.broker.policy.NoRetryDeadLetterTest
[08:36:18] Running org.apache.activemq.broker.policy.PerDurableConsumerDeadLetterTest
[08:37:41] Tests run: 4, Failures: 0, Errors: 0, Skipped: 0, Time elapsed: 82.31 sec - in org.apache.activemq.broker.policy.PerDurableConsumerDeadLetterTest
[08:37:41] Running org.apache.activemq.broker.policy.PriorityNetworkDispatchPolicyTest
[08:37:42] Tests run: 1, Failures: 0, Errors: 0, Skipped: 0, Time elapsed: 0.856 sec - in org.apache.activemq.broker.policy.PriorityNetworkDispatchPolicyTest
[08:37:42] Running org.apache.activemq.broker.policy.StrictOrderDispatchPolicyTest
[08:37:48] Tests run: 8, Failures: 0, Errors: 0, Skipped: 0, Time elapsed: 5.662 sec - in org.apache.activemq.broker.policy.StrictOrderDispatchPolicyTest
[08:37:49] Running org.apache.activemq.broker.region.DestinationGCTest
[08:38:04] Tests run: 2, Failures: 0, Errors: 0, Skipped: 0, Time elapsed: 15.055 sec - in org.apache.activemq.broker.region.DestinationGCTest
[08:38:04] Running org.apache.activemq.broker.region.DestinationRemoveRestartTest
[08:38:09] Tests run: 2, Failures: 0, Errors: 0, Skipped: 0, Time elapsed: 4.872 sec - in org.apache.activemq.broker.region.DestinationRemoveRestartTest
[08:38:10] Running org.apache.activemq.broker.region.QueueDuplicatesFromStoreTest
[08:40:38] Tests run: 2, Failures: 0, Errors: 0, Skipped: 0, Time elapsed: 148.547 sec - in org.apache.activemq.broker.region.QueueDuplicatesFromStoreTest
[08:40:39] Running org.apache.activemq.broker.region.QueueOptimizedDispatchExceptionTest
[08:40:39] Tests run: 1, Failures: 0, Errors: 0, Skipped: 0, Time elapsed: 0.763 sec - in org.apache.activemq.broker.region.QueueOptimizedDispatchExceptionTest
[08:40:40] Running org.apache.activemq.broker.region.QueuePurgeTest
[08:50:40] Running org.apache.activemq.broker.region.SubscriptionAddRemoveQueueTest
[08:50:45] Tests run: 1, Failures: 0, Errors: 0, Skipped: 0, Time elapsed: 4.468 sec - in org.apache.activemq.broker.region.SubscriptionAddRemoveQueueTest
[08:50:46] Running org.apache.activemq.broker.region.UniquePropertyMessageEvictionStrategyTest
[08:50:58] Tests run: 1, Failures: 0, Errors: 0, Skipped: 0, Time elapsed: 12.18 sec - in org.apache.activemq.broker.region.UniquePropertyMessageEvictionStrategyTest
[08:50:59] Running org.apache.activemq.broker.region.cursors.CursorDurableTest
[08:51:14] Tests run: 2, Failures: 0, Errors: 0, Skipped: 0, Time elapsed: 15.123 sec - in org.apache.activemq.broker.region.cursors.CursorDurableTest
[08:51:14] Running org.apache.activemq.broker.region.cursors.CursorQueueStoreTest
[08:53:18] Tests run: 5, Failures: 0, Errors: 0, Skipped: 0, Time elapsed: 123.252 sec - in org.apache.activemq.broker.region.cursors.CursorQueueStoreTest
[08:53:18] Running org.apache.activemq.broker.region.cursors.NegativeQueueTest
[09:00:59] Tests run: 4, Failures: 0, Errors: 0, Skipped: 0, Time elapsed: 460.888 sec - in org.apache.activemq.broker.region.cursors.NegativeQueueTest
[09:01:00] Running org.apache.activemq.broker.region.cursors.OrderPendingListTest
[09:01:00] Tests run: 9, Failures: 0, Errors: 0, Skipped: 0, Time elapsed: 0.267 sec - in org.apache.activemq.broker.region.cursors.OrderPendingListTest
[09:01:00] Running org.apache.activemq.broker.region.cursors.PrioritizedPendingListTest
[09:01:01] Tests run: 7, Failures: 0, Errors: 0, Skipped: 0, Time elapsed: 0.278 sec - in org.apache.activemq.broker.region.cursors.PrioritizedPendingListTest
[09:01:01] Running org.apache.activemq.broker.region.cursors.StoreBasedCursorTest
[09:01:16] Tests run: 5, Failures: 0, Errors: 0, Skipped: 0, Time elapsed: 15.323 sec - in org.apache.activemq.broker.region.cursors.StoreBasedCursorTest
[09:01:17] Running org.apache.activemq.broker.region.cursors.StoreQueueCursorJDBCNoDuplicateTest
[09:01:23] Tests run: 1, Failures: 0, Errors: 0, Skipped: 0, Time elapsed: 6.555 sec - in org.apache.activemq.broker.region.cursors.StoreQueueCursorJDBCNoDuplicateTest
[09:01:24] Running org.apache.activemq.broker.region.cursors.StoreQueueCursorKahaDBNoDuplicateTest
[09:01:25] Tests run: 1, Failures: 0, Errors: 0, Skipped: 0, Time elapsed: 1.657 sec - in org.apache.activemq.broker.region.cursors.StoreQueueCursorKahaDBNoDuplicateTest
[09:01:26] Running org.apache.activemq.broker.region.cursors.StoreQueueCursorLevelDBNoDuplicateTest
[09:01:28] Tests run: 1, Failures: 0, Errors: 0, Skipped: 0, Time elapsed: 1.894 sec - in org.apache.activemq.broker.region.cursors.StoreQueueCursorLevelDBNoDuplicateTest
[09:01:28] Running org.apache.activemq.broker.region.cursors.StoreQueueCursorMemoryNoDuplicateTest
[09:01:29] Tests run: 1, Failures: 0, Errors: 0, Skipped: 0, Time elapsed: 0.732 sec - in org.apache.activemq.broker.region.cursors.StoreQueueCursorMemoryNoDuplicateTest
[09:01:29] Running org.apache.activemq.broker.region.cursors.StoreQueueCursorNoDuplicateTest
[09:01:31] Tests run: 1, Failures: 0, Errors: 0, Skipped: 0, Time elapsed: 1.67 sec - in org.apache.activemq.broker.region.cursors.StoreQueueCursorNoDuplicateTest
[09:01:31] Running org.apache.activemq.broker.region.group.MessageGroupHashBucketTest
[09:01:31] Tests run: 2, Failures: 0, Errors: 0, Skipped: 0, Time elapsed: 0.054 sec - in org.apache.activemq.broker.region.group.MessageGroupHashBucketTest
[09:01:32] Running org.apache.activemq.broker.region.group.MessageGroupMapTest
[09:01:32] Tests run: 2, Failures: 0, Errors: 0, Skipped: 0, Time elapsed: 0.053 sec - in org.apache.activemq.broker.region.group.MessageGroupMapTest
[09:01:32] Running org.apache.activemq.broker.region.group.MessageGroupTest
[09:01:34] Tests run: 3, Failures: 0, Errors: 0, Skipped: 0, Time elapsed: 1.587 sec - in org.apache.activemq.broker.region.group.MessageGroupTest
[09:01:34] Running org.apache.activemq.broker.scheduler.JmsCronSchedulerTest
[09:04:01] Tests run: 2, Failures: 0, Errors: 0, Skipped: 0, Time elapsed: 146.965 sec - in org.apache.activemq.broker.scheduler.JmsCronSchedulerTest
[09:04:02] Running org.apache.activemq.broker.scheduler.JmsSchedulerTest
[09:05:50] Tests run: 6, Failures: 0, Errors: 0, Skipped: 0, Time elapsed: 108.479 sec - in org.apache.activemq.broker.scheduler.JmsSchedulerTest
[09:05:50] Running org.apache.activemq.broker.scheduler.JobSchedulerBrokerShutdownTest
[09:05:59] Tests run: 1, Failures: 0, Errors: 0, Skipped: 0, Time elapsed: 8.329 sec - in org.apache.activemq.broker.scheduler.JobSchedulerBrokerShutdownTest
[09:05:59] Running org.apache.activemq.broker.scheduler.JobSchedulerManagementTest
[09:07:35] Tests run: 7, Failures: 0, Errors: 0, Skipped: 0, Time elapsed: 95.287 sec - in org.apache.activemq.broker.scheduler.JobSchedulerManagementTest
[09:07:35] Running org.apache.activemq.broker.scheduler.JobSchedulerStoreTest
[09:07:47] Tests run: 1, Failures: 0, Errors: 0, Skipped: 0, Time elapsed: 12.006 sec - in org.apache.activemq.broker.scheduler.JobSchedulerStoreTest
[09:07:47] Running org.apache.activemq.broker.scheduler.JobSchedulerTest
[09:08:16] Tests run: 9, Failures: 0, Errors: 0, Skipped: 0, Time elapsed: 28.823 sec - in org.apache.activemq.broker.scheduler.JobSchedulerTest
[09:08:16] Running org.apache.activemq.broker.scheduler.JobSchedulerTxTest
[09:08:32] Tests run: 2, Failures: 0, Errors: 0, Skipped: 0, Time elapsed: 15.2 sec - in org.apache.activemq.broker.scheduler.JobSchedulerTxTest
[09:08:32] Running org.apache.activemq.broker.scheduler.LostScheduledMessagesTest
[09:09:06] Tests run: 2, Failures: 0, Errors: 0, Skipped: 0, Time elapsed: 34.383 sec - in org.apache.activemq.broker.scheduler.LostScheduledMessagesTest
[09:09:07] Running org.apache.activemq.broker.store.DefaultStoreBrokerTest
[09:11:47] Tests run: 129, Failures: 0, Errors: 0, Skipped: 0, Time elapsed: 160.109 sec - in org.apache.activemq.broker.store.DefaultStoreBrokerTest
[09:11:47] Running org.apache.activemq.broker.store.DefaultStoreRecoveryBrokerTest
[09:12:39] Tests run: 9, Failures: 0, Errors: 0, Skipped: 0, Time elapsed: 51.537 sec - in org.apache.activemq.broker.store.DefaultStoreRecoveryBrokerTest
[09:12:39] Running org.apache.activemq.broker.store.RecoverExpiredMessagesTest
[09:13:24] Tests run: 4, Failures: 0, Errors: 0, Skipped: 0, Time elapsed: 44.567 sec - in org.apache.activemq.broker.store.RecoverExpiredMessagesTest
[09:13:25] Running org.apache.activemq.broker.util.PluginBrokerTest
[09:13:27] Tests run: 1, Failures: 0, Errors: 0, Skipped: 0, Time elapsed: 2.823 sec - in org.apache.activemq.broker.util.PluginBrokerTest
[09:13:28] Running org.apache.activemq.broker.util.RedeliveryPluginTest
[09:13:28] Tests run: 1, Failures: 0, Errors: 0, Skipped: 0, Time elapsed: 0.484 sec - in org.apache.activemq.broker.util.RedeliveryPluginTest
[09:13:29] Running org.apache.activemq.broker.util.TimeStampingBrokerPluginTest
[09:13:32] Tests run: 3, Failures: 0, Errors: 0, Skipped: 0, Time elapsed: 3.117 sec - in org.apache.activemq.broker.util.TimeStampingBrokerPluginTest
[09:13:32] Running org.apache.activemq.broker.util.TraceBrokerPathPluginTest
[09:13:34] Tests run: 1, Failures: 0, Errors: 0, Skipped: 0, Time elapsed: 1.254 sec - in org.apache.activemq.broker.util.TraceBrokerPathPluginTest
[09:13:34] Running org.apache.activemq.broker.virtual.CompositeQueueTest
[09:13:36] Tests run: 1, Failures: 0, Errors: 0, Skipped: 0, Time elapsed: 1.721 sec - in org.apache.activemq.broker.virtual.CompositeQueueTest
[09:13:36] Running org.apache.activemq.broker.virtual.CompositeTopicTest
[09:13:39] Tests run: 1, Failures: 0, Errors: 0, Skipped: 0, Time elapsed: 2.805 sec - in org.apache.activemq.broker.virtual.CompositeTopicTest
[09:13:40] Running org.apache.activemq.broker.virtual.DestinationInterceptorDurableSubTest
[09:13:42] Tests run: 1, Failures: 0, Errors: 0, Skipped: 0, Time elapsed: 1.906 sec - in org.apache.activemq.broker.virtual.DestinationInterceptorDurableSubTest
[09:13:42] Running org.apache.activemq.broker.virtual.FilteredQueueTest
[09:13:45] Tests run: 1, Failures: 0, Errors: 0, Skipped: 0, Time elapsed: 3.042 sec - in org.apache.activemq.broker.virtual.FilteredQueueTest
[09:13:46] Running org.apache.activemq.broker.virtual.MirroredQueueCorrectMemoryUsageTest
[09:17:22] Tests run: 1, Failures: 0, Errors: 0, Skipped: 0, Time elapsed: 215.702 sec - in org.apache.activemq.broker.virtual.MirroredQueueCorrectMemoryUsageTest
[09:17:22] Running org.apache.activemq.broker.virtual.MirroredQueueTest
[09:17:23] Tests run: 2, Failures: 0, Errors: 0, Skipped: 0, Time elapsed: 1.194 sec - in org.apache.activemq.broker.virtual.MirroredQueueTest
[09:17:24] Running org.apache.activemq.broker.virtual.MirroredQueueUsingVirtualTopicQueueTest
[09:17:25] Tests run: 2, Failures: 0, Errors: 0, Skipped: 0, Time elapsed: 1.227 sec - in org.apache.activemq.broker.virtual.MirroredQueueUsingVirtualTopicQueueTest
[09:17:26] Running org.apache.activemq.broker.virtual.VirtualTopicDLQTest
[09:17:34] Tests run: 1, Failures: 0, Errors: 0, Skipped: 0, Time elapsed: 8.308 sec - in org.apache.activemq.broker.virtual.VirtualTopicDLQTest
[09:17:35] Running org.apache.activemq.broker.virtual.VirtualTopicDisconnectSelectorTest
[09:17:39] Tests run: 2, Failures: 0, Errors: 0, Skipped: 0, Time elapsed: 4.802 sec - in org.apache.activemq.broker.virtual.VirtualTopicDisconnectSelectorTest
[09:17:40] Running org.apache.activemq.broker.virtual.VirtualTopicPubSubTest
[09:17:41] Tests run: 2, Failures: 0, Errors: 0, Skipped: 0, Time elapsed: 1.339 sec - in org.apache.activemq.broker.virtual.VirtualTopicPubSubTest
[09:17:42] Running org.apache.activemq.broker.virtual.VirtualTopicPubSubUsingXBeanTest
[09:17:43] Tests run: 2, Failures: 0, Errors: 0, Skipped: 0, Time elapsed: 1.355 sec - in org.apache.activemq.broker.virtual.VirtualTopicPubSubUsingXBeanTest
[09:17:44] Running org.apache.activemq.broker.virtual.VirtualTopicSelectorTest
[09:17:46] Tests run: 1, Failures: 0, Errors: 0, Skipped: 0, Time elapsed: 2.189 sec - in org.apache.activemq.broker.virtual.VirtualTopicSelectorTest
[09:17:47] Running org.apache.activemq.broker.virtual.VirtualTopicsAndDurableSubsTest
[09:18:07] Tests run: 25, Failures: 0, Errors: 0, Skipped: 0, Time elapsed: 20.242 sec - in org.apache.activemq.broker.virtual.VirtualTopicsAndDurableSubsTest
[09:18:08] Running org.apache.activemq.bugs.AMQ1687Test
[09:18:09] Tests run: 1, Failures: 0, Errors: 0, Skipped: 0, Time elapsed: 1.373 sec - in org.apache.activemq.bugs.AMQ1687Test
[09:18:10] Running org.apache.activemq.bugs.AMQ1853Test
[09:18:17] Tests run: 1, Failures: 0, Errors: 0, Skipped: 0, Time elapsed: 7.773 sec - in org.apache.activemq.bugs.AMQ1853Test
[09:18:18] Running org.apache.activemq.bugs.AMQ1893Test
[09:23:36] Tests run: 1, Failures: 0, Errors: 0, Skipped: 0, Time elapsed: 318.029 sec - in org.apache.activemq.bugs.AMQ1893Test
[09:23:36] Running org.apache.activemq.bugs.AMQ1917Test
[09:23:43] Tests run: 1, Failures: 0, Errors: 0, Skipped: 0, Time elapsed: 6.228 sec - in org.apache.activemq.bugs.AMQ1917Test
[09:23:43] Running org.apache.activemq.bugs.AMQ1936Test
[09:26:10] Tests run: 1, Failures: 0, Errors: 0, Skipped: 0, Time elapsed: 146.734 sec - in org.apache.activemq.bugs.AMQ1936Test
[09:26:11] Running org.apache.activemq.bugs.AMQ2021Test
[09:26:33] Tests run: 1, Failures: 0, Errors: 0, Skipped: 0, Time elapsed: 22.7 sec - in org.apache.activemq.bugs.AMQ2021Test
[09:26:34] Running org.apache.activemq.bugs.AMQ2084Test
[09:26:40] Tests run: 2, Failures: 0, Errors: 0, Skipped: 0, Time elapsed: 6.54 sec - in org.apache.activemq.bugs.AMQ2084Test
[09:26:41] Running org.apache.activemq.bugs.AMQ2103Test
[09:26:42] Tests run: 2, Failures: 0, Errors: 0, Skipped: 0, Time elapsed: 1.177 sec - in org.apache.activemq.bugs.AMQ2103Test
[09:26:43] Running org.apache.activemq.bugs.AMQ2149LevelDBTest
[09:30:21] Tests run: 4, Failures: 0, Errors: 0, Skipped: 0, Time elapsed: 217.721 sec - in org.apache.activemq.bugs.AMQ2149LevelDBTest
[09:30:21] Running org.apache.activemq.bugs.AMQ2149Test
[09:43:27] Tests run: 4, Failures: 0, Errors: 3, Skipped: 0, Time elapsed: 786.005 sec <<< FAILURE! - in org.apache.activemq.bugs.AMQ2149Test
[09:43:27] testQueueTransactionalOrderWithRestart(org.apache.activemq.bugs.AMQ2149Test) Time elapsed: 300.233 sec <<< ERROR!
[09:43:27] java.lang.Exception: test timed out after 300000 milliseconds
[09:43:27] at java.lang.Object.wait(Native Method)
[09:43:27] at java.lang.Thread.join(Thread.java:1194)
[09:43:27] at org.apache.activemq.bugs.AMQ2149Test.verifyOrderedMessageReceipt(AMQ2149Test.java:524)
[09:43:27] at org.apache.activemq.bugs.AMQ2149Test.doTestTransactionalOrderWithRestart(AMQ2149Test.java:434)
[09:43:27] at org.apache.activemq.bugs.AMQ2149Test.testQueueTransactionalOrderWithRestart(AMQ2149Test.java:411)
[09:43:27]
[09:43:27] testOrderWithRestart(org.apache.activemq.bugs.AMQ2149Test) Time elapsed: 1.992 sec <<< ERROR!
[09:43:27] javax.jms.InvalidClientIDException: Broker: testOrderWithRestart - Client: queue://test.dest.0 already connected from tcp://127.0.0.1:49581
[09:43:27] at org.apache.activemq.broker.region.RegionBroker.addConnection(RegionBroker.java:242)
[09:43:27] at org.apache.activemq.broker.jmx.ManagedRegionBroker.addConnection(ManagedRegionBroker.java:231)
[09:43:27] at org.apache.activemq.broker.BrokerFilter.addConnection(BrokerFilter.java:92)
[09:43:27] at org.apache.activemq.advisory.AdvisoryBroker.addConnection(AdvisoryBroker.java:89)
[09:43:27] at org.apache.activemq.broker.BrokerFilter.addConnection(BrokerFilter.java:92)
[09:43:27] at org.apache.activemq.broker.BrokerFilter.addConnection(BrokerFilter.java:92)
[09:43:27] at org.apache.activemq.broker.MutableBrokerFilter.addConnection(MutableBrokerFilter.java:97)
[09:43:27] at org.apache.activemq.broker.TransportConnection.processAddConnection(TransportConnection.java:764)
[09:43:27] at org.apache.activemq.broker.jmx.ManagedTransportConnection.processAddConnection(ManagedTransportConnection.java:79)
[09:43:27] at org.apache.activemq.command.ConnectionInfo.visit(ConnectionInfo.java:139)
[09:43:27] at org.apache.activemq.broker.TransportConnection.service(TransportConnection.java:294)
[09:43:27] at org.apache.activemq.broker.TransportConnection$1.onCommand(TransportConnection.java:148)
[09:43:27] at org.apache.activemq.transport.MutexTransport.onCommand(MutexTransport.java:50)
[09:43:27] at org.apache.activemq.transport.WireFormatNegotiator.onCommand(WireFormatNegotiator.java:113)
[09:43:27] at org.apache.activemq.transport.AbstractInactivityMonitor.onCommand(AbstractInactivityMonitor.java:270)
[09:43:27] at org.apache.activemq.transport.TransportSupport.doConsume(TransportSupport.java:83)
[09:43:27] at org.apache.activemq.transport.tcp.TcpTransport.doRun(TcpTransport.java:214)
[09:43:27] at org.apache.activemq.transport.tcp.TcpTransport.run(TcpTransport.java:196)
[09:43:27] at java.lang.Thread.run(Thread.java:662)
[09:43:27]
[09:43:27] testTopicTransactionalOrderWithRestart(org.apache.activemq.bugs.AMQ2149Test) Time elapsed: 300.254 sec <<< ERROR!
[09:43:27] java.lang.Exception: test timed out after 300000 milliseconds
[09:43:27] at java.lang.Object.wait(Native Method)
[09:43:27] at java.lang.Thread.join(Thread.java:1194)
[09:43:27] at org.apache.activemq.bugs.AMQ2149Test.verifyOrderedMessageReceipt(AMQ2149Test.java:524)
[09:43:27] at org.apache.activemq.bugs.AMQ2149Test.doTestTransactionalOrderWithRestart(AMQ2149Test.java:434)
[09:43:27] at org.apache.activemq.bugs.AMQ2149Test.testTopicTransactionalOrderWithRestart(AMQ2149Test.java:416)
[09:43:27]
[09:43:33] Running org.apache.activemq.bugs.AMQ2171Test
[09:43:38] Tests run: 2, Failures: 0, Errors: 0, Skipped: 0, Time elapsed: 5.224 sec - in org.apache.activemq.bugs.AMQ2171Test
[09:43:39] Running org.apache.activemq.bugs.AMQ2200Test
[09:43:42] Tests run: 1, Failures: 0, Errors: 0, Skipped: 0, Time elapsed: 2.87 sec - in org.apache.activemq.bugs.AMQ2200Test
[09:43:42] Running org.apache.activemq.bugs.AMQ2213Test
[09:43:46] Tests run: 3, Failures: 0, Errors: 0, Skipped: 0, Time elapsed: 3.408 sec - in org.apache.activemq.bugs.AMQ2213Test
[09:43:46] Running org.apache.activemq.bugs.AMQ2314Test
[09:45:26] Tests run: 2, Failures: 0, Errors: 0, Skipped: 0, Time elapsed: 100.222 sec - in org.apache.activemq.bugs.AMQ2314Test
[09:45:27] Running org.apache.activemq.bugs.AMQ2356Test
[09:48:05] Tests run: 1, Failures: 0, Errors: 0, Skipped: 0, Time elapsed: 158.299 sec - in org.apache.activemq.bugs.AMQ2356Test
[09:48:06] Running org.apache.activemq.bugs.AMQ2364Test
[09:48:09] Tests run: 1, Failures: 0, Errors: 0, Skipped: 0, Time elapsed: 3.859 sec - in org.apache.activemq.bugs.AMQ2364Test
[09:48:10] Running org.apache.activemq.bugs.AMQ2383Test
[09:48:11] Tests run: 1, Failures: 0, Errors: 0, Skipped: 0, Time elapsed: 0.928 sec - in org.apache.activemq.bugs.AMQ2383Test
[09:48:11] Running org.apache.activemq.bugs.AMQ2401Test
[09:48:24] Tests run: 1, Failures: 0, Errors: 0, Skipped: 0, Time elapsed: 12.561 sec - in org.apache.activemq.bugs.AMQ2401Test
[09:48:24] Running org.apache.activemq.bugs.AMQ2413Test
[09:49:46] Tests run: 8, Failures: 0, Errors: 0, Skipped: 0, Time elapsed: 82.36 sec - in org.apache.activemq.bugs.AMQ2413Test
[09:49:47] Running org.apache.activemq.bugs.AMQ2439Test
[09:50:15] Tests run: 1, Failures: 0, Errors: 0, Skipped: 0, Time elapsed: 28.244 sec - in org.apache.activemq.bugs.AMQ2439Test
[09:50:16] Running org.apache.activemq.bugs.AMQ2489Test
[09:50:21] Tests run: 2, Failures: 0, Errors: 0, Skipped: 0, Time elapsed: 5.203 sec - in org.apache.activemq.bugs.AMQ2489Test
[09:50:22] Running org.apache.activemq.bugs.AMQ2512Test
[09:50:40]
[09:50:40] Results :
[09:50:40]
[09:50:40] Failed tests:
[09:50:40] DbRestartJDBCQueueMasterSlaveLeaseQuiesceTest>CombinationTestSupport.runBare:113->CombinationTestSupport.runBare:107->QueueMasterSlaveTestSupport.testVirtualTopicFailover:132 slave started
[09:50:40] QueueMasterSlaveSingleUrlTest>CombinationTestSupport.runBare:113->CombinationTestSupport.runBare:107->QueueMasterSlaveTestSupport.testAdvisory:153 Didn't received advisory
[09:50:40]
[09:50:40] Tests in error:
[09:50:40] AMQ2149Test.testQueueTransactionalOrderWithRestart:411->doTestTransactionalOrderWithRestart:434->verifyOrderedMessageReceipt:524->Object.wait:-2 ?
[09:50:40] AMQ2149Test.testOrderWithRestart ? InvalidClientID Broker: testOrderWithRestar...
[09:50:40] AMQ2149Test.testTopicTransactionalOrderWithRestart:416->doTestTransactionalOrderWithRestart:434->verifyOrderedMessageReceipt:524->Object.wait:-2 ?
[09:50:40]
[09:50:40] Tests run: 1399, Failures: 2, Errors: 3, Skipped: 0
[09:50:40]
[JENKINS] Recording test results
[09:51:23]