You are viewing a plain text version of this content. The canonical link for it is here.
Posted to builds@cassandra.apache.org by Apache Jenkins Server <je...@builds.apache.org> on 2021/05/12 17:46:04 UTC
Build complete: Cassandra-trunk #512 [UNSTABLE]
f637198484c74b71429b1bc884d3fe9a86a4a926
-------------------------------------------------------------------------------
Build Cassandra-trunk #512 Unstable
URL: https://ci-cassandra.apache.org/job/Cassandra-trunk/512/
-------------------------------------------------------------------------------
Changes:
[a.penya.garcia] Add CircleCI jobs to repeat specific tests n times
-------------------------------------------------------------------------------
Failed Tests:
5 tests failed.
FAILED: org.apache.cassandra.service.ActiveRepairServiceTest.testRejectWhenPoolFullStrategy-compression
FAILED: org.apache.cassandra.cql3.MemtableSizeTest.testSize
FAILED: dtest-upgrade.upgrade_tests.cql_tests.TestCQLNodes2RF1_Upgrade_current_4_0_x_To_indev_trunk.test_counters
FAILED: cqlshlib.python3.jdk8.no_cython.test.test_unicode.TestCqlshUnicode.test_multiline_input
FAILED: cqlshlib.python3.jdk8.cython.test.test_unicode.TestCqlshUnicode.test_multiline_input
-------------------------------------------------------------------------------
For complete test report and logs see https://nightlies.apache.org/cassandra/Cassandra-trunk/512/