You are viewing a plain text version of this content. The canonical link for it is here.
Posted to issues@bookkeeper.apache.org by Apache Jenkins Server <je...@builds.apache.org> on 2019/08/11 14:08:20 UTC

Build failed in Jenkins: bookkeeper_release_branch_47_java9 #487

See <https://builds.apache.org/job/bookkeeper_release_branch_47_java9/487/display/redirect>

------------------------------------------
[...truncated 751.71 KB...]
2019-08-11T14:05:54.428 [INFO] Downloading from central: https://repo.maven.apache.org/maven2/org/eclipse/jetty/jetty-util/9.4.5.v20170502/jetty-util-9.4.5.v20170502.pom
2019-08-11T14:05:54.440 [INFO] Downloaded from central: https://repo.maven.apache.org/maven2/org/eclipse/jetty/jetty-util/9.4.5.v20170502/jetty-util-9.4.5.v20170502.pom (2.1 kB at 173 kB/s)
2019-08-11T14:05:54.465 [INFO] Downloading from twitter: http://maven.twttr.com/org/eclipse/jetty/jetty-io/9.4.5.v20170502/jetty-io-9.4.5.v20170502.pom
2019-08-11T14:05:54.606 [INFO] Downloading from central: https://repo.maven.apache.org/maven2/org/eclipse/jetty/jetty-io/9.4.5.v20170502/jetty-io-9.4.5.v20170502.pom
2019-08-11T14:05:54.618 [INFO] Downloaded from central: https://repo.maven.apache.org/maven2/org/eclipse/jetty/jetty-io/9.4.5.v20170502/jetty-io-9.4.5.v20170502.pom (1.3 kB at 108 kB/s)
2019-08-11T14:05:54.643 [INFO] Downloading from twitter: http://maven.twttr.com/org/eclipse/jetty/jetty-servlet/9.4.5.v20170502/jetty-servlet-9.4.5.v20170502.pom
2019-08-11T14:05:54.784 [INFO] Downloading from central: https://repo.maven.apache.org/maven2/org/eclipse/jetty/jetty-servlet/9.4.5.v20170502/jetty-servlet-9.4.5.v20170502.pom
2019-08-11T14:05:54.796 [INFO] Downloaded from central: https://repo.maven.apache.org/maven2/org/eclipse/jetty/jetty-servlet/9.4.5.v20170502/jetty-servlet-9.4.5.v20170502.pom (2.1 kB at 177 kB/s)
2019-08-11T14:05:54.820 [INFO] Downloading from twitter: http://maven.twttr.com/org/eclipse/jetty/jetty-security/9.4.5.v20170502/jetty-security-9.4.5.v20170502.pom
2019-08-11T14:05:54.959 [INFO] Downloading from central: https://repo.maven.apache.org/maven2/org/eclipse/jetty/jetty-security/9.4.5.v20170502/jetty-security-9.4.5.v20170502.pom
2019-08-11T14:05:54.972 [INFO] Downloaded from central: https://repo.maven.apache.org/maven2/org/eclipse/jetty/jetty-security/9.4.5.v20170502/jetty-security-9.4.5.v20170502.pom (2.0 kB at 155 kB/s)
2019-08-11T14:05:55.005 [INFO] Downloading from twitter: http://maven.twttr.com/com/twitter/common/stats/0.0.64/stats-0.0.64.jar
2019-08-11T14:05:55.005 [INFO] Downloading from twitter: http://maven.twttr.com/com/twitter/common/stat-registry/0.0.10/stat-registry-0.0.10.jar
2019-08-11T14:05:55.005 [INFO] Downloading from twitter: http://maven.twttr.com/com/twitter/common/stat/0.0.11/stat-0.0.11.jar
2019-08-11T14:05:55.006 [INFO] Downloading from twitter: http://maven.twttr.com/com/twitter/common/stats-provider/0.0.36/stats-provider-0.0.36.jar
2019-08-11T14:05:55.006 [INFO] Downloading from twitter: http://maven.twttr.com/com/twitter/common/application-action/0.0.44/application-action-0.0.44.jar
2019-08-11T14:05:55.230 [INFO] Downloaded from twitter: http://maven.twttr.com/com/twitter/common/stats-provider/0.0.36/stats-provider-0.0.36.jar (1.4 kB at 6.0 kB/s)
2019-08-11T14:05:55.230 [INFO] Downloading from twitter: http://maven.twttr.com/com/twitter/common/net-util/0.0.49/net-util-0.0.49.jar
2019-08-11T14:05:55.230 [INFO] Downloaded from twitter: http://maven.twttr.com/com/twitter/common/stat/0.0.11/stat-0.0.11.jar (769 B at 3.4 kB/s)
2019-08-11T14:05:55.230 [INFO] Downloading from twitter: http://maven.twttr.com/com/twitter/common/base/0.0.57/base-0.0.57.jar
2019-08-11T14:05:55.231 [INFO] Downloaded from twitter: http://maven.twttr.com/com/twitter/common/stat-registry/0.0.10/stat-registry-0.0.10.jar (1.2 kB at 5.1 kB/s)
2019-08-11T14:05:55.231 [INFO] Downloading from twitter: http://maven.twttr.com/com/twitter/common/util-system-mocks/0.0.43/util-system-mocks-0.0.43.jar
2019-08-11T14:05:55.255 [INFO] Downloaded from twitter: http://maven.twttr.com/com/twitter/common/stats/0.0.64/stats-0.0.64.jar (47 kB at 187 kB/s)
2019-08-11T14:05:55.255 [INFO] Downloading from twitter: http://maven.twttr.com/com/twitter/common/collections/0.0.48/collections-0.0.48.jar
2019-08-11T14:05:55.364 [INFO] Downloaded from twitter: http://maven.twttr.com/com/twitter/common/util-system-mocks/0.0.43/util-system-mocks-0.0.43.jar (3.1 kB at 8.7 kB/s)
2019-08-11T14:05:55.364 [INFO] Downloading from twitter: http://maven.twttr.com/com/twitter/common/quantity/0.0.44/quantity-0.0.44.jar
2019-08-11T14:05:55.367 [INFO] Downloaded from twitter: http://maven.twttr.com/com/twitter/common/collections/0.0.48/collections-0.0.48.jar (13 kB at 37 kB/s)
2019-08-11T14:05:55.367 [INFO] Downloading from twitter: http://maven.twttr.com/com/twitter/common/util-sampler/0.0.33/util-sampler-0.0.33.jar
2019-08-11T14:05:55.368 [INFO] Downloaded from twitter: http://maven.twttr.com/com/twitter/common/net-util/0.0.49/net-util-0.0.49.jar (28 kB at 76 kB/s)
2019-08-11T14:05:55.368 [INFO] Downloaded from twitter: http://maven.twttr.com/com/twitter/common/base/0.0.57/base-0.0.57.jar (30 kB at 82 kB/s)
2019-08-11T14:05:55.368 [INFO] Downloading from twitter: http://maven.twttr.com/com/twitter/common/net-http-handlers/0.0.39/net-http-handlers-0.0.39.jar
2019-08-11T14:05:55.368 [INFO] Downloading from twitter: http://maven.twttr.com/com/twitter/common/net-http-handlers-text/0.0.20/net-http-handlers-text-0.0.20.jar
2019-08-11T14:05:55.375 [INFO] Downloading from twitter: http://maven.twttr.com/com/twitter/common/net-http-handlers-string-template/0.0.26/net-http-handlers-string-template-0.0.26.jar
2019-08-11T14:05:55.475 [INFO] Downloaded from twitter: http://maven.twttr.com/com/twitter/common/quantity/0.0.44/quantity-0.0.44.jar (8.7 kB at 19 kB/s)
2019-08-11T14:05:55.475 [INFO] Downloading from twitter: http://maven.twttr.com/com/twitter/common/util-templating/0.0.2/util-templating-0.0.2.jar
2019-08-11T14:05:55.485 [INFO] Downloaded from twitter: http://maven.twttr.com/com/twitter/common/net-http-handlers/0.0.39/net-http-handlers-0.0.39.jar (37 kB at 77 kB/s)
2019-08-11T14:05:55.485 [INFO] Downloading from twitter: http://maven.twttr.com/com/google/code/gson/gson/2.1/gson-2.1.jar
2019-08-11T14:05:56.006 [INFO] Downloaded from twitter: http://maven.twttr.com/com/twitter/common/util-sampler/0.0.33/util-sampler-0.0.33.jar (1.4 kB at 1.4 kB/s)
2019-08-11T14:05:56.006 [INFO] Downloading from twitter: http://maven.twttr.com/com/google/inject/guice/3.0/guice-3.0.jar
2019-08-11T14:05:56.062 [INFO] Downloading from twitter: http://maven.twttr.com/org/antlr/stringtemplate/3.2.1/stringtemplate-3.2.1.jar
2019-08-11T14:05:56.238 [INFO] Downloaded from twitter: http://maven.twttr.com/com/twitter/common/net-http-handlers-text/0.0.20/net-http-handlers-text-0.0.20.jar (1.1 kB at 887 B/s)
2019-08-11T14:05:56.238 [INFO] Downloading from twitter: http://maven.twttr.com/com/twitter/common/stats-time-series/0.0.36/stats-time-series-0.0.36.jar
2019-08-11T14:05:56.693 [INFO] Downloaded from twitter: http://maven.twttr.com/com/twitter/common/util-templating/0.0.2/util-templating-0.0.2.jar (2.2 kB at 1.3 kB/s)
2019-08-11T14:05:56.693 [INFO] Downloading from twitter: http://maven.twttr.com/com/twitter/common/stats-jvm/0.0.33/stats-jvm-0.0.33.jar
2019-08-11T14:05:56.698 [INFO] Downloading from twitter: http://maven.twttr.com/org/eclipse/jetty/jetty-server/9.4.5.v20170502/jetty-server-9.4.5.v20170502.jar
2019-08-11T14:05:57.417 [INFO] Downloading from twitter: http://maven.twttr.com/javax/servlet/javax.servlet-api/3.1.0/javax.servlet-api-3.1.0.jar
2019-08-11T14:05:57.629 [INFO] Downloaded from twitter: http://maven.twttr.com/com/twitter/common/net-http-handlers-string-template/0.0.26/net-http-handlers-string-template-0.0.26.jar (2.2 kB at 834 B/s)
2019-08-11T14:05:57.629 [INFO] Downloading from twitter: http://maven.twttr.com/org/eclipse/jetty/jetty-http/9.4.5.v20170502/jetty-http-9.4.5.v20170502.jar
2019-08-11T14:05:57.654 [INFO] Downloaded from twitter: http://maven.twttr.com/com/twitter/common/stats-time-series/0.0.36/stats-time-series-0.0.36.jar (8.5 kB at 3.2 kB/s)
2019-08-11T14:05:57.654 [INFO] Downloading from twitter: http://maven.twttr.com/org/eclipse/jetty/jetty-util/9.4.5.v20170502/jetty-util-9.4.5.v20170502.jar
2019-08-11T14:05:57.767 [INFO] Downloading from twitter: http://maven.twttr.com/org/eclipse/jetty/jetty-io/9.4.5.v20170502/jetty-io-9.4.5.v20170502.jar
2019-08-11T14:05:58.049 [INFO] Downloading from twitter: http://maven.twttr.com/org/eclipse/jetty/jetty-servlet/9.4.5.v20170502/jetty-servlet-9.4.5.v20170502.jar
2019-08-11T14:05:58.184 [INFO] Downloading from twitter: http://maven.twttr.com/org/eclipse/jetty/jetty-security/9.4.5.v20170502/jetty-security-9.4.5.v20170502.jar
2019-08-11T14:05:58.295 [INFO] Downloaded from twitter: http://maven.twttr.com/com/twitter/common/stats-jvm/0.0.33/stats-jvm-0.0.33.jar (28 kB at 8.4 kB/s)
2019-08-11T14:05:58.434 [INFO] Downloading from central: https://repo.maven.apache.org/maven2/com/twitter/common/application-action/0.0.44/application-action-0.0.44.jar
2019-08-11T14:05:58.435 [INFO] Downloading from central: https://repo.maven.apache.org/maven2/com/google/code/gson/gson/2.1/gson-2.1.jar
2019-08-11T14:05:58.435 [INFO] Downloading from central: https://repo.maven.apache.org/maven2/com/google/inject/guice/3.0/guice-3.0.jar
2019-08-11T14:05:58.435 [INFO] Downloading from central: https://repo.maven.apache.org/maven2/org/antlr/stringtemplate/3.2.1/stringtemplate-3.2.1.jar
2019-08-11T14:05:58.437 [INFO] Downloading from central: https://repo.maven.apache.org/maven2/org/eclipse/jetty/jetty-server/9.4.5.v20170502/jetty-server-9.4.5.v20170502.jar
2019-08-11T14:05:58.474 [INFO] Downloaded from central: https://repo.maven.apache.org/maven2/com/google/code/gson/gson/2.1/gson-2.1.jar (180 kB at 4.5 MB/s)
2019-08-11T14:05:58.474 [INFO] Downloading from central: https://repo.maven.apache.org/maven2/javax/servlet/javax.servlet-api/3.1.0/javax.servlet-api-3.1.0.jar
2019-08-11T14:05:58.477 [INFO] Downloaded from central: https://repo.maven.apache.org/maven2/org/antlr/stringtemplate/3.2.1/stringtemplate-3.2.1.jar (149 kB at 3.5 MB/s)
2019-08-11T14:05:58.477 [INFO] Downloading from central: https://repo.maven.apache.org/maven2/org/eclipse/jetty/jetty-http/9.4.5.v20170502/jetty-http-9.4.5.v20170502.jar
2019-08-11T14:05:58.501 [INFO] Downloaded from central: https://repo.maven.apache.org/maven2/javax/servlet/javax.servlet-api/3.1.0/javax.servlet-api-3.1.0.jar (96 kB at 1.5 MB/s)
2019-08-11T14:05:58.501 [INFO] Downloading from central: https://repo.maven.apache.org/maven2/org/eclipse/jetty/jetty-util/9.4.5.v20170502/jetty-util-9.4.5.v20170502.jar
2019-08-11T14:05:58.504 [INFO] Downloaded from central: https://repo.maven.apache.org/maven2/org/eclipse/jetty/jetty-http/9.4.5.v20170502/jetty-http-9.4.5.v20170502.jar (164 kB at 2.4 MB/s)
2019-08-11T14:05:58.504 [INFO] Downloading from central: https://repo.maven.apache.org/maven2/org/eclipse/jetty/jetty-io/9.4.5.v20170502/jetty-io-9.4.5.v20170502.jar
2019-08-11T14:05:58.523 [INFO] Downloaded from central: https://repo.maven.apache.org/maven2/com/google/inject/guice/3.0/guice-3.0.jar (710 kB at 8.0 MB/s)
2019-08-11T14:05:58.523 [INFO] Downloading from central: https://repo.maven.apache.org/maven2/org/eclipse/jetty/jetty-servlet/9.4.5.v20170502/jetty-servlet-9.4.5.v20170502.jar
2019-08-11T14:05:58.536 [INFO] Downloaded from central: https://repo.maven.apache.org/maven2/org/eclipse/jetty/jetty-server/9.4.5.v20170502/jetty-server-9.4.5.v20170502.jar (579 kB at 5.7 MB/s)
2019-08-11T14:05:58.536 [INFO] Downloading from central: https://repo.maven.apache.org/maven2/org/eclipse/jetty/jetty-security/9.4.5.v20170502/jetty-security-9.4.5.v20170502.jar
2019-08-11T14:05:58.538 [INFO] Downloaded from central: https://repo.maven.apache.org/maven2/org/eclipse/jetty/jetty-io/9.4.5.v20170502/jetty-io-9.4.5.v20170502.jar (128 kB at 1.3 MB/s)
2019-08-11T14:05:58.544 [INFO] Downloaded from central: https://repo.maven.apache.org/maven2/org/eclipse/jetty/jetty-servlet/9.4.5.v20170502/jetty-servlet-9.4.5.v20170502.jar (111 kB at 1.0 MB/s)
2019-08-11T14:05:58.557 [INFO] Downloaded from central: https://repo.maven.apache.org/maven2/org/eclipse/jetty/jetty-security/9.4.5.v20170502/jetty-security-9.4.5.v20170502.jar (92 kB at 771 kB/s)
2019-08-11T14:05:58.562 [INFO] Downloaded from central: https://repo.maven.apache.org/maven2/org/eclipse/jetty/jetty-util/9.4.5.v20170502/jetty-util-9.4.5.v20170502.jar (456 kB at 3.7 MB/s)
[JENKINS] Archiving disabled
[JENKINS] Archiving disabled
[JENKINS] Archiving disabled
[JENKINS] Archiving disabled
[JENKINS] Archiving disabled
[JENKINS] Archiving disabled
[JENKINS] Archiving disabled
[JENKINS] Archiving disabled
[JENKINS] Archiving disabled
[JENKINS] Archiving disabled
[JENKINS] Archiving disabled
[JENKINS] Archiving disabled
[JENKINS] Archiving disabled
[JENKINS] Archiving disabled
[JENKINS] Archiving disabled
[JENKINS] Archiving disabled
[JENKINS] Archiving disabled
[JENKINS] Archiving disabled
[JENKINS] Archiving disabled
[JENKINS] Archiving disabled
[JENKINS] Archiving disabled
[JENKINS] Archiving disabled
[JENKINS] Archiving disabled
[JENKINS] Archiving disabled
[JENKINS] Archiving disabled
[JENKINS] Archiving disabled
[JENKINS] Archiving disabled
[JENKINS] Archiving disabled
[JENKINS] Archiving disabled
[JENKINS] Archiving disabled
[JENKINS] Archiving disabled
[JENKINS] Archiving disabled
[JENKINS] Archiving disabled
[JENKINS] Archiving disabled
[JENKINS] Archiving disabled
[JENKINS] Archiving disabled
[JENKINS] Archiving disabled
[JENKINS] Archiving disabled
[JENKINS] Archiving disabled
[JENKINS] Archiving disabled
[JENKINS] Archiving disabled
[JENKINS] Archiving disabled
[JENKINS] Archiving disabled
[JENKINS] Archiving disabled
[JENKINS] Archiving disabled
[JENKINS] Archiving disabled
[JENKINS] Archiving disabled
[JENKINS] Archiving disabled
[JENKINS] Archiving disabled
[JENKINS] Archiving disabled
[JENKINS] Archiving disabled
[JENKINS] Archiving disabled
[JENKINS] Archiving disabled
[JENKINS] Archiving disabled
[JENKINS] Archiving disabled
[JENKINS] Archiving disabled
[JENKINS] Archiving disabled
[JENKINS] Archiving disabled
[JENKINS] Archiving disabled
[JENKINS] Archiving disabled
[JENKINS] Archiving disabled
[JENKINS] Archiving disabled
[JENKINS] Archiving disabled
[JENKINS] Archiving disabled
[JENKINS] Archiving disabled
[JENKINS] Archiving disabled
[JENKINS] Archiving disabled
[JENKINS] Archiving disabled
[JENKINS] Archiving disabled
[JENKINS] Archiving disabled
[JENKINS] Archiving disabled
[JENKINS] Archiving disabled
[JENKINS] Archiving disabled
[JENKINS] Archiving disabled
[JENKINS] Archiving disabled
[JENKINS] Archiving disabled
[JENKINS] Archiving disabled
2019-08-11T14:06:43.691 [INFO] ------------------------------------------------------------------------
2019-08-11T14:06:43.691 [INFO] Reactor Summary for Apache BookKeeper :: Parent 4.7.4-SNAPSHOT:
2019-08-11T14:06:43.691 [INFO] 
2019-08-11T14:06:43.691 [INFO] Apache BookKeeper :: Parent ........................ SUCCESS [ 14.506 s]
2019-08-11T14:06:43.691 [INFO] Apache BookKeeper :: Build Tools ................... SUCCESS [  5.698 s]
2019-08-11T14:06:43.692 [INFO] Apache BookKeeper :: Circe Checksum Library ........ SUCCESS [01:41 min]
2019-08-11T14:06:43.692 [INFO] Apache BookKeeper :: Stats API ..................... SUCCESS [ 14.897 s]
2019-08-11T14:06:43.692 [INFO] Apache BookKeeper :: Common ........................ SUCCESS [ 36.864 s]
2019-08-11T14:06:43.692 [INFO] Apache BookKeeper :: Protocols ..................... SUCCESS [ 24.292 s]
2019-08-11T14:06:43.692 [INFO] Apache BookKeeper :: Http :: Http Server ........... SUCCESS [ 10.418 s]
2019-08-11T14:06:43.692 [INFO] Apache BookKeeper :: Server ........................ SUCCESS [  01:24 h]
2019-08-11T14:06:43.692 [INFO] Apache BookKeeper :: Tools ......................... SUCCESS [ 39.361 s]
2019-08-11T14:06:43.692 [INFO] Apache BookKeeper :: Benchmark ..................... SUCCESS [01:26 min]
2019-08-11T14:06:43.692 [INFO] Apache BookKeeper :: Stats Providers :: Twitter Finagle Stats SUCCESS [ 11.712 s]
2019-08-11T14:06:43.692 [INFO] Apache BookKeeper :: Stats Providers :: Twitter Science Stats FAILURE [ 15.906 s]
2019-08-11T14:06:43.692 [INFO] Apache BookKeeper :: Stats Providers :: Twitter Ostrich Stats SKIPPED
2019-08-11T14:06:43.692 [INFO] Apache BookKeeper :: Stats Providers :: Codahale Metrics SKIPPED
2019-08-11T14:06:43.693 [INFO] Apache BookKeeper :: Stats Providers :: Prometheus . SKIPPED
2019-08-11T14:06:43.693 [INFO] Apache BookKeeper :: Stats Providers ............... SKIPPED
2019-08-11T14:06:43.693 [INFO] Apache BookKeeper :: Bookkeeper Http :: Twitter Http Server SKIPPED
2019-08-11T14:06:43.693 [INFO] Apache BookKeeper :: Bookkeeper Http :: Vertx Http Server SKIPPED
2019-08-11T14:06:43.693 [INFO] Apache BookKeeper :: Http .......................... SKIPPED
2019-08-11T14:06:43.693 [INFO] Apache BookKeeper :: Shaded :: Parent .............. SKIPPED
2019-08-11T14:06:43.693 [INFO] Apache BookKeeper :: Shaded :: bookkeeper-server-shaded SKIPPED
2019-08-11T14:06:43.693 [INFO] Apache BookKeeper :: Shaded :: bookkeeper-server-tests-shaded SKIPPED
2019-08-11T14:06:43.693 [INFO] Apache BookKeeper :: DistributedLog :: Parent ...... SKIPPED
2019-08-11T14:06:43.693 [INFO] Apache BookKeeper :: DistributedLog :: Common ...... SKIPPED
2019-08-11T14:06:43.693 [INFO] Apache BookKeeper :: DistributedLog :: Protocol .... SKIPPED
2019-08-11T14:06:43.693 [INFO] Apache BookKeeper :: DistributedLog :: Core Library  SKIPPED
2019-08-11T14:06:43.693 [INFO] Apache BookKeeper :: Shaded :: distributedlog-core-shaded SKIPPED
2019-08-11T14:06:43.693 [INFO] Apache BookKeeper :: Tests ......................... SKIPPED
2019-08-11T14:06:43.693 [INFO] Apache BookKeeper :: Tests :: Test Shaded Jars ..... SKIPPED
2019-08-11T14:06:43.693 [INFO] Apache BookKeeper :: Tests :: bookkeeper-server-shaded test SKIPPED
2019-08-11T14:06:43.693 [INFO] Apache BookKeeper :: Tests :: bookkeeper-server-tests-shaded test SKIPPED
2019-08-11T14:06:43.693 [INFO] Apache BookKeeper :: Tests :: distributedlog-core-shaded test SKIPPED
2019-08-11T14:06:43.693 [INFO] Apache BookKeeper :: Tests :: Docker Images ........ SKIPPED
2019-08-11T14:06:43.693 [INFO] Apache BookKeeper :: Tests :: Docker Images :: All Released Versions SKIPPED
2019-08-11T14:06:43.693 [INFO] Apache BookKeeper :: Stream Storage :: Parent ...... SKIPPED
2019-08-11T14:06:43.693 [INFO] Apache BookKeeper :: Stream Storage :: Common Classes for Tests SKIPPED
2019-08-11T14:06:43.693 [INFO] Apache BookKeeper :: Stream Storage :: Common ...... SKIPPED
2019-08-11T14:06:43.693 [INFO] Apache BookKeeper :: Stream Storage :: Proto ....... SKIPPED
2019-08-11T14:06:43.693 [INFO] Apache BookKeeper :: Stream Storage :: Storage :: Parent SKIPPED
2019-08-11T14:06:43.693 [INFO] Apache BookKeeper :: Stream Storage :: Storage :: Api SKIPPED
2019-08-11T14:06:43.693 [INFO] Apache BookKeeper :: Stream Storage :: API ......... SKIPPED
2019-08-11T14:06:43.693 [INFO] Apache BookKeeper :: Stream Storage :: Clients :: Parent SKIPPED
2019-08-11T14:06:43.693 [INFO] Apache BookKeeper :: Stream Storage :: Clients :: Java Client :: Parent SKIPPED
2019-08-11T14:06:43.693 [INFO] Apache BookKeeper :: Stream Storage :: Clients :: Java Client :: Base SKIPPED
2019-08-11T14:06:43.693 [INFO] Apache BookKeeper :: Stream Storage :: State Library SKIPPED
2019-08-11T14:06:43.694 [INFO] Apache BookKeeper :: Stream Storage :: Storage :: Impl SKIPPED
2019-08-11T14:06:43.694 [INFO] Apache BookKeeper :: Stream Storage :: Clients :: Java Client :: KV SKIPPED
2019-08-11T14:06:43.694 [INFO] Apache BookKeeper :: Stream Storage :: Clients :: Java Client SKIPPED
2019-08-11T14:06:43.694 [INFO] Apache BookKeeper :: Stream Storage :: Server ...... SKIPPED
2019-08-11T14:06:43.694 [INFO] Apache BookKeeper :: Dist (Parent) ................. SKIPPED
2019-08-11T14:06:43.694 [INFO] Apache BookKeeper :: Dist (Server) ................. SKIPPED
2019-08-11T14:06:43.694 [INFO] Apache BookKeeper :: Tests :: Docker Images :: All Versions SKIPPED
2019-08-11T14:06:43.694 [INFO] Apache BookKeeper :: Tests :: Docker Images :: Current Version SKIPPED
2019-08-11T14:06:43.694 [INFO] Apache BookKeeper :: Tests :: Utility module for Arquillian based integration tests SKIPPED
2019-08-11T14:06:43.694 [INFO] Apache BookKeeper :: Tests :: Common topologies for Docker based integration tests SKIPPED
2019-08-11T14:06:43.694 [INFO] Apache BookKeeper :: Tests :: Base module for Arquillian based integration tests SKIPPED
2019-08-11T14:06:43.694 [INFO] Apache BookKeeper :: Tests :: Base module for Arquillian based integration tests using groovy SKIPPED
2019-08-11T14:06:43.694 [INFO] Apache BookKeeper :: Tests :: Backward Compatibility SKIPPED
2019-08-11T14:06:43.694 [INFO] Apache BookKeeper :: Tests :: Backward Compatibility :: Test upgrade between all released versions and current version SKIPPED
2019-08-11T14:06:43.694 [INFO] Apache BookKeeper :: Tests :: Backward Compatibility :: Test upgrade between 4.1.0 and current version SKIPPED
2019-08-11T14:06:43.694 [INFO] Apache BookKeeper :: Tests :: Backward Compatibility :: Test compat between old version and new version of hierarchical ledger manager SKIPPED
2019-08-11T14:06:43.694 [INFO] Apache BookKeeper :: Tests :: Backward Compatibility :: Test upgrade between 4.1.0 and current version (with hostname bookie ID) SKIPPED
2019-08-11T14:06:43.694 [INFO] Apache BookKeeper :: Tests :: Backward Compatibility :: Test recovery does not work when password no in metadata SKIPPED
2019-08-11T14:06:43.694 [INFO] Apache BookKeeper :: Tests :: Backward Compatibility :: Test upgrade 4.1.0 to current in cluster with cookies SKIPPED
2019-08-11T14:06:43.694 [INFO] Apache BookKeeper :: Tests :: Backward Compatibility :: Test old clients working on current server SKIPPED
2019-08-11T14:06:43.694 [INFO] Apache BookKeeper :: Tests :: Backward Compatibility :: Test upgrade between yahoo custom version and current SKIPPED
2019-08-11T14:06:43.694 [INFO] Apache BookKeeper :: Tests :: Integration .......... SKIPPED
2019-08-11T14:06:43.694 [INFO] Apache BookKeeper :: Tests :: Integration :: Smoke test SKIPPED
2019-08-11T14:06:43.694 [INFO] Apache BookKeeper :: Tests :: Integration :: Standalone test SKIPPED
2019-08-11T14:06:43.694 [INFO] Apache BookKeeper :: Tests :: Integration :: Cluster test SKIPPED
2019-08-11T14:06:43.694 [INFO] Apache BookKeeper :: Tests :: Bash Scripts Test .... SKIPPED
2019-08-11T14:06:43.694 [INFO] Apache BookKeeper :: Dist (All) .................... SKIPPED
2019-08-11T14:06:43.694 [INFO] Apache BookKeeper :: microbenchmarks ............... SKIPPED
2019-08-11T14:06:43.694 [INFO] Apache BookKeeper :: DistributedLog :: IO :: FileSystem SKIPPED
2019-08-11T14:06:43.694 [INFO] Apache BookKeeper :: DistributedLog :: IO .......... SKIPPED
2019-08-11T14:06:43.694 [INFO] Apache BookKeeper :: Stream Storage :: CLI ......... SKIPPED
2019-08-11T14:06:43.694 [INFO] ------------------------------------------------------------------------
2019-08-11T14:06:43.694 [INFO] BUILD FAILURE
2019-08-11T14:06:43.694 [INFO] ------------------------------------------------------------------------
2019-08-11T14:06:43.695 [INFO] Total time:  01:32 h
2019-08-11T14:06:43.695 [INFO] Finished at: 2019-08-11T14:06:43Z
2019-08-11T14:06:43.695 [INFO] ------------------------------------------------------------------------
Waiting for Jenkins to finish collecting data
2019-08-11T14:06:45.695 [ERROR] Failed to execute goal on project twitter-science-provider: Could not resolve dependencies for project org.apache.bookkeeper.stats:twitter-science-provider:jar:4.7.4-SNAPSHOT: Could not transfer artifact com.twitter.common:application-action:jar:0.0.44 from/to twitter (http://maven.twttr.com): Failed to transfer file http://maven.twttr.com/com/twitter/common/application-action/0.0.44/application-action-0.0.44.jar with status code 503 -> [Help 1]
2019-08-11T14:06:45.695 [ERROR] 
2019-08-11T14:06:45.695 [ERROR] To see the full stack trace of the errors, re-run Maven with the -e switch.
2019-08-11T14:06:45.695 [ERROR] Re-run Maven using the -X switch to enable full debug logging.
2019-08-11T14:06:45.695 [ERROR] 
2019-08-11T14:06:45.695 [ERROR] For more information about the errors and possible solutions, please read the following articles:
2019-08-11T14:06:45.695 [ERROR] [Help 1] http://cwiki.apache.org/confluence/display/MAVEN/DependencyResolutionException
2019-08-11T14:06:45.696 [ERROR] 
2019-08-11T14:06:45.696 [ERROR] After correcting the problems, you can resume the build with the command
2019-08-11T14:06:45.696 [ERROR]   mvn <goals> -rf :twitter-science-provider
channel stopped

Jenkins build is back to stable : bookkeeper_release_branch_47_java9 #489

Posted by Apache Jenkins Server <je...@builds.apache.org>.
See <https://builds.apache.org/job/bookkeeper_release_branch_47_java9/489/display/redirect>


Jenkins build is unstable: bookkeeper_release_branch_47_java9 #488

Posted by Apache Jenkins Server <je...@builds.apache.org>.
See <https://builds.apache.org/job/bookkeeper_release_branch_47_java9/488/display/redirect>