You are viewing a plain text version of this content. The canonical link for it is here.
Posted to dev@zookeeper.apache.org by Apache Jenkins Server <je...@builds.apache.org> on 2014/01/01 10:44:05 UTC

ZooKeeper-trunk-WinVS2008_java - Build # 641 - Still Failing

See https://builds.apache.org/job/ZooKeeper-trunk-WinVS2008_java/641/

###################################################################################
########################## LAST 60 LINES OF THE CONSOLE ###########################
[...truncated 232815 lines...]
    [junit] 2014-01-01 09:43:54,657 [myid:] - INFO  [main:FinalRequestProcessor@442] - shutdown of request processor complete
    [junit] 2014-01-01 09:43:54,657 [myid:] - INFO  [main:FourLetterWordMain@43] - connecting to 127.0.0.1 11221
    [junit] 2014-01-01 09:43:55,411 [myid:] - INFO  [main-SendThread(127.0.0.1:11221):ClientCnxn$SendThread@1008] - Opening socket connection to server 127.0.0.1/127.0.0.1:11221. Will not attempt to authenticate using SASL (unknown error)
    [junit] 2014-01-01 09:43:55,651 [myid:] - INFO  [main:JMXEnv@133] - ensureOnly:[]
    [junit] 2014-01-01 09:43:55,652 [myid:] - INFO  [main:ClientBase@414] - STARTING server
    [junit] 2014-01-01 09:43:55,652 [myid:] - INFO  [main:ZooKeeperServer@149] - Created server with tickTime 3000 minSessionTimeout 6000 maxSessionTimeout 60000 datadir f:\hudson\hudson-slave\workspace\ZooKeeper-trunk-WinVS2008_java\trunk\build\test\tmp\test867188164491889957.junit.dir\version-2 snapdir f:\hudson\hudson-slave\workspace\ZooKeeper-trunk-WinVS2008_java\trunk\build\test\tmp\test867188164491889957.junit.dir\version-2
    [junit] 2014-01-01 09:43:55,653 [myid:] - INFO  [main:NIOServerCnxnFactory@670] - Configuring NIO connection handler with 10s sessionless connection timeout, 1 selector thread(s), 4 worker threads, and 64 kB direct buffers.
    [junit] 2014-01-01 09:43:55,654 [myid:] - INFO  [main:NIOServerCnxnFactory@683] - binding to port 0.0.0.0/0.0.0.0:11221
    [junit] 2014-01-01 09:43:55,654 [myid:] - INFO  [main:FileSnap@83] - Reading snapshot f:\hudson\hudson-slave\workspace\ZooKeeper-trunk-WinVS2008_java\trunk\build\test\tmp\test867188164491889957.junit.dir\version-2\snapshot.b
    [junit] 2014-01-01 09:43:55,656 [myid:] - INFO  [main:FileTxnSnapLog@297] - Snapshotting: 0xb to f:\hudson\hudson-slave\workspace\ZooKeeper-trunk-WinVS2008_java\trunk\build\test\tmp\test867188164491889957.junit.dir\version-2\snapshot.b
    [junit] 2014-01-01 09:43:55,658 [myid:] - INFO  [main:FourLetterWordMain@43] - connecting to 127.0.0.1 11221
    [junit] 2014-01-01 09:43:55,659 [myid:] - INFO  [NIOServerCxnFactory.AcceptThread:0.0.0.0/0.0.0.0:11221:NIOServerCnxnFactory$AcceptThread@296] - Accepted socket connection from /127.0.0.1:59588
    [junit] 2014-01-01 09:43:55,660 [myid:] - INFO  [NIOWorkerThread-1:NIOServerCnxn@835] - Processing stat command from /127.0.0.1:59588
    [junit] 2014-01-01 09:43:55,660 [myid:] - INFO  [NIOWorkerThread-1:NIOServerCnxn$StatCommand@684] - Stat command output
    [junit] 2014-01-01 09:43:55,660 [myid:] - INFO  [NIOWorkerThread-1:NIOServerCnxn@1006] - Closed socket connection for client /127.0.0.1:59588 (no session established for client)
    [junit] 2014-01-01 09:43:55,661 [myid:] - INFO  [main:JMXEnv@133] - ensureOnly:[InMemoryDataTree, StandaloneServer_port]
    [junit] 2014-01-01 09:43:55,662 [myid:] - INFO  [main:JMXEnv@105] - expect:InMemoryDataTree
    [junit] 2014-01-01 09:43:55,662 [myid:] - INFO  [main:JMXEnv@108] - found:InMemoryDataTree org.apache.ZooKeeperService:name0=StandaloneServer_port-1,name1=InMemoryDataTree
    [junit] 2014-01-01 09:43:55,662 [myid:] - INFO  [main:JMXEnv@105] - expect:StandaloneServer_port
    [junit] 2014-01-01 09:43:55,663 [myid:] - INFO  [main:JMXEnv@108] - found:StandaloneServer_port org.apache.ZooKeeperService:name0=StandaloneServer_port-1
    [junit] 2014-01-01 09:43:55,663 [myid:] - INFO  [main:JUnit4ZKTestRunner$LoggedInvokeMethod@55] - Memory used 13181
    [junit] 2014-01-01 09:43:55,663 [myid:] - INFO  [main:JUnit4ZKTestRunner$LoggedInvokeMethod@60] - Number of threads 23
    [junit] 2014-01-01 09:43:55,663 [myid:] - INFO  [main:JUnit4ZKTestRunner$LoggedInvokeMethod@65] - FINISHED TEST METHOD testQuota
    [junit] 2014-01-01 09:43:55,663 [myid:] - INFO  [main:ClientBase@451] - tearDown starting
    [junit] 2014-01-01 09:43:55,899 [myid:] - INFO  [main-SendThread(127.0.0.1:11221):ClientCnxn$SendThread@882] - Socket connection established to 127.0.0.1/127.0.0.1:11221, initiating session
    [junit] 2014-01-01 09:43:55,899 [myid:] - INFO  [NIOServerCxnFactory.AcceptThread:0.0.0.0/0.0.0.0:11221:NIOServerCnxnFactory$AcceptThread@296] - Accepted socket connection from /127.0.0.1:59583
    [junit] 2014-01-01 09:43:55,900 [myid:] - INFO  [NIOWorkerThread-2:ZooKeeperServer@858] - Client attempting to renew session 0x1434d3014df0000 at /127.0.0.1:59583
    [junit] 2014-01-01 09:43:55,901 [myid:] - INFO  [NIOWorkerThread-2:ZooKeeperServer@604] - Established session 0x1434d3014df0000 with negotiated timeout 30000 for client /127.0.0.1:59583
    [junit] 2014-01-01 09:43:55,901 [myid:] - INFO  [main-SendThread(127.0.0.1:11221):ClientCnxn$SendThread@1261] - Session establishment complete on server 127.0.0.1/127.0.0.1:11221, sessionid = 0x1434d3014df0000, negotiated timeout = 30000
    [junit] 2014-01-01 09:43:55,902 [myid:] - INFO  [ProcessThread(sid:0 cport:-1)::PrepRequestProcessor@678] - Processed session termination for sessionid: 0x1434d3014df0000
    [junit] 2014-01-01 09:43:55,902 [myid:] - INFO  [SyncThread:0:FileTxnLog@200] - Creating new log file: log.c
    [junit] 2014-01-01 09:43:55,910 [myid:] - INFO  [main:ZooKeeper@777] - Session: 0x1434d3014df0000 closed
    [junit] 2014-01-01 09:43:55,911 [myid:] - INFO  [main:ClientBase@421] - STOPPING server
    [junit] 2014-01-01 09:43:55,911 [myid:] - INFO  [main-EventThread:ClientCnxn$EventThread@513] - EventThread shut down
    [junit] 2014-01-01 09:43:55,911 [myid:] - INFO  [NIOWorkerThread-1:NIOServerCnxn@1006] - Closed socket connection for client /127.0.0.1:59583 which had sessionid 0x1434d3014df0000
    [junit] 2014-01-01 09:43:55,911 [myid:] - INFO  [ConnnectionExpirer:NIOServerCnxnFactory$ConnectionExpirerThread@583] - ConnnectionExpirerThread interrupted
    [junit] 2014-01-01 09:43:55,911 [myid:] - INFO  [NIOServerCxnFactory.AcceptThread:0.0.0.0/0.0.0.0:11221:NIOServerCnxnFactory$AcceptThread@219] - accept thread exitted run method
    [junit] 2014-01-01 09:43:55,911 [myid:] - INFO  [NIOServerCxnFactory.SelectorThread-0:NIOServerCnxnFactory$SelectorThread@420] - selector thread exitted run method
    [junit] 2014-01-01 09:43:55,912 [myid:] - INFO  [main:ZooKeeperServer@428] - shutting down
    [junit] 2014-01-01 09:43:55,912 [myid:] - INFO  [main:SessionTrackerImpl@183] - Shutting down
    [junit] 2014-01-01 09:43:55,913 [myid:] - INFO  [main:PrepRequestProcessor@972] - Shutting down
    [junit] 2014-01-01 09:43:55,913 [myid:] - INFO  [main:SyncRequestProcessor@190] - Shutting down
    [junit] 2014-01-01 09:43:55,913 [myid:] - INFO  [ProcessThread(sid:0 cport:-1)::PrepRequestProcessor@156] - PrepRequestProcessor exited loop!
    [junit] 2014-01-01 09:43:55,913 [myid:] - INFO  [SyncThread:0:SyncRequestProcessor@168] - SyncRequestProcessor exited!
    [junit] 2014-01-01 09:43:55,913 [myid:] - INFO  [main:FinalRequestProcessor@442] - shutdown of request processor complete
    [junit] 2014-01-01 09:43:55,914 [myid:] - INFO  [main:FourLetterWordMain@43] - connecting to 127.0.0.1 11221
    [junit] 2014-01-01 09:43:56,907 [myid:] - INFO  [main:JMXEnv@133] - ensureOnly:[]
    [junit] 2014-01-01 09:43:56,912 [myid:] - INFO  [main:ZKTestCase$1@61] - SUCCEEDED testQuota
    [junit] 2014-01-01 09:43:56,912 [myid:] - INFO  [main:ZKTestCase$1@56] - FINISHED testQuota
    [junit] Tests run: 1, Failures: 0, Errors: 0, Time elapsed: 4.073 sec

BUILD FAILED
f:\hudson\hudson-slave\workspace\ZooKeeper-trunk-WinVS2008_java\trunk\build.xml:1315: Tests failed!

Total time: 71 minutes 33 seconds
Build step 'Invoke Ant' marked build as failure
Recording test results
Email was triggered for: Failure
Sending email for trigger: Failure



###################################################################################
############################## FAILED TESTS (if any) ##############################
40 tests failed.
REGRESSION:  org.apache.zookeeper.ZooKeeperTest.testDeleteWithInvalidVersionNo

Error Message:
expected [0x1434cef27690001] expected:<1> but was:<0>

Stack Trace:
junit.framework.AssertionFailedError: expected [0x1434cef27690001] expected:<1> but was:<0>
	at org.apache.zookeeper.test.JMXEnv.ensureAll(JMXEnv.java:115)
	at org.apache.zookeeper.test.ClientBase.createClient(ClientBase.java:197)
	at org.apache.zookeeper.test.ClientBase.createClient(ClientBase.java:171)
	at org.apache.zookeeper.test.ClientBase.createClient(ClientBase.java:156)
	at org.apache.zookeeper.test.ClientBase.createClient(ClientBase.java:149)
	at org.apache.zookeeper.ZooKeeperTest.testDeleteWithInvalidVersionNo(ZooKeeperTest.java:336)
	at org.apache.zookeeper.JUnit4ZKTestRunner$LoggedInvokeMethod.evaluate(JUnit4ZKTestRunner.java:52)


REGRESSION:  org.apache.zookeeper.server.InvalidSnapshotTest.testInvalidSnapshot

Error Message:
expected [0x1434cf02da80000] expected:<1> but was:<0>

Stack Trace:
junit.framework.AssertionFailedError: expected [0x1434cf02da80000] expected:<1> but was:<0>
	at org.apache.zookeeper.test.JMXEnv.ensureAll(JMXEnv.java:115)
	at org.apache.zookeeper.test.ClientBase.createClient(ClientBase.java:197)
	at org.apache.zookeeper.test.ClientBase.createClient(ClientBase.java:171)
	at org.apache.zookeeper.test.ClientBase.createClient(ClientBase.java:156)
	at org.apache.zookeeper.test.ClientBase.createClient(ClientBase.java:149)
	at org.apache.zookeeper.server.InvalidSnapshotTest.testInvalidSnapshot(InvalidSnapshotTest.java:53)
	at org.apache.zookeeper.JUnit4ZKTestRunner$LoggedInvokeMethod.evaluate(JUnit4ZKTestRunner.java:52)


REGRESSION:  org.apache.zookeeper.server.NIOServerCnxnTest.testOperationsAfterCnxnClose

Error Message:
expected [0x1434cf03e1c0000] expected:<1> but was:<0>

Stack Trace:
junit.framework.AssertionFailedError: expected [0x1434cf03e1c0000] expected:<1> but was:<0>
	at org.apache.zookeeper.test.JMXEnv.ensureAll(JMXEnv.java:115)
	at org.apache.zookeeper.test.ClientBase.createClient(ClientBase.java:197)
	at org.apache.zookeeper.test.ClientBase.createClient(ClientBase.java:171)
	at org.apache.zookeeper.test.ClientBase.createClient(ClientBase.java:156)
	at org.apache.zookeeper.test.ClientBase.createClient(ClientBase.java:149)
	at org.apache.zookeeper.server.NIOServerCnxnTest.testOperationsAfterCnxnClose(NIOServerCnxnTest.java:43)
	at org.apache.zookeeper.JUnit4ZKTestRunner$LoggedInvokeMethod.evaluate(JUnit4ZKTestRunner.java:52)


REGRESSION:  org.apache.zookeeper.server.NettyServerCnxnTest.testSendCloseSession

Error Message:
expected [0x1434cf05a8b0000] expected:<1> but was:<0>

Stack Trace:
junit.framework.AssertionFailedError: expected [0x1434cf05a8b0000] expected:<1> but was:<0>
	at org.apache.zookeeper.test.JMXEnv.ensureAll(JMXEnv.java:115)
	at org.apache.zookeeper.test.ClientBase.createClient(ClientBase.java:197)
	at org.apache.zookeeper.test.ClientBase.createClient(ClientBase.java:171)
	at org.apache.zookeeper.test.ClientBase.createClient(ClientBase.java:156)
	at org.apache.zookeeper.test.ClientBase.createClient(ClientBase.java:149)
	at org.apache.zookeeper.server.NettyServerCnxnTest.testSendCloseSession(NettyServerCnxnTest.java:81)
	at org.apache.zookeeper.JUnit4ZKTestRunner$LoggedInvokeMethod.evaluate(JUnit4ZKTestRunner.java:52)


REGRESSION:  org.apache.zookeeper.server.ZxidRolloverTest.testRolloverThenLeaderRestart

Error Message:
waiting for server up

Stack Trace:
java.lang.AssertionError: waiting for server up
	at org.apache.zookeeper.test.QuorumUtil.startAll(QuorumUtil.java:151)
	at org.apache.zookeeper.server.ZxidRolloverTest.startAll(ZxidRolloverTest.java:149)
	at org.apache.zookeeper.server.ZxidRolloverTest.setUp(ZxidRolloverTest.java:64)


REGRESSION:  org.apache.zookeeper.server.quorum.QuorumPeerMainTest.testBadPeerAddressInQuorum

Error Message:
waiting for server 1 down

Stack Trace:
junit.framework.AssertionFailedError: waiting for server 1 down
	at org.apache.zookeeper.server.quorum.QuorumPeerMainTest.testBadPeerAddressInQuorum(QuorumPeerMainTest.java:418)
	at org.apache.zookeeper.JUnit4ZKTestRunner$LoggedInvokeMethod.evaluate(JUnit4ZKTestRunner.java:52)


REGRESSION:  org.apache.zookeeper.server.quorum.QuorumPeerMainTest.testEarlyLeaderAbandonment

Error Message:
Waiting too long

Stack Trace:
java.lang.RuntimeException: Waiting too long
	at org.apache.zookeeper.server.quorum.QuorumPeerMainTest.waitForAll(QuorumPeerMainTest.java:327)
	at org.apache.zookeeper.server.quorum.QuorumPeerMainTest.testEarlyLeaderAbandonment(QuorumPeerMainTest.java:133)
	at org.apache.zookeeper.JUnit4ZKTestRunner$LoggedInvokeMethod.evaluate(JUnit4ZKTestRunner.java:52)


REGRESSION:  org.apache.zookeeper.test.AsyncOpsTest.testAsyncDeleteFailure_NoNode

Error Message:
null

Stack Trace:
java.lang.NullPointerException
	at org.apache.zookeeper.test.AsyncOpsTest.tearDown(AsyncOpsTest.java:57)


REGRESSION:  org.apache.zookeeper.test.AsyncOpsTest.testAsyncSetACLFailure_NoNode

Error Message:
expected:<0> but was:<2>

Stack Trace:
junit.framework.AssertionFailedError: expected:<0> but was:<2>
	at org.apache.zookeeper.test.JMXEnv.ensureOnly(JMXEnv.java:138)
	at org.apache.zookeeper.test.ClientBase.stopServer(ClientBase.java:425)
	at org.apache.zookeeper.test.ClientBase.tearDown(ClientBase.java:455)
	at org.apache.zookeeper.test.AsyncOpsTest.tearDown(AsyncOpsTest.java:59)


REGRESSION:  org.apache.zookeeper.test.AsyncOpsTest.testAsyncSetDataFailure_NoNode

Error Message:
expected:<0> but was:<2>

Stack Trace:
junit.framework.AssertionFailedError: expected:<0> but was:<2>
	at org.apache.zookeeper.test.JMXEnv.ensureOnly(JMXEnv.java:138)
	at org.apache.zookeeper.test.ClientBase.stopServer(ClientBase.java:425)
	at org.apache.zookeeper.test.ClientBase.tearDown(ClientBase.java:455)
	at org.apache.zookeeper.test.AsyncOpsTest.tearDown(AsyncOpsTest.java:59)


REGRESSION:  org.apache.zookeeper.test.AsyncOpsTest.testAsyncExistsFailure_NoNode

Error Message:
expected:<0> but was:<2>

Stack Trace:
junit.framework.AssertionFailedError: expected:<0> but was:<2>
	at org.apache.zookeeper.test.JMXEnv.ensureOnly(JMXEnv.java:138)
	at org.apache.zookeeper.test.ClientBase.stopServer(ClientBase.java:425)
	at org.apache.zookeeper.test.ClientBase.tearDown(ClientBase.java:455)
	at org.apache.zookeeper.test.AsyncOpsTest.tearDown(AsyncOpsTest.java:59)


REGRESSION:  org.apache.zookeeper.test.AsyncOpsTest.testAsyncGetChildrenFailure_NoNode

Error Message:
expected:<0> but was:<2>

Stack Trace:
junit.framework.AssertionFailedError: expected:<0> but was:<2>
	at org.apache.zookeeper.test.JMXEnv.ensureOnly(JMXEnv.java:138)
	at org.apache.zookeeper.test.ClientBase.stopServer(ClientBase.java:425)
	at org.apache.zookeeper.test.ClientBase.tearDown(ClientBase.java:455)
	at org.apache.zookeeper.test.AsyncOpsTest.tearDown(AsyncOpsTest.java:59)


REGRESSION:  org.apache.zookeeper.test.AsyncOpsTest.testAsyncGetChildren2Failure_NoNode

Error Message:
expected:<0> but was:<2>

Stack Trace:
junit.framework.AssertionFailedError: expected:<0> but was:<2>
	at org.apache.zookeeper.test.JMXEnv.ensureOnly(JMXEnv.java:138)
	at org.apache.zookeeper.test.ClientBase.stopServer(ClientBase.java:425)
	at org.apache.zookeeper.test.ClientBase.tearDown(ClientBase.java:455)
	at org.apache.zookeeper.test.AsyncOpsTest.tearDown(AsyncOpsTest.java:59)


REGRESSION:  org.apache.zookeeper.test.AsyncOpsTest.testAsyncGetDataFailure_NoNode

Error Message:
expected:<0> but was:<2>

Stack Trace:
junit.framework.AssertionFailedError: expected:<0> but was:<2>
	at org.apache.zookeeper.test.JMXEnv.ensureOnly(JMXEnv.java:138)
	at org.apache.zookeeper.test.ClientBase.stopServer(ClientBase.java:425)
	at org.apache.zookeeper.test.ClientBase.tearDown(ClientBase.java:455)
	at org.apache.zookeeper.test.AsyncOpsTest.tearDown(AsyncOpsTest.java:59)


REGRESSION:  org.apache.zookeeper.test.AsyncOpsTest.testAsyncCreateThree

Error Message:
expected:<0> but was:<2>

Stack Trace:
junit.framework.AssertionFailedError: expected:<0> but was:<2>
	at org.apache.zookeeper.test.JMXEnv.ensureOnly(JMXEnv.java:138)
	at org.apache.zookeeper.test.ClientBase.stopServer(ClientBase.java:425)
	at org.apache.zookeeper.test.ClientBase.tearDown(ClientBase.java:455)
	at org.apache.zookeeper.test.AsyncOpsTest.tearDown(AsyncOpsTest.java:59)


REGRESSION:  org.apache.zookeeper.test.AsyncOpsTest.testAsyncCreate2

Error Message:
expected:<0> but was:<2>

Stack Trace:
junit.framework.AssertionFailedError: expected:<0> but was:<2>
	at org.apache.zookeeper.test.JMXEnv.ensureOnly(JMXEnv.java:138)
	at org.apache.zookeeper.test.ClientBase.stopServer(ClientBase.java:425)
	at org.apache.zookeeper.test.ClientBase.tearDown(ClientBase.java:455)
	at org.apache.zookeeper.test.AsyncOpsTest.tearDown(AsyncOpsTest.java:59)


REGRESSION:  org.apache.zookeeper.test.AsyncOpsTest.testAsyncDelete

Error Message:
expected:<0> but was:<2>

Stack Trace:
junit.framework.AssertionFailedError: expected:<0> but was:<2>
	at org.apache.zookeeper.test.JMXEnv.ensureOnly(JMXEnv.java:138)
	at org.apache.zookeeper.test.ClientBase.stopServer(ClientBase.java:425)
	at org.apache.zookeeper.test.ClientBase.tearDown(ClientBase.java:455)
	at org.apache.zookeeper.test.AsyncOpsTest.tearDown(AsyncOpsTest.java:59)


REGRESSION:  org.apache.zookeeper.test.AsyncOpsTest.testAsyncCreate

Error Message:
expected:<0> but was:<2>

Stack Trace:
junit.framework.AssertionFailedError: expected:<0> but was:<2>
	at org.apache.zookeeper.test.JMXEnv.ensureOnly(JMXEnv.java:138)
	at org.apache.zookeeper.test.ClientBase.stopServer(ClientBase.java:425)
	at org.apache.zookeeper.test.ClientBase.tearDown(ClientBase.java:455)
	at org.apache.zookeeper.test.AsyncOpsTest.tearDown(AsyncOpsTest.java:59)


REGRESSION:  org.apache.zookeeper.test.AsyncOpsTest.testAsyncSync

Error Message:
expected:<0> but was:<2>

Stack Trace:
junit.framework.AssertionFailedError: expected:<0> but was:<2>
	at org.apache.zookeeper.test.JMXEnv.ensureOnly(JMXEnv.java:138)
	at org.apache.zookeeper.test.ClientBase.stopServer(ClientBase.java:425)
	at org.apache.zookeeper.test.ClientBase.tearDown(ClientBase.java:455)
	at org.apache.zookeeper.test.AsyncOpsTest.tearDown(AsyncOpsTest.java:59)


REGRESSION:  org.apache.zookeeper.test.AsyncOpsTest.testAsyncSetACL

Error Message:
expected:<0> but was:<2>

Stack Trace:
junit.framework.AssertionFailedError: expected:<0> but was:<2>
	at org.apache.zookeeper.test.JMXEnv.ensureOnly(JMXEnv.java:138)
	at org.apache.zookeeper.test.ClientBase.stopServer(ClientBase.java:425)
	at org.apache.zookeeper.test.ClientBase.tearDown(ClientBase.java:455)
	at org.apache.zookeeper.test.AsyncOpsTest.tearDown(AsyncOpsTest.java:59)


REGRESSION:  org.apache.zookeeper.test.AsyncOpsTest.testAsyncSetData

Error Message:
expected:<0> but was:<2>

Stack Trace:
junit.framework.AssertionFailedError: expected:<0> but was:<2>
	at org.apache.zookeeper.test.JMXEnv.ensureOnly(JMXEnv.java:138)
	at org.apache.zookeeper.test.ClientBase.stopServer(ClientBase.java:425)
	at org.apache.zookeeper.test.ClientBase.tearDown(ClientBase.java:455)
	at org.apache.zookeeper.test.AsyncOpsTest.tearDown(AsyncOpsTest.java:59)


REGRESSION:  org.apache.zookeeper.test.AsyncOpsTest.testAsyncExists

Error Message:
expected:<0> but was:<2>

Stack Trace:
junit.framework.AssertionFailedError: expected:<0> but was:<2>
	at org.apache.zookeeper.test.JMXEnv.ensureOnly(JMXEnv.java:138)
	at org.apache.zookeeper.test.ClientBase.stopServer(ClientBase.java:425)
	at org.apache.zookeeper.test.ClientBase.tearDown(ClientBase.java:455)
	at org.apache.zookeeper.test.AsyncOpsTest.tearDown(AsyncOpsTest.java:59)


REGRESSION:  org.apache.zookeeper.test.AsyncOpsTest.testAsyncGetACL

Error Message:
expected:<0> but was:<2>

Stack Trace:
junit.framework.AssertionFailedError: expected:<0> but was:<2>
	at org.apache.zookeeper.test.JMXEnv.ensureOnly(JMXEnv.java:138)
	at org.apache.zookeeper.test.ClientBase.stopServer(ClientBase.java:425)
	at org.apache.zookeeper.test.ClientBase.tearDown(ClientBase.java:455)
	at org.apache.zookeeper.test.AsyncOpsTest.tearDown(AsyncOpsTest.java:59)


REGRESSION:  org.apache.zookeeper.test.AsyncOpsTest.testAsyncGetChildrenEmpty

Error Message:
expected:<0> but was:<2>

Stack Trace:
junit.framework.AssertionFailedError: expected:<0> but was:<2>
	at org.apache.zookeeper.test.JMXEnv.ensureOnly(JMXEnv.java:138)
	at org.apache.zookeeper.test.ClientBase.stopServer(ClientBase.java:425)
	at org.apache.zookeeper.test.ClientBase.tearDown(ClientBase.java:455)
	at org.apache.zookeeper.test.AsyncOpsTest.tearDown(AsyncOpsTest.java:59)


REGRESSION:  org.apache.zookeeper.test.AsyncOpsTest.testAsyncGetChildrenSingle

Error Message:
expected:<0> but was:<2>

Stack Trace:
junit.framework.AssertionFailedError: expected:<0> but was:<2>
	at org.apache.zookeeper.test.JMXEnv.ensureOnly(JMXEnv.java:138)
	at org.apache.zookeeper.test.ClientBase.stopServer(ClientBase.java:425)
	at org.apache.zookeeper.test.ClientBase.tearDown(ClientBase.java:455)
	at org.apache.zookeeper.test.AsyncOpsTest.tearDown(AsyncOpsTest.java:59)


REGRESSION:  org.apache.zookeeper.test.AsyncOpsTest.testAsyncGetChildrenTwo

Error Message:
expected:<0> but was:<2>

Stack Trace:
junit.framework.AssertionFailedError: expected:<0> but was:<2>
	at org.apache.zookeeper.test.JMXEnv.ensureOnly(JMXEnv.java:138)
	at org.apache.zookeeper.test.ClientBase.stopServer(ClientBase.java:425)
	at org.apache.zookeeper.test.ClientBase.tearDown(ClientBase.java:455)
	at org.apache.zookeeper.test.AsyncOpsTest.tearDown(AsyncOpsTest.java:59)


REGRESSION:  org.apache.zookeeper.test.AsyncOpsTest.testAsyncGetChildren2Empty

Error Message:
expected:<0> but was:<2>

Stack Trace:
junit.framework.AssertionFailedError: expected:<0> but was:<2>
	at org.apache.zookeeper.test.JMXEnv.ensureOnly(JMXEnv.java:138)
	at org.apache.zookeeper.test.ClientBase.stopServer(ClientBase.java:425)
	at org.apache.zookeeper.test.ClientBase.tearDown(ClientBase.java:455)
	at org.apache.zookeeper.test.AsyncOpsTest.tearDown(AsyncOpsTest.java:59)


REGRESSION:  org.apache.zookeeper.test.AsyncOpsTest.testAsyncGetChildren2Single

Error Message:
expected:<0> but was:<2>

Stack Trace:
junit.framework.AssertionFailedError: expected:<0> but was:<2>
	at org.apache.zookeeper.test.JMXEnv.ensureOnly(JMXEnv.java:138)
	at org.apache.zookeeper.test.ClientBase.stopServer(ClientBase.java:425)
	at org.apache.zookeeper.test.ClientBase.tearDown(ClientBase.java:455)
	at org.apache.zookeeper.test.AsyncOpsTest.tearDown(AsyncOpsTest.java:59)


REGRESSION:  org.apache.zookeeper.test.AsyncOpsTest.testAsyncGetChildren2Two

Error Message:
expected:<0> but was:<2>

Stack Trace:
junit.framework.AssertionFailedError: expected:<0> but was:<2>
	at org.apache.zookeeper.test.JMXEnv.ensureOnly(JMXEnv.java:138)
	at org.apache.zookeeper.test.ClientBase.stopServer(ClientBase.java:425)
	at org.apache.zookeeper.test.ClientBase.tearDown(ClientBase.java:455)
	at org.apache.zookeeper.test.AsyncOpsTest.tearDown(AsyncOpsTest.java:59)


REGRESSION:  org.apache.zookeeper.test.AsyncOpsTest.testAsyncGetData

Error Message:
expected:<0> but was:<2>

Stack Trace:
junit.framework.AssertionFailedError: expected:<0> but was:<2>
	at org.apache.zookeeper.test.JMXEnv.ensureOnly(JMXEnv.java:138)
	at org.apache.zookeeper.test.ClientBase.stopServer(ClientBase.java:425)
	at org.apache.zookeeper.test.ClientBase.tearDown(ClientBase.java:455)
	at org.apache.zookeeper.test.AsyncOpsTest.tearDown(AsyncOpsTest.java:59)


REGRESSION:  org.apache.zookeeper.test.DuplicateLocalSessionUpgradeTest.testLocalSessionUpgradeOnFollower

Error Message:
waiting for server up

Stack Trace:
junit.framework.AssertionFailedError: waiting for server up
	at org.apache.zookeeper.test.QuorumBase.startServers(QuorumBase.java:221)
	at org.apache.zookeeper.test.QuorumBase.setUp(QuorumBase.java:118)
	at org.apache.zookeeper.test.QuorumBase.setUp(QuorumBase.java:76)
	at org.apache.zookeeper.test.DuplicateLocalSessionUpgradeTest.setUp(DuplicateLocalSessionUpgradeTest.java:53)


REGRESSION:  org.apache.zookeeper.test.FourLetterWordsQuorumTest.testFourLetterWords

Error Message:
Connection reset

Stack Trace:
java.net.SocketException: Connection reset
	at java.net.SocketInputStream.read(SocketInputStream.java:189)
	at java.net.SocketInputStream.read(SocketInputStream.java:121)
	at sun.nio.cs.StreamDecoder.readBytes(StreamDecoder.java:283)
	at sun.nio.cs.StreamDecoder.implRead(StreamDecoder.java:325)
	at sun.nio.cs.StreamDecoder.read(StreamDecoder.java:177)
	at java.io.InputStreamReader.read(InputStreamReader.java:184)
	at java.io.BufferedReader.fill(BufferedReader.java:154)
	at java.io.BufferedReader.readLine(BufferedReader.java:317)
	at java.io.BufferedReader.readLine(BufferedReader.java:382)
	at org.apache.zookeeper.client.FourLetterWordMain.send4LetterWord(FourLetterWordMain.java:58)
	at org.apache.zookeeper.test.FourLetterWordsQuorumTest.verify(FourLetterWordsQuorumTest.java:103)
	at org.apache.zookeeper.test.FourLetterWordsQuorumTest.testFourLetterWords(FourLetterWordsQuorumTest.java:40)
	at org.apache.zookeeper.JUnit4ZKTestRunner$LoggedInvokeMethod.evaluate(JUnit4ZKTestRunner.java:52)


REGRESSION:  org.apache.zookeeper.test.ObserverLETest.testLEWithObserver

Error Message:
expected [InMemoryDataTree, name0=ReplicatedServer_id1,name1=replica.1,name2=, name0=ReplicatedServer_id2,name1=replica.2,name2=, name0=ReplicatedServer_id3,name1=replica.3,name2=, name0=ReplicatedServer_id4,name1=replica.4,name2=, name0=ReplicatedServer_id5,name1=replica.5,name2=, name0=ReplicatedServer_id1,name1=replica.1, name0=ReplicatedServer_id1,name1=replica.2, name0=ReplicatedServer_id1,name1=replica.3, name0=ReplicatedServer_id1,name1=replica.4, name0=ReplicatedServer_id1,name1=replica.5, name0=ReplicatedServer_id2,name1=replica.1, name0=ReplicatedServer_id2,name1=replica.2, name0=ReplicatedServer_id2,name1=replica.3, name0=ReplicatedServer_id2,name1=replica.4, name0=ReplicatedServer_id2,name1=replica.5, name0=ReplicatedServer_id3,name1=replica.1, name0=ReplicatedServer_id3,name1=replica.2, name0=ReplicatedServer_id3,name1=replica.3, name0=ReplicatedServer_id3,name1=replica.4, name0=ReplicatedServer_id3,name1=replica.5, name0=ReplicatedServer_id4,name1=replica.1, name0=ReplicatedServer_id4,name1=replica.2, name0=ReplicatedServer_id4,name1=replica.3, name0=ReplicatedServer_id4,name1=replica.4, name0=ReplicatedServer_id4,name1=replica.5, name0=ReplicatedServer_id5,name1=replica.1, name0=ReplicatedServer_id5,name1=replica.2, name0=ReplicatedServer_id5,name1=replica.3, name0=ReplicatedServer_id5,name1=replica.4, name0=ReplicatedServer_id5,name1=replica.5, name0=ReplicatedServer_id1, name0=ReplicatedServer_id2, name0=ReplicatedServer_id3, name0=ReplicatedServer_id4, name0=ReplicatedServer_id5] expected:<36> but was:<35>

Stack Trace:
junit.framework.AssertionFailedError: expected [InMemoryDataTree, name0=ReplicatedServer_id1,name1=replica.1,name2=, name0=ReplicatedServer_id2,name1=replica.2,name2=, name0=ReplicatedServer_id3,name1=replica.3,name2=, name0=ReplicatedServer_id4,name1=replica.4,name2=, name0=ReplicatedServer_id5,name1=replica.5,name2=, name0=ReplicatedServer_id1,name1=replica.1, name0=ReplicatedServer_id1,name1=replica.2, name0=ReplicatedServer_id1,name1=replica.3, name0=ReplicatedServer_id1,name1=replica.4, name0=ReplicatedServer_id1,name1=replica.5, name0=ReplicatedServer_id2,name1=replica.1, name0=ReplicatedServer_id2,name1=replica.2, name0=ReplicatedServer_id2,name1=replica.3, name0=ReplicatedServer_id2,name1=replica.4, name0=ReplicatedServer_id2,name1=replica.5, name0=ReplicatedServer_id3,name1=replica.1, name0=ReplicatedServer_id3,name1=replica.2, name0=ReplicatedServer_id3,name1=replica.3, name0=ReplicatedServer_id3,name1=replica.4, name0=ReplicatedServer_id3,name1=replica.5, name0=ReplicatedServer_id4,name1=replica.1, name0=ReplicatedServer_id4,name1=replica.2, name0=ReplicatedServer_id4,name1=replica.3, name0=ReplicatedServer_id4,name1=replica.4, name0=ReplicatedServer_id4,name1=replica.5, name0=ReplicatedServer_id5,name1=replica.1, name0=ReplicatedServer_id5,name1=replica.2, name0=ReplicatedServer_id5,name1=replica.3, name0=ReplicatedServer_id5,name1=replica.4, name0=ReplicatedServer_id5,name1=replica.5, name0=ReplicatedServer_id1, name0=ReplicatedServer_id2, name0=ReplicatedServer_id3, name0=ReplicatedServer_id4, name0=ReplicatedServer_id5] expected:<36> but was:<35>
	at org.apache.zookeeper.test.JMXEnv.ensureAll(JMXEnv.java:115)
	at org.apache.zookeeper.test.QuorumBase.startServers(QuorumBase.java:247)
	at org.apache.zookeeper.test.QuorumBase.setUp(QuorumBase.java:118)
	at org.apache.zookeeper.test.ObserverLETest.establishThreeParticipantOneObserverEnsemble(ObserverLETest.java:37)


REGRESSION:  org.apache.zookeeper.test.ReconfigTest.testInitialConfigHasPositiveVersion

Error Message:
Waiting for server down

Stack Trace:
junit.framework.AssertionFailedError: Waiting for server down
	at org.apache.zookeeper.test.QuorumUtil.shutdownAll(QuorumUtil.java:239)
	at org.apache.zookeeper.test.QuorumUtil.startAll(QuorumUtil.java:143)
	at org.apache.zookeeper.test.ReconfigTest.testInitialConfigHasPositiveVersion(ReconfigTest.java:704)
	at org.apache.zookeeper.JUnit4ZKTestRunner$LoggedInvokeMethod.evaluate(JUnit4ZKTestRunner.java:52)


REGRESSION:  org.apache.zookeeper.test.ReconfigTest.testBulkReconfig

Error Message:
client could not connect to reestablished quorum: giving up after 30+ seconds.

Stack Trace:
junit.framework.AssertionFailedError: client could not connect to reestablished quorum: giving up after 30+ seconds.
	at org.apache.zookeeper.test.ReconfigTest.reconfig(ReconfigTest.java:65)
	at org.apache.zookeeper.test.ReconfigTest.testBulkReconfig(ReconfigTest.java:379)
	at org.apache.zookeeper.JUnit4ZKTestRunner$LoggedInvokeMethod.evaluate(JUnit4ZKTestRunner.java:52)


REGRESSION:  org.apache.zookeeper.test.TruncateTest.testTruncate

Error Message:
delete f:\hudson\hudson-slave\workspace\ZooKeeper-trunk-WinVS2008_java\trunk\build\test\tmp\test6723120558622535505.junit.dir\version-2\log.100000001

Stack Trace:
junit.framework.AssertionFailedError: delete f:\hudson\hudson-slave\workspace\ZooKeeper-trunk-WinVS2008_java\trunk\build\test\tmp\test6723120558622535505.junit.dir\version-2\log.100000001
	at org.apache.zookeeper.test.ClientBase.recursiveDelete(ClientBase.java:493)
	at org.apache.zookeeper.test.ClientBase.recursiveDelete(ClientBase.java:493)
	at org.apache.zookeeper.test.TruncateTest.tearDown(TruncateTest.java:68)


FAILED:  org.apache.zookeeper.test.QuorumTest.testNoLogBeforeLeaderEstablishment

Error Message:
Not following

Stack Trace:
junit.framework.AssertionFailedError: Not following
	at org.apache.zookeeper.test.QuorumTest.testNoLogBeforeLeaderEstablishment(QuorumTest.java:408)
	at org.apache.zookeeper.JUnit4ZKTestRunner$LoggedInvokeMethod.evaluate(JUnit4ZKTestRunner.java:52)


FAILED:  org.apache.zookeeper.test.StaticHostProviderTest.testUpdateClientMigrateOrNot

Error Message:
Timeout occurred. Please note the time in the report does not reflect the time until the timeout.

Stack Trace:
junit.framework.AssertionFailedError: Timeout occurred. Please note the time in the report does not reflect the time until the timeout.


FAILED:  org.apache.zookeeper.test.ServerCnxnTest.testServerCnxnExpiry

Error Message:
Software caused connection abort: recv failed

Stack Trace:
java.net.SocketException: Software caused connection abort: recv failed
	at java.net.SocketInputStream.socketRead0(Native Method)
	at java.net.SocketInputStream.read(SocketInputStream.java:150)
	at java.net.SocketInputStream.read(SocketInputStream.java:121)
	at sun.nio.cs.StreamDecoder.readBytes(StreamDecoder.java:283)
	at sun.nio.cs.StreamDecoder.implRead(StreamDecoder.java:325)
	at sun.nio.cs.StreamDecoder.read(StreamDecoder.java:177)
	at java.io.InputStreamReader.read(InputStreamReader.java:184)
	at java.io.BufferedReader.fill(BufferedReader.java:154)
	at java.io.BufferedReader.readLine(BufferedReader.java:317)
	at java.io.BufferedReader.readLine(BufferedReader.java:382)
	at org.apache.zookeeper.test.ServerCnxnTest.send4LetterWord(ServerCnxnTest.java:105)
	at org.apache.zookeeper.test.ServerCnxnTest.sendRequest(ServerCnxnTest.java:77)
	at org.apache.zookeeper.test.ServerCnxnTest.testServerCnxnExpiry(ServerCnxnTest.java:64)
	at org.apache.zookeeper.JUnit4ZKTestRunner$LoggedInvokeMethod.evaluate(JUnit4ZKTestRunner.java:52)


FAILED:  org.apache.zookeeper.server.util.DynamicConfigBCTest.dynamicConfigBackwardCompatibilityTest

Error Message:
null

Stack Trace:
junit.framework.AssertionFailedError
	at org.apache.zookeeper.server.util.DynamicConfigBCTest.dynamicConfigBackwardCompatibilityTest(DynamicConfigBCTest.java:141)