You are viewing a plain text version of this content. The canonical link for it is here.
Posted to ci@bigtop.apache.org by Apache Jenkins Server <je...@builds.apache.org> on 2014/09/09 05:31:58 UTC

Build failed in Jenkins: Bigtop-trunk-test-execution #1334

See <https://builds.apache.org/job/Bigtop-trunk-test-execution/1334/changes>

Changes:

[cos] Preparing for release 0.8.0

[cos] Bumping version on the branch to 0.8.0

[cos] Moving the version to 0.9.0-SNAPSHOT

------------------------------------------
Started by an SCM change
Building remotely on H10 (Ubuntu ubuntu) in workspace <https://builds.apache.org/job/Bigtop-trunk-test-execution/ws/>
 > git rev-parse --is-inside-work-tree
Fetching changes from the remote Git repository
 > git config remote.origin.url https://git-wip-us.apache.org/repos/asf/bigtop.git
Fetching upstream changes from https://git-wip-us.apache.org/repos/asf/bigtop.git
 > git --version
 > git fetch --tags --progress https://git-wip-us.apache.org/repos/asf/bigtop.git +refs/heads/*:refs/remotes/origin/*
 > git rev-parse origin/master^{commit}
Checking out Revision 885806383eede6f3801d757a74c7b517e0b7d1df (origin/master)
 > git config core.sparsecheckout
 > git checkout -f 885806383eede6f3801d757a74c7b517e0b7d1df
 > git rev-list 1b7dbd8fc26c90b39ec52ea5371a0ef52d3b4129
[Bigtop-trunk-test-execution] $ /home/jenkins/tools/maven/apache-maven-3.0.4/bin/mvn -f bigtop-tests/test-execution/pom.xml clean
[INFO] Scanning for projects...
[INFO] ------------------------------------------------------------------------
[INFO] Reactor Build Order:
[INFO] 
[INFO] stacks-validation-common
[INFO] smoke-tests-conf
[INFO] packagesmokes
[INFO] bigtop-smokes
[INFO]                                                                         
[INFO] ------------------------------------------------------------------------
[INFO] Building stacks-validation-common 0.9.0-SNAPSHOT
[INFO] ------------------------------------------------------------------------
[INFO] 
[INFO] --- maven-clean-plugin:2.4.1:clean (default-clean) @ stacks-common ---
[INFO] Deleting <https://builds.apache.org/job/Bigtop-trunk-test-execution/ws/bigtop-tests/test-execution/common/target>
[INFO]                                                                         
[INFO] ------------------------------------------------------------------------
[INFO] Building smoke-tests-conf 0.9.0-SNAPSHOT
[INFO] ------------------------------------------------------------------------
[INFO] 
[INFO] --- maven-clean-plugin:2.4.1:clean (default-clean) @ smoke-tests-conf ---
[INFO] Deleting <https://builds.apache.org/job/Bigtop-trunk-test-execution/ws/bigtop-tests/test-execution/conf/target>
[INFO]                                                                         
[INFO] ------------------------------------------------------------------------
[INFO] Building packagesmokes 0.9.0-SNAPSHOT
[INFO] ------------------------------------------------------------------------
[INFO] 
[INFO] --- maven-clean-plugin:2.4.1:clean (default-clean) @ package-smoke-execution ---
[INFO] Deleting <https://builds.apache.org/job/Bigtop-trunk-test-execution/ws/bigtop-tests/test-execution/package/target>
[INFO]                                                                         
[INFO] ------------------------------------------------------------------------
[INFO] Building bigtop-smokes 0.9.0-SNAPSHOT
[INFO] ------------------------------------------------------------------------
[INFO] 
[INFO] --- maven-clean-plugin:2.4.1:clean (default-clean) @ bigtop-test-execution ---
[INFO] Deleting <https://builds.apache.org/job/Bigtop-trunk-test-execution/ws/bigtop-tests/test-execution/target>
[INFO] ------------------------------------------------------------------------
[INFO] Reactor Summary:
[INFO] 
[INFO] stacks-validation-common .......................... SUCCESS [0.247s]
[INFO] smoke-tests-conf .................................. SUCCESS [0.068s]
[INFO] packagesmokes ..................................... SUCCESS [0.259s]
[INFO] bigtop-smokes ..................................... SUCCESS [0.004s]
[INFO] ------------------------------------------------------------------------
[INFO] BUILD SUCCESS
[INFO] ------------------------------------------------------------------------
[INFO] Total time: 1.103s
[INFO] Finished at: Tue Sep 09 03:31:01 UTC 2014
[INFO] Final Memory: 3M/61M
[INFO] ------------------------------------------------------------------------
[Bigtop-trunk-test-execution] $ /bin/bash -xe /tmp/hudson4435884744131279537.sh
+ export HADOOP_CONF_DIR=
+ HADOOP_CONF_DIR=
+ export HADOOP_HOME=
+ HADOOP_HOME=
+ /home/jenkins/tools/maven/apache-maven-3.0.4/bin/mvn -f bigtop-tests/test-execution/pom.xml -DskipTests -DskipITs deploy -DrepositoryId=apache.snapshots.https
[INFO] Scanning for projects...
[INFO] ------------------------------------------------------------------------
[INFO] Reactor Build Order:
[INFO] 
[INFO] stacks-validation-common
[INFO] smoke-tests-conf
[INFO] packagesmokes
[INFO] bigtop-smokes
[INFO]                                                                         
[INFO] ------------------------------------------------------------------------
[INFO] Building stacks-validation-common 0.9.0-SNAPSHOT
[INFO] ------------------------------------------------------------------------
[INFO] 
[INFO] --- maven-remote-resources-plugin:1.1:process (default) @ stacks-common ---
[INFO] Setting property: classpath.resource.loader.class => 'org.codehaus.plexus.velocity.ContextClassLoaderResourceLoader'.
[INFO] Setting property: velocimacro.messages.on => 'false'.
[INFO] Setting property: resource.loader => 'classpath'.
[INFO] Setting property: resource.manager.logwhenfound => 'false'.
[INFO] 
[INFO] --- maven-install-plugin:2.3:install (default-install) @ stacks-common ---
[INFO] Installing <https://builds.apache.org/job/Bigtop-trunk-test-execution/ws/bigtop-tests/test-execution/common/pom.xml> to /home/jenkins/.m2/repository/org/apache/bigtop/itest/stacks-common/0.9.0-SNAPSHOT/stacks-common-0.9.0-SNAPSHOT.pom
[INFO] 
[INFO] --- maven-deploy-plugin:2.5:deploy (default-deploy) @ stacks-common ---
Downloading: https://repository.apache.org/content/repositories/snapshots/org/apache/bigtop/itest/stacks-common/0.9.0-SNAPSHOT/maven-metadata.xml

Uploading: https://repository.apache.org/content/repositories/snapshots/org/apache/bigtop/itest/stacks-common/0.9.0-SNAPSHOT/stacks-common-0.9.0-20140909.033106-1.pom
2/12 KB   
4/12 KB   
6/12 KB   
8/12 KB   
10/12 KB   
12/12 KB   
           
Uploaded: https://repository.apache.org/content/repositories/snapshots/org/apache/bigtop/itest/stacks-common/0.9.0-SNAPSHOT/stacks-common-0.9.0-20140909.033106-1.pom (12 KB at 28.8 KB/sec)
Downloading: https://repository.apache.org/content/repositories/snapshots/org/apache/bigtop/itest/stacks-common/maven-metadata.xml
407/407 B   
            
Downloaded: https://repository.apache.org/content/repositories/snapshots/org/apache/bigtop/itest/stacks-common/maven-metadata.xml (407 B at 2.0 KB/sec)
Uploading: https://repository.apache.org/content/repositories/snapshots/org/apache/bigtop/itest/stacks-common/0.9.0-SNAPSHOT/maven-metadata.xml
613/613 B   
            
Uploaded: https://repository.apache.org/content/repositories/snapshots/org/apache/bigtop/itest/stacks-common/0.9.0-SNAPSHOT/maven-metadata.xml (613 B at 1.8 KB/sec)
Uploading: https://repository.apache.org/content/repositories/snapshots/org/apache/bigtop/itest/stacks-common/maven-metadata.xml
447/447 B   
            
Uploaded: https://repository.apache.org/content/repositories/snapshots/org/apache/bigtop/itest/stacks-common/maven-metadata.xml (447 B at 1.3 KB/sec)
[INFO]                                                                         
[INFO] ------------------------------------------------------------------------
[INFO] Building smoke-tests-conf 0.9.0-SNAPSHOT
[INFO] ------------------------------------------------------------------------
[INFO] 
[INFO] --- maven-remote-resources-plugin:1.1:process (default) @ smoke-tests-conf ---
[INFO] 
[INFO] --- maven-resources-plugin:2.4:resources (default-resources) @ smoke-tests-conf ---
[INFO] Using 'UTF-8' encoding to copy filtered resources.
[INFO] Copying 1 resource
[INFO] Copying 3 resources
[INFO] 
[INFO] --- maven-compiler-plugin:2.0.2:compile (default-compile) @ smoke-tests-conf ---
[INFO] No sources to compile
[INFO] 
[INFO] --- maven-resources-plugin:2.4:testResources (default-testResources) @ smoke-tests-conf ---
[INFO] Using 'UTF-8' encoding to copy filtered resources.
[INFO] skip non existing resourceDirectory <https://builds.apache.org/job/Bigtop-trunk-test-execution/ws/bigtop-tests/test-execution/conf/src/test/resources>
[INFO] Copying 3 resources
[INFO] 
[INFO] --- maven-compiler-plugin:2.0.2:testCompile (default-testCompile) @ smoke-tests-conf ---
[INFO] No sources to compile
[INFO] 
[INFO] --- maven-surefire-plugin:2.11:test (default-test) @ smoke-tests-conf ---
[INFO] Tests are skipped.
[INFO] 
[INFO] --- maven-jar-plugin:2.3:jar (default-jar) @ smoke-tests-conf ---
[INFO] Building jar: <https://builds.apache.org/job/Bigtop-trunk-test-execution/ws/bigtop-tests/test-execution/conf/target/smoke-tests-conf-0.9.0-SNAPSHOT.jar>
[INFO] 
[INFO] --- maven-install-plugin:2.3:install (default-install) @ smoke-tests-conf ---
[INFO] Installing <https://builds.apache.org/job/Bigtop-trunk-test-execution/ws/bigtop-tests/test-execution/conf/target/smoke-tests-conf-0.9.0-SNAPSHOT.jar> to /home/jenkins/.m2/repository/org/apache/bigtop/itest/smoke-tests-conf/0.9.0-SNAPSHOT/smoke-tests-conf-0.9.0-SNAPSHOT.jar
[INFO] Installing <https://builds.apache.org/job/Bigtop-trunk-test-execution/ws/bigtop-tests/test-execution/conf/pom.xml> to /home/jenkins/.m2/repository/org/apache/bigtop/itest/smoke-tests-conf/0.9.0-SNAPSHOT/smoke-tests-conf-0.9.0-SNAPSHOT.pom
[INFO] 
[INFO] --- maven-deploy-plugin:2.5:deploy (default-deploy) @ smoke-tests-conf ---
Downloading: https://repository.apache.org/content/repositories/snapshots/org/apache/bigtop/itest/smoke-tests-conf/0.9.0-SNAPSHOT/maven-metadata.xml
            
Uploading: https://repository.apache.org/content/repositories/snapshots/org/apache/bigtop/itest/smoke-tests-conf/0.9.0-SNAPSHOT/smoke-tests-conf-0.9.0-20140909.033109-1.jar
2/8 KB      
4/8 KB   
6/8 KB   
8/8 KB   
         
Uploaded: https://repository.apache.org/content/repositories/snapshots/org/apache/bigtop/itest/smoke-tests-conf/0.9.0-SNAPSHOT/smoke-tests-conf-0.9.0-20140909.033109-1.jar (8 KB at 21.0 KB/sec)
Uploading: https://repository.apache.org/content/repositories/snapshots/org/apache/bigtop/itest/smoke-tests-conf/0.9.0-SNAPSHOT/smoke-tests-conf-0.9.0-20140909.033109-1.pom
2/2 KB   
         
Uploaded: https://repository.apache.org/content/repositories/snapshots/org/apache/bigtop/itest/smoke-tests-conf/0.9.0-SNAPSHOT/smoke-tests-conf-0.9.0-20140909.033109-1.pom (2 KB at 4.5 KB/sec)
Downloading: https://repository.apache.org/content/repositories/snapshots/org/apache/bigtop/itest/smoke-tests-conf/maven-metadata.xml
410/410 B   
            
Downloaded: https://repository.apache.org/content/repositories/snapshots/org/apache/bigtop/itest/smoke-tests-conf/maven-metadata.xml (410 B at 1.9 KB/sec)
Uploading: https://repository.apache.org/content/repositories/snapshots/org/apache/bigtop/itest/smoke-tests-conf/0.9.0-SNAPSHOT/maven-metadata.xml
789/789 B   
            
Uploaded: https://repository.apache.org/content/repositories/snapshots/org/apache/bigtop/itest/smoke-tests-conf/0.9.0-SNAPSHOT/maven-metadata.xml (789 B at 2.8 KB/sec)
Uploading: https://repository.apache.org/content/repositories/snapshots/org/apache/bigtop/itest/smoke-tests-conf/maven-metadata.xml
450/450 B   
            
Uploaded: https://repository.apache.org/content/repositories/snapshots/org/apache/bigtop/itest/smoke-tests-conf/maven-metadata.xml (450 B at 1.2 KB/sec)
[INFO]                                                                         
[INFO] ------------------------------------------------------------------------
[INFO] Building packagesmokes 0.9.0-SNAPSHOT
[INFO] ------------------------------------------------------------------------
Downloading: http://repository.apache.org/snapshots/org/apache/bigtop/itest/package-smoke/0.9.0-SNAPSHOT/maven-metadata.xml
            
Downloading: http://repository.apache.org/snapshots/org/apache/bigtop/itest/package-smoke/0.9.0-SNAPSHOT/package-smoke-0.9.0-SNAPSHOT.pom
            
[WARNING] The POM for org.apache.bigtop.itest:package-smoke:jar:0.9.0-SNAPSHOT is missing, no dependency information available
Downloading: http://repository.apache.org/snapshots/org/apache/bigtop/itest/itest-common/0.9.0-SNAPSHOT/maven-metadata.xml
            
Downloading: http://repository.apache.org/snapshots/org/apache/bigtop/itest/itest-common/0.9.0-SNAPSHOT/itest-common-0.9.0-SNAPSHOT.pom
            
[WARNING] The POM for org.apache.bigtop.itest:itest-common:jar:0.9.0-SNAPSHOT is missing, no dependency information available
Downloading: http://repository.apache.org/snapshots/org/apache/bigtop/itest/package-smoke/0.9.0-SNAPSHOT/package-smoke-0.9.0-SNAPSHOT.jar
Downloading: http://repository.apache.org/snapshots/org/apache/bigtop/itest/itest-common/0.9.0-SNAPSHOT/itest-common-0.9.0-SNAPSHOT.jar
            
            
[INFO] ------------------------------------------------------------------------
[INFO] Reactor Summary:
[INFO] 
[INFO] stacks-validation-common .......................... SUCCESS [3.712s]
[INFO] smoke-tests-conf .................................. SUCCESS [2.927s]
[INFO] packagesmokes ..................................... FAILURE [0.552s]
[INFO] bigtop-smokes ..................................... SKIPPED
[INFO] ------------------------------------------------------------------------
[INFO] BUILD FAILURE
[INFO] ------------------------------------------------------------------------
[INFO] Total time: 7.690s
[INFO] Finished at: Tue Sep 09 03:31:11 UTC 2014
[INFO] Final Memory: 13M/175M
[INFO] ------------------------------------------------------------------------
[ERROR] Failed to execute goal on project package-smoke-execution: Could not resolve dependencies for project org.apache.bigtop.itest:package-smoke-execution:jar:0.9.0-SNAPSHOT: The following artifacts could not be resolved: org.apache.bigtop.itest:package-smoke:jar:0.9.0-SNAPSHOT, org.apache.bigtop.itest:itest-common:jar:0.9.0-SNAPSHOT: Could not find artifact org.apache.bigtop.itest:package-smoke:jar:0.9.0-SNAPSHOT in Nexus (http://repository.apache.org/snapshots) -> [Help 1]
[ERROR] 
[ERROR] To see the full stack trace of the errors, re-run Maven with the -e switch.
[ERROR] Re-run Maven using the -X switch to enable full debug logging.
[ERROR] 
[ERROR] For more information about the errors and possible solutions, please read the following articles:
[ERROR] [Help 1] http://cwiki.apache.org/confluence/display/MAVEN/DependencyResolutionException
[ERROR] 
[ERROR] After correcting the problems, you can resume the build with the command
[ERROR]   mvn <goals> -rf :package-smoke-execution
Build step 'Execute shell' marked build as failure

Jenkins build is back to normal : Bigtop-trunk-test-execution #1337

Posted by Apache Jenkins Server <je...@builds.apache.org>.
See <https://builds.apache.org/job/Bigtop-trunk-test-execution/1337/>


Build failed in Jenkins: Bigtop-trunk-test-execution #1336

Posted by Apache Jenkins Server <je...@builds.apache.org>.
See <https://builds.apache.org/job/Bigtop-trunk-test-execution/1336/>

------------------------------------------
Started by user rvs
Building remotely on H10 (Ubuntu ubuntu) in workspace <https://builds.apache.org/job/Bigtop-trunk-test-execution/ws/>
 > git rev-parse --is-inside-work-tree
Fetching changes from the remote Git repository
 > git config remote.origin.url https://git-wip-us.apache.org/repos/asf/bigtop.git
Fetching upstream changes from https://git-wip-us.apache.org/repos/asf/bigtop.git
 > git --version
 > git fetch --tags --progress https://git-wip-us.apache.org/repos/asf/bigtop.git +refs/heads/*:refs/remotes/origin/*
 > git rev-parse origin/master^{commit}
Checking out Revision c3055223cdfc022124b8e1b7bc508058c1cb3468 (origin/master)
 > git config core.sparsecheckout
 > git checkout -f c3055223cdfc022124b8e1b7bc508058c1cb3468
 > git rev-list c3055223cdfc022124b8e1b7bc508058c1cb3468
[Bigtop-trunk-test-execution] $ /home/jenkins/tools/maven/apache-maven-3.0.4/bin/mvn -f bigtop-tests/test-execution/pom.xml clean
#
# There is insufficient memory for the Java Runtime Environment to continue.
# Cannot create GC thread. Out of system resources.
# An error report file with more information is saved as:
# <https://builds.apache.org/job/Bigtop-trunk-test-execution/ws/hs_err_pid9822.log>
Build step 'Invoke top-level Maven targets' marked build as failure

Build failed in Jenkins: Bigtop-trunk-test-execution #1335

Posted by Apache Jenkins Server <je...@builds.apache.org>.
See <https://builds.apache.org/job/Bigtop-trunk-test-execution/1335/changes>

Changes:

[cos] BIGTOP-1444. Phoenix RPM build is broken after BIGTOP-1421

------------------------------------------
[...truncated 90 lines...]
[INFO] 
[INFO] --- maven-clean-plugin:2.4.1:clean (default-clean) @ package-smoke-execution ---
[INFO]                                                                         
[INFO] ------------------------------------------------------------------------
[INFO] Building bigtop-smokes 0.9.0-SNAPSHOT
[INFO] ------------------------------------------------------------------------
[INFO] 
[INFO] --- maven-clean-plugin:2.4.1:clean (default-clean) @ bigtop-test-execution ---
[INFO] ------------------------------------------------------------------------
[INFO] Reactor Summary:
[INFO] 
[INFO] stacks-validation-common .......................... SUCCESS [0.123s]
[INFO] smoke-tests-conf .................................. SUCCESS [0.003s]
[INFO] packagesmokes ..................................... SUCCESS [0.415s]
[INFO] bigtop-smokes ..................................... SUCCESS [0.003s]
[INFO] ------------------------------------------------------------------------
[INFO] BUILD SUCCESS
[INFO] ------------------------------------------------------------------------
[INFO] Total time: 2.578s
[INFO] Finished at: Tue Sep 09 16:18:33 UTC 2014
[INFO] Final Memory: 4M/60M
[INFO] ------------------------------------------------------------------------
[Bigtop-trunk-test-execution] $ /bin/bash -xe /tmp/hudson6584289962280506257.sh
+ export HADOOP_CONF_DIR=
+ HADOOP_CONF_DIR=
+ export HADOOP_HOME=
+ HADOOP_HOME=
+ /home/jenkins/tools/maven/apache-maven-3.0.4/bin/mvn -f bigtop-tests/test-execution/pom.xml -DskipTests -DskipITs deploy -DrepositoryId=apache.snapshots.https
[INFO] Scanning for projects...
[INFO] ------------------------------------------------------------------------
[INFO] Reactor Build Order:
[INFO] 
[INFO] stacks-validation-common
[INFO] smoke-tests-conf
[INFO] packagesmokes
[INFO] bigtop-smokes
[INFO]                                                                         
[INFO] ------------------------------------------------------------------------
[INFO] Building stacks-validation-common 0.9.0-SNAPSHOT
[INFO] ------------------------------------------------------------------------
[INFO] 
[INFO] --- maven-remote-resources-plugin:1.1:process (default) @ stacks-common ---
[INFO] Setting property: classpath.resource.loader.class => 'org.codehaus.plexus.velocity.ContextClassLoaderResourceLoader'.
[INFO] Setting property: velocimacro.messages.on => 'false'.
[INFO] Setting property: resource.loader => 'classpath'.
[INFO] Setting property: resource.manager.logwhenfound => 'false'.
Downloading: http://repo.maven.apache.org/maven2/org/codehaus/groovy/maven/runtime/gmaven-runtime-1.6/1.0/gmaven-runtime-1.6-1.0.pom
4/4 KB   
         
Downloaded: http://repo.maven.apache.org/maven2/org/codehaus/groovy/maven/runtime/gmaven-runtime-1.6/1.0/gmaven-runtime-1.6-1.0.pom (4 KB at 12.2 KB/sec)
Downloading: http://repo.maven.apache.org/maven2/org/codehaus/groovy/maven/runtime/gmaven-runtime/1.0/gmaven-runtime-1.0.pom
3/3 KB   
         
Downloaded: http://repo.maven.apache.org/maven2/org/codehaus/groovy/maven/runtime/gmaven-runtime/1.0/gmaven-runtime-1.0.pom (3 KB at 33.4 KB/sec)
Downloading: http://repo.maven.apache.org/maven2/org/codehaus/groovy/maven/gmaven/1.0/gmaven-1.0.pom
4/39 KB   
6/39 KB   
10/39 KB   
14/39 KB   
14/39 KB   
17/39 KB   
21/39 KB   
25/39 KB   
29/39 KB   
33/39 KB   
37/39 KB   
39/39 KB   
           
Downloaded: http://repo.maven.apache.org/maven2/org/codehaus/groovy/maven/gmaven/1.0/gmaven-1.0.pom (39 KB at 368.6 KB/sec)
Downloading: http://repo.maven.apache.org/maven2/org/codehaus/groovy/maven/feature/gmaven-feature-support/1.0/gmaven-feature-support-1.0.pom
2/2 KB     
         
Downloaded: http://repo.maven.apache.org/maven2/org/codehaus/groovy/maven/feature/gmaven-feature-support/1.0/gmaven-feature-support-1.0.pom (2 KB at 29.8 KB/sec)
Downloading: http://repo.maven.apache.org/maven2/org/codehaus/groovy/maven/feature/gmaven-feature/1.0/gmaven-feature-1.0.pom
2/2 KB   
         
Downloaded: http://repo.maven.apache.org/maven2/org/codehaus/groovy/maven/feature/gmaven-feature/1.0/gmaven-feature-1.0.pom (2 KB at 27.5 KB/sec)
Downloading: http://repo.maven.apache.org/maven2/org/codehaus/groovy/maven/feature/gmaven-feature-api/1.0/gmaven-feature-api-1.0.pom
2/2 KB   
         
Downloaded: http://repo.maven.apache.org/maven2/org/codehaus/groovy/maven/feature/gmaven-feature-api/1.0/gmaven-feature-api-1.0.pom (2 KB at 24.5 KB/sec)
Downloading: http://repo.maven.apache.org/maven2/org/codehaus/groovy/maven/runtime/gmaven-runtime-support/1.0/gmaven-runtime-support-1.0.pom
3/3 KB   
         
Downloaded: http://repo.maven.apache.org/maven2/org/codehaus/groovy/maven/runtime/gmaven-runtime-support/1.0/gmaven-runtime-support-1.0.pom (3 KB at 43.7 KB/sec)
Downloading: http://repo.maven.apache.org/maven2/org/codehaus/groovy/maven/runtime/gmaven-runtime-api/1.0/gmaven-runtime-api-1.0.pom
2/2 KB   
         
Downloaded: http://repo.maven.apache.org/maven2/org/codehaus/groovy/maven/runtime/gmaven-runtime-api/1.0/gmaven-runtime-api-1.0.pom (2 KB at 26.5 KB/sec)
Downloading: http://repo.maven.apache.org/maven2/org/codehaus/groovy/maven/gmaven-common/1.0/gmaven-common-1.0.pom
2/2 KB   
         
Downloaded: http://repo.maven.apache.org/maven2/org/codehaus/groovy/maven/gmaven-common/1.0/gmaven-common-1.0.pom (2 KB at 28.0 KB/sec)
Downloading: http://repo.maven.apache.org/maven2/com/thoughtworks/qdox/qdox/1.8/qdox-1.8.pom
4/12 KB   
8/12 KB   
12/12 KB   
           
Downloaded: http://repo.maven.apache.org/maven2/com/thoughtworks/qdox/qdox/1.8/qdox-1.8.pom (12 KB at 175.2 KB/sec)
Downloading: http://repo.maven.apache.org/maven2/org/codehaus/groovy/maven/runtime/gmaven-runtime-1.6/1.0/gmaven-runtime-1.6-1.0.jar
Downloading: http://repo.maven.apache.org/maven2/org/codehaus/groovy/maven/feature/gmaven-feature-support/1.0/gmaven-feature-support-1.0.jar
Downloading: http://repo.maven.apache.org/maven2/org/codehaus/groovy/maven/feature/gmaven-feature-api/1.0/gmaven-feature-api-1.0.jar
Downloading: http://repo.maven.apache.org/maven2/org/codehaus/groovy/maven/runtime/gmaven-runtime-api/1.0/gmaven-runtime-api-1.0.jar
Downloading: http://repo.maven.apache.org/maven2/org/codehaus/groovy/maven/runtime/gmaven-runtime-support/1.0/gmaven-runtime-support-1.0.jar
4/43 KB    
8/43 KB   
12/43 KB   
16/43 KB   
20/43 KB   
21/43 KB   
25/43 KB   
29/43 KB   
4/14 KB   29/43 KB   
4/14 KB   31/43 KB   
8/14 KB   31/43 KB   
8/14 KB   33/43 KB   
8/14 KB   37/43 KB   
12/14 KB   37/43 KB   
12/14 KB   4/18 KB   37/43 KB   
12/14 KB   4/18 KB   4/79 KB   37/43 KB   
12/14 KB   4/18 KB   41/43 KB   4/79 KB   
14/14 KB   4/18 KB   41/43 KB   4/79 KB   
14/14 KB   8/18 KB   41/43 KB   4/79 KB   
14/14 KB   8/18 KB   41/43 KB   7/79 KB   
14/14 KB   8/18 KB   43/43 KB   7/79 KB   
14/14 KB   8/18 KB   43/43 KB   11/79 KB   
14/14 KB   12/18 KB   43/43 KB   11/79 KB   
14/14 KB   12/18 KB   43/43 KB   14/79 KB   
14/14 KB   14/18 KB   43/43 KB   14/79 KB   
4/23 KB   14/14 KB   14/18 KB   43/43 KB   14/79 KB   
8/23 KB   14/14 KB   14/18 KB   43/43 KB   14/79 KB   
12/23 KB   14/14 KB   14/18 KB   43/43 KB   14/79 KB   
14/23 KB   14/14 KB   14/18 KB   43/43 KB   14/79 KB   
14/23 KB   14/14 KB   14/18 KB   43/43 KB   18/79 KB   
14/23 KB   14/14 KB   18/18 KB   43/43 KB   22/79 KB   
14/23 KB   14/14 KB   18/18 KB   43/43 KB   22/79 KB   
14/23 KB   14/14 KB   18/18 KB   43/43 KB   26/79 KB   
14/23 KB   14/14 KB   18/18 KB   43/43 KB   30/79 KB   
14/23 KB   14/14 KB   18/18 KB   43/43 KB   34/79 KB   
18/23 KB   14/14 KB   18/18 KB   43/43 KB   34/79 KB   
                                                       
                                                       
Downloaded: http://repo.maven.apache.org/maven2/org/codehaus/groovy/maven/runtime/gmaven-runtime-1.6/1.0/gmaven-runtime-1.6-1.0.jar (43 KB at 516.5 KB/sec)
Downloaded: http://repo.maven.apache.org/maven2/org/codehaus/groovy/maven/feature/gmaven-feature-support/1.0/gmaven-feature-support-1.0.jar (14 KB at 166.6 KB/sec)
22/23 KB   18/18 KB   34/79 KB                         
23/23 KB   18/18 KB   34/79 KB   
Downloading: http://repo.maven.apache.org/maven2/org/codehaus/groovy/maven/gmaven-common/1.0/gmaven-common-1.0.jar
Downloading: http://repo.maven.apache.org/maven2/com/thoughtworks/qdox/qdox/1.8/qdox-1.8.jar
23/23 KB   18/18 KB   38/79 KB   
23/23 KB   18/18 KB   42/79 KB   
23/23 KB   18/18 KB   44/79 KB   
                                 
Downloaded: http://repo.maven.apache.org/maven2/org/codehaus/groovy/maven/feature/gmaven-feature-api/1.0/gmaven-feature-api-1.0.jar (18 KB at 162.3 KB/sec)
                                 
Downloaded: http://repo.maven.apache.org/maven2/org/codehaus/groovy/maven/runtime/gmaven-runtime-api/1.0/gmaven-runtime-api-1.0.jar (23 KB at 201.5 KB/sec)
4/156 KB   44/79 KB              
4/15 KB   4/156 KB   44/79 KB   
4/15 KB   7/156 KB   44/79 KB   
8/15 KB   7/156 KB   44/79 KB   
8/15 KB   11/156 KB   44/79 KB   
12/15 KB   11/156 KB   44/79 KB   
12/15 KB   15/156 KB   44/79 KB   
12/15 KB   15/156 KB   48/79 KB   
15/15 KB   15/156 KB   48/79 KB   
15/15 KB   19/156 KB   48/79 KB   
15/15 KB   19/156 KB   52/79 KB   
15/15 KB   23/156 KB   52/79 KB   
15/15 KB   23/156 KB   56/79 KB   
15/15 KB   26/156 KB   56/79 KB   
15/15 KB   26/156 KB   60/79 KB   
15/15 KB   26/156 KB   64/79 KB   
15/15 KB   26/156 KB   68/79 KB   
15/15 KB   26/156 KB   72/79 KB   
15/15 KB   26/156 KB   75/79 KB   
15/15 KB   30/156 KB   75/79 KB   
15/15 KB   34/156 KB   75/79 KB   
15/15 KB   34/156 KB   75/79 KB   
15/15 KB   38/156 KB   75/79 KB   
15/15 KB   42/156 KB   75/79 KB   
15/15 KB   42/156 KB   79/79 KB   
15/15 KB   46/156 KB   79/79 KB   
15/15 KB   50/156 KB   79/79 KB   
15/15 KB   54/156 KB   79/79 KB   
                                  
Downloaded: http://repo.maven.apache.org/maven2/org/codehaus/groovy/maven/gmaven-common/1.0/gmaven-common-1.0.jar (15 KB at 246.8 KB/sec)
58/156 KB   79/79 KB              
62/156 KB   79/79 KB   
64/156 KB   79/79 KB   
65/156 KB   79/79 KB   
69/156 KB   79/79 KB   
73/156 KB   79/79 KB   
77/156 KB   79/79 KB   
81/156 KB   79/79 KB   
85/156 KB   79/79 KB   
86/156 KB   79/79 KB   
                       
Downloaded: http://repo.maven.apache.org/maven2/org/codehaus/groovy/maven/runtime/gmaven-runtime-support/1.0/gmaven-runtime-support-1.0.jar (79 KB at 451.0 KB/sec)
90/156 KB              
93/156 KB   
97/156 KB   
99/156 KB   
103/156 KB   
107/156 KB   
111/156 KB   
115/156 KB   
119/156 KB   
123/156 KB   
125/156 KB   
129/156 KB   
130/156 KB   
134/156 KB   
138/156 KB   
142/156 KB   
146/156 KB   
150/156 KB   
154/156 KB   
156/156 KB   
             
Downloaded: http://repo.maven.apache.org/maven2/com/thoughtworks/qdox/qdox/1.8/qdox-1.8.jar (156 KB at 1009.8 KB/sec)
[INFO] 
[INFO] --- maven-install-plugin:2.3:install (default-install) @ stacks-common ---
[INFO] Installing <https://builds.apache.org/job/Bigtop-trunk-test-execution/ws/bigtop-tests/test-execution/common/pom.xml> to /home/jenkins/.m2/repository/org/apache/bigtop/itest/stacks-common/0.9.0-SNAPSHOT/stacks-common-0.9.0-SNAPSHOT.pom
[INFO] 
[INFO] --- maven-deploy-plugin:2.5:deploy (default-deploy) @ stacks-common ---
Downloading: https://repository.apache.org/content/repositories/snapshots/org/apache/bigtop/itest/stacks-common/0.9.0-SNAPSHOT/maven-metadata.xml
             
[WARNING] Could not transfer metadata org.apache.bigtop.itest:stacks-common:0.9.0-SNAPSHOT/maven-metadata.xml from/to apache.snapshots.https (https://repository.apache.org/content/repositories/snapshots): Failed to transfer file: https://repository.apache.org/content/repositories/snapshots/org/apache/bigtop/itest/stacks-common/0.9.0-SNAPSHOT/maven-metadata.xml. Return code is: 503, ReasonPhrase:Service Temporarily Unavailable.
[INFO] ------------------------------------------------------------------------
[INFO] Reactor Summary:
[INFO] 
[INFO] stacks-validation-common .......................... FAILURE [1:03.240s]
[INFO] smoke-tests-conf .................................. SKIPPED
[INFO] packagesmokes ..................................... SKIPPED
[INFO] bigtop-smokes ..................................... SKIPPED
[INFO] ------------------------------------------------------------------------
[INFO] BUILD FAILURE
[INFO] ------------------------------------------------------------------------
[INFO] Total time: 1:03.737s
[INFO] Finished at: Tue Sep 09 16:19:39 UTC 2014
[INFO] Final Memory: 8M/112M
[INFO] ------------------------------------------------------------------------
[ERROR] Failed to execute goal org.apache.maven.plugins:maven-deploy-plugin:2.5:deploy (default-deploy) on project stacks-common: Failed to retrieve remote metadata org.apache.bigtop.itest:stacks-common:0.9.0-SNAPSHOT/maven-metadata.xml: Could not transfer metadata org.apache.bigtop.itest:stacks-common:0.9.0-SNAPSHOT/maven-metadata.xml from/to apache.snapshots.https (https://repository.apache.org/content/repositories/snapshots): Failed to transfer file: https://repository.apache.org/content/repositories/snapshots/org/apache/bigtop/itest/stacks-common/0.9.0-SNAPSHOT/maven-metadata.xml. Return code is: 503, ReasonPhrase:Service Temporarily Unavailable. -> [Help 1]
[ERROR] 
[ERROR] To see the full stack trace of the errors, re-run Maven with the -e switch.
[ERROR] Re-run Maven using the -X switch to enable full debug logging.
[ERROR] 
[ERROR] For more information about the errors and possible solutions, please read the following articles:
[ERROR] [Help 1] http://cwiki.apache.org/confluence/display/MAVEN/MojoExecutionException
Build step 'Execute shell' marked build as failure