You are viewing a plain text version of this content. The canonical link for it is here.
Posted to oak-issues@jackrabbit.apache.org by "Marcel Reutegger (JIRA)" <ji...@apache.org> on 2019/02/25 16:50:00 UTC

[jira] [Updated] (OAK-8073) Build Jackrabbit Oak #1966 failed

     [ https://issues.apache.org/jira/browse/OAK-8073?page=com.atlassian.jira.plugin.system.issuetabpanels:all-tabpanel ]

Marcel Reutegger updated OAK-8073:
----------------------------------
    Description: 
No description is provided

The build Jackrabbit Oak #1966 has failed.
First failed run: [Jackrabbit Oak #1966|https://builds.apache.org/job/Jackrabbit%20Oak/1966/] [console log|https://builds.apache.org/job/Jackrabbit%20Oak/1966/console]

{noformat}
[ERROR] org.apache.jackrabbit.oak.segment.azure.AzureManifestFileTest  Time elapsed: 3.798 s  <<< ERROR!
java.lang.RuntimeException: Unable to start docker container: DockerConfig{name=oak-test-azurite}
	at com.arakelian.docker.junit.DockerRule$StatementWithDockerRule.evaluate(DockerRule.java:79)
	at org.junit.rules.RunRules.evaluate(RunRules.java:20)
	at org.junit.runners.ParentRunner.run(ParentRunner.java:363)
	at org.apache.maven.surefire.junit4.JUnit4Provider.execute(JUnit4Provider.java:365)
	at org.apache.maven.surefire.junit4.JUnit4Provider.executeWithRerun(JUnit4Provider.java:273)
	at org.apache.maven.surefire.junit4.JUnit4Provider.executeTestSet(JUnit4Provider.java:238)
	at org.apache.maven.surefire.junit4.JUnit4Provider.invoke(JUnit4Provider.java:159)
	at org.apache.maven.surefire.booter.ForkedBooter.invokeProviderInSameClassLoader(ForkedBooter.java:384)
	at org.apache.maven.surefire.booter.ForkedBooter.runSuitesInProcess(ForkedBooter.java:345)
	at org.apache.maven.surefire.booter.ForkedBooter.execute(ForkedBooter.java:126)
	at org.apache.maven.surefire.booter.ForkedBooter.main(ForkedBooter.java:418)
{noformat}

  was:
No description is provided

The build Jackrabbit Oak #1966 has failed.
First failed run: [Jackrabbit Oak #1966|https://builds.apache.org/job/Jackrabbit%20Oak/1966/] [console log|https://builds.apache.org/job/Jackrabbit%20Oak/1966/console]


> Build Jackrabbit Oak #1966 failed
> ---------------------------------
>
>                 Key: OAK-8073
>                 URL: https://issues.apache.org/jira/browse/OAK-8073
>             Project: Jackrabbit Oak
>          Issue Type: Bug
>          Components: continuous integration
>            Reporter: Hudson
>            Priority: Major
>
> No description is provided
> The build Jackrabbit Oak #1966 has failed.
> First failed run: [Jackrabbit Oak #1966|https://builds.apache.org/job/Jackrabbit%20Oak/1966/] [console log|https://builds.apache.org/job/Jackrabbit%20Oak/1966/console]
> {noformat}
> [ERROR] org.apache.jackrabbit.oak.segment.azure.AzureManifestFileTest  Time elapsed: 3.798 s  <<< ERROR!
> java.lang.RuntimeException: Unable to start docker container: DockerConfig{name=oak-test-azurite}
> 	at com.arakelian.docker.junit.DockerRule$StatementWithDockerRule.evaluate(DockerRule.java:79)
> 	at org.junit.rules.RunRules.evaluate(RunRules.java:20)
> 	at org.junit.runners.ParentRunner.run(ParentRunner.java:363)
> 	at org.apache.maven.surefire.junit4.JUnit4Provider.execute(JUnit4Provider.java:365)
> 	at org.apache.maven.surefire.junit4.JUnit4Provider.executeWithRerun(JUnit4Provider.java:273)
> 	at org.apache.maven.surefire.junit4.JUnit4Provider.executeTestSet(JUnit4Provider.java:238)
> 	at org.apache.maven.surefire.junit4.JUnit4Provider.invoke(JUnit4Provider.java:159)
> 	at org.apache.maven.surefire.booter.ForkedBooter.invokeProviderInSameClassLoader(ForkedBooter.java:384)
> 	at org.apache.maven.surefire.booter.ForkedBooter.runSuitesInProcess(ForkedBooter.java:345)
> 	at org.apache.maven.surefire.booter.ForkedBooter.execute(ForkedBooter.java:126)
> 	at org.apache.maven.surefire.booter.ForkedBooter.main(ForkedBooter.java:418)
> {noformat}



--
This message was sent by Atlassian JIRA
(v7.6.3#76005)