You are viewing a plain text version of this content. The canonical link for it is here.
Posted to dev@commons.apache.org by Gump <bo...@apache.org> on 2011/11/04 05:29:12 UTC
[GUMP@vmgump]: Project commons-jexl-jexl2-compat (in module apache-commons) failed
To whom it may engage...
This is an automated request, but not an unsolicited one. For
more information please visit http://gump.apache.org/nagged.html,
and/or contact the folk at general@gump.apache.org.
Project commons-jexl-jexl2-compat has an issue affecting its community integration.
This issue affects 1 projects.
The current state of this project is 'Failed', with reason 'Build Failed'.
For reference only, the following projects are affected by this:
- commons-jexl-jexl2-compat : Commons Jexl Package
Full details are available at:
http://vmgump.apache.org/gump/public/apache-commons/commons-jexl-jexl2-compat/index.html
That said, some information snippets are provided here.
The following annotations (debug/informational/warning/error messages) were provided:
-DEBUG- Sole jar output [commons-jexl-compat-*[0-9T].jar] identifier set to project name
-DEBUG- (Apache Gump generated) Apache Maven Settings in: /srv/gump/public/workspace/apache-commons/jexl/jexl2-compat/gump_mvn_settings.xml
-INFO- Failed with reason build failed
-DEBUG- Maven POM in: /srv/gump/public/workspace/apache-commons/jexl/jexl2-compat/pom.xml
-DEBUG- Extracted fallback artifacts from Gump Repository
The following work was performed:
http://vmgump.apache.org/gump/public/apache-commons/commons-jexl-jexl2-compat/gump_work/build_apache-commons_commons-jexl-jexl2-compat.html
Work Name: build_apache-commons_commons-jexl-jexl2-compat (Type: Build)
Work ended in a state of : Failed
Elapsed: 13 secs
Command Line: /opt/maven2/bin/mvn --batch-mode --settings /srv/gump/public/workspace/apache-commons/jexl/jexl2-compat/gump_mvn_settings.xml package
[Working Directory: /srv/gump/public/workspace/apache-commons/jexl/jexl2-compat]
M2_HOME: /opt/maven2
---------------------------------------------
[INFO] Setting property: velocimacro.messages.on => 'false'.
[INFO] Setting property: resource.loader => 'classpath'.
[INFO] Setting property: resource.manager.logwhenfound => 'false'.
[INFO] [remote-resources:process {execution: default}]
[INFO] [resources:resources {execution: default-resources}]
[INFO] Using 'UTF-8' encoding to copy filtered resources.
[INFO] Copying 0 resource to META-INF
[INFO] [compiler:compile {execution: default-compile}]
[INFO] Compiling 8 source files to /srv/gump/public/workspace/apache-commons/jexl/jexl2-compat/target/classes
[INFO] [bundle:manifest {execution: bundle-manifest}]
[INFO] [resources:testResources {execution: default-testResources}]
[INFO] Using 'UTF-8' encoding to copy filtered resources.
[INFO] Copying 0 resource to META-INF
[INFO] [compiler:testCompile {execution: default-testCompile}]
[INFO] Compiling 1 source file to /srv/gump/public/workspace/apache-commons/jexl/jexl2-compat/target/test-classes
[INFO] [surefire:test {execution: default-test}]
[INFO] Surefire report directory: /srv/gump/public/workspace/apache-commons/jexl/jexl2-compat/target/surefire-reports
Downloading: http://localhost:8192/maven2/org/apache/maven/surefire/surefire-junit3/2.8.1/surefire-junit3-2.8.1.pom
Downloading: http://localhost:8192/maven2/org/apache/maven/surefire/surefire-junit3/2.8.1/surefire-junit3-2.8.1.jar
-------------------------------------------------------
T E S T S
-------------------------------------------------------
Running org.apache.commons.jexl.ScriptTest
Starting test script
The result is 7
Tests run: 4, Failures: 0, Errors: 1, Skipped: 0, Time elapsed: 0.194 sec <<< FAILURE!
Results :
Tests in error:
testScriptFromURL(org.apache.commons.jexl.ScriptTest)
Tests run: 4, Failures: 0, Errors: 1, Skipped: 0
[INFO] ------------------------------------------------------------------------
[ERROR] BUILD FAILURE
[INFO] ------------------------------------------------------------------------
[INFO] There are test failures.
Please refer to /srv/gump/public/workspace/apache-commons/jexl/jexl2-compat/target/surefire-reports for the individual test results.
[INFO] ------------------------------------------------------------------------
[INFO] For more information, run Maven with the -e switch
[INFO] ------------------------------------------------------------------------
[INFO] Total time: 12 seconds
[INFO] Finished at: Fri Nov 04 04:29:11 UTC 2011
[INFO] Final Memory: 30M/72M
[INFO] ------------------------------------------------------------------------
---------------------------------------------
To subscribe to this information via syndicated feeds:
- RSS: http://vmgump.apache.org/gump/public/apache-commons/commons-jexl-jexl2-compat/rss.xml
- Atom: http://vmgump.apache.org/gump/public/apache-commons/commons-jexl-jexl2-compat/atom.xml
============================== Gump Tracking Only ===
Produced by Apache Gump(TM) version 2.3.
Gump Run 10000004112011, vmgump.apache.org:vmgump:10000004112011
Gump E-mail Identifier (unique within run) #24.
--
Apache Gump
http://gump.apache.org/ [Instance: vmgump]
---------------------------------------------------------------------
To unsubscribe, e-mail: dev-unsubscribe@commons.apache.org
For additional commands, e-mail: dev-help@commons.apache.org