You are viewing a plain text version of this content. The canonical link for it is here.
Posted to commits@beam.apache.org by Apache Jenkins Server <je...@builds.apache.org> on 2018/02/02 20:32:59 UTC
Build failed in Jenkins: beam_PerformanceTests_TFRecordIOIT #93
See <https://builds.apache.org/job/beam_PerformanceTests_TFRecordIOIT/93/display/redirect?page=changes>
Changes:
[robertwb] Reduce the flakiness of the state sampler progress metrics.
[kedin] [SQL] Inherit windowing strategy from the input in Aggregate operation
[jbonofre] [BEAM-3551] Define compiler -parameters flag in the default options
[lcwik] Move off of deprecated method in Guava.
------------------------------------------
[...truncated 10.05 KB...]
[beam_PerformanceTests_TFRecordIOIT] $ /bin/bash -xe /tmp/jenkins7799696085149354719.sh
+ .env/bin/pip install -e 'src/sdks/python/[gcp,test]'
Obtaining file://<https://builds.apache.org/job/beam_PerformanceTests_TFRecordIOIT/ws/src/sdks/python>
Requirement already satisfied: avro<2.0.0,>=1.8.1 in /home/jenkins/.local/lib/python2.7/site-packages (from apache-beam==2.4.0.dev0)
Requirement already satisfied: crcmod<2.0,>=1.7 in /usr/lib/python2.7/dist-packages (from apache-beam==2.4.0.dev0)
Requirement already satisfied: dill==0.2.6 in /home/jenkins/.local/lib/python2.7/site-packages (from apache-beam==2.4.0.dev0)
Requirement already satisfied: grpcio<2,>=1.0 in /home/jenkins/.local/lib/python2.7/site-packages (from apache-beam==2.4.0.dev0)
Requirement already satisfied: httplib2<0.10,>=0.8 in /home/jenkins/.local/lib/python2.7/site-packages (from apache-beam==2.4.0.dev0)
Requirement already satisfied: mock<3.0.0,>=1.0.1 in /home/jenkins/.local/lib/python2.7/site-packages (from apache-beam==2.4.0.dev0)
Requirement already satisfied: oauth2client<5,>=2.0.1 in /home/jenkins/.local/lib/python2.7/site-packages (from apache-beam==2.4.0.dev0)
Requirement already satisfied: protobuf<4,>=3.5.0.post1 in /home/jenkins/.local/lib/python2.7/site-packages (from apache-beam==2.4.0.dev0)
Requirement already satisfied: pyyaml<4.0.0,>=3.12 in /home/jenkins/.local/lib/python2.7/site-packages (from apache-beam==2.4.0.dev0)
Requirement already satisfied: pyvcf<0.7.0,>=0.6.8 in /home/jenkins/.local/lib/python2.7/site-packages (from apache-beam==2.4.0.dev0)
Requirement already satisfied: six<1.12,>=1.9 in /home/jenkins/.local/lib/python2.7/site-packages (from apache-beam==2.4.0.dev0)
Requirement already satisfied: typing<3.7.0,>=3.6.0 in /home/jenkins/.local/lib/python2.7/site-packages (from apache-beam==2.4.0.dev0)
Requirement already satisfied: futures<4.0.0,>=3.1.1 in /home/jenkins/.local/lib/python2.7/site-packages (from apache-beam==2.4.0.dev0)
Requirement already satisfied: hdfs3<0.4.0,>=0.3.0 in /home/jenkins/.local/lib/python2.7/site-packages (from apache-beam==2.4.0.dev0)
Requirement already satisfied: google-apitools<=0.5.20,>=0.5.18 in /home/jenkins/.local/lib/python2.7/site-packages (from apache-beam==2.4.0.dev0)
Requirement already satisfied: proto-google-cloud-datastore-v1<=0.90.4,>=0.90.0 in /home/jenkins/.local/lib/python2.7/site-packages (from apache-beam==2.4.0.dev0)
Requirement already satisfied: googledatastore==7.0.1 in /home/jenkins/.local/lib/python2.7/site-packages (from apache-beam==2.4.0.dev0)
Requirement already satisfied: google-cloud-pubsub==0.26.0 in /home/jenkins/.local/lib/python2.7/site-packages (from apache-beam==2.4.0.dev0)
Requirement already satisfied: google-cloud-bigquery==0.25.0 in /home/jenkins/.local/lib/python2.7/site-packages (from apache-beam==2.4.0.dev0)
Requirement already satisfied: pyhamcrest<2.0,>=1.9 in /home/jenkins/.local/lib/python2.7/site-packages (from apache-beam==2.4.0.dev0)
Requirement already satisfied: enum34>=1.0.4 in /home/jenkins/.local/lib/python2.7/site-packages (from grpcio<2,>=1.0->apache-beam==2.4.0.dev0)
Requirement already satisfied: funcsigs>=1; python_version < "3.3" in /home/jenkins/.local/lib/python2.7/site-packages (from mock<3.0.0,>=1.0.1->apache-beam==2.4.0.dev0)
Requirement already satisfied: pbr>=0.11 in /home/jenkins/.local/lib/python2.7/site-packages (from mock<3.0.0,>=1.0.1->apache-beam==2.4.0.dev0)
Requirement already satisfied: pyasn1>=0.1.7 in /home/jenkins/.local/lib/python2.7/site-packages (from oauth2client<5,>=2.0.1->apache-beam==2.4.0.dev0)
Requirement already satisfied: pyasn1-modules>=0.0.5 in /home/jenkins/.local/lib/python2.7/site-packages (from oauth2client<5,>=2.0.1->apache-beam==2.4.0.dev0)
Requirement already satisfied: rsa>=3.1.4 in /home/jenkins/.local/lib/python2.7/site-packages (from oauth2client<5,>=2.0.1->apache-beam==2.4.0.dev0)
Requirement already satisfied: setuptools in ./.env/lib/python2.7/site-packages (from protobuf<4,>=3.5.0.post1->apache-beam==2.4.0.dev0)
Requirement already satisfied: fasteners>=0.14 in /home/jenkins/.local/lib/python2.7/site-packages (from google-apitools<=0.5.20,>=0.5.18->apache-beam==2.4.0.dev0)
Requirement already satisfied: googleapis-common-protos<2.0dev,>=1.5.2 in /home/jenkins/.local/lib/python2.7/site-packages (from proto-google-cloud-datastore-v1<=0.90.4,>=0.90.0->apache-beam==2.4.0.dev0)
Requirement already satisfied: google-cloud-core<0.26dev,>=0.25.0 in /home/jenkins/.local/lib/python2.7/site-packages (from google-cloud-pubsub==0.26.0->apache-beam==2.4.0.dev0)
Requirement already satisfied: gapic-google-cloud-pubsub-v1<0.16dev,>=0.15.0 in /home/jenkins/.local/lib/python2.7/site-packages (from google-cloud-pubsub==0.26.0->apache-beam==2.4.0.dev0)
Requirement already satisfied: monotonic>=0.1 in /home/jenkins/.local/lib/python2.7/site-packages (from fasteners>=0.14->google-apitools<=0.5.20,>=0.5.18->apache-beam==2.4.0.dev0)
Requirement already satisfied: google-auth<2.0.0dev,>=0.4.0 in /home/jenkins/.local/lib/python2.7/site-packages (from google-cloud-core<0.26dev,>=0.25.0->google-cloud-pubsub==0.26.0->apache-beam==2.4.0.dev0)
Requirement already satisfied: google-auth-httplib2 in /home/jenkins/.local/lib/python2.7/site-packages (from google-cloud-core<0.26dev,>=0.25.0->google-cloud-pubsub==0.26.0->apache-beam==2.4.0.dev0)
Requirement already satisfied: google-gax<0.16dev,>=0.15.7 in /home/jenkins/.local/lib/python2.7/site-packages (from gapic-google-cloud-pubsub-v1<0.16dev,>=0.15.0->google-cloud-pubsub==0.26.0->apache-beam==2.4.0.dev0)
Requirement already satisfied: proto-google-cloud-pubsub-v1[grpc]<0.16dev,>=0.15.4 in /home/jenkins/.local/lib/python2.7/site-packages (from gapic-google-cloud-pubsub-v1<0.16dev,>=0.15.0->google-cloud-pubsub==0.26.0->apache-beam==2.4.0.dev0)
Requirement already satisfied: grpc-google-iam-v1<0.12dev,>=0.11.1 in /home/jenkins/.local/lib/python2.7/site-packages (from gapic-google-cloud-pubsub-v1<0.16dev,>=0.15.0->google-cloud-pubsub==0.26.0->apache-beam==2.4.0.dev0)
Requirement already satisfied: cachetools>=2.0.0 in /home/jenkins/.local/lib/python2.7/site-packages (from google-auth<2.0.0dev,>=0.4.0->google-cloud-core<0.26dev,>=0.25.0->google-cloud-pubsub==0.26.0->apache-beam==2.4.0.dev0)
Requirement already satisfied: future<0.17dev,>=0.16.0 in /home/jenkins/.local/lib/python2.7/site-packages (from google-gax<0.16dev,>=0.15.7->gapic-google-cloud-pubsub-v1<0.16dev,>=0.15.0->google-cloud-pubsub==0.26.0->apache-beam==2.4.0.dev0)
Requirement already satisfied: ply==3.8 in /home/jenkins/.local/lib/python2.7/site-packages (from google-gax<0.16dev,>=0.15.7->gapic-google-cloud-pubsub-v1<0.16dev,>=0.15.0->google-cloud-pubsub==0.26.0->apache-beam==2.4.0.dev0)
Requirement already satisfied: requests<3.0dev,>=2.13.0 in /home/jenkins/.local/lib/python2.7/site-packages (from google-gax<0.16dev,>=0.15.7->gapic-google-cloud-pubsub-v1<0.16dev,>=0.15.0->google-cloud-pubsub==0.26.0->apache-beam==2.4.0.dev0)
Requirement already satisfied: idna<2.6,>=2.5 in /home/jenkins/.local/lib/python2.7/site-packages (from requests<3.0dev,>=2.13.0->google-gax<0.16dev,>=0.15.7->gapic-google-cloud-pubsub-v1<0.16dev,>=0.15.0->google-cloud-pubsub==0.26.0->apache-beam==2.4.0.dev0)
Requirement already satisfied: urllib3<1.22,>=1.21.1 in /home/jenkins/.local/lib/python2.7/site-packages (from requests<3.0dev,>=2.13.0->google-gax<0.16dev,>=0.15.7->gapic-google-cloud-pubsub-v1<0.16dev,>=0.15.0->google-cloud-pubsub==0.26.0->apache-beam==2.4.0.dev0)
Requirement already satisfied: chardet<3.1.0,>=3.0.2 in /home/jenkins/.local/lib/python2.7/site-packages (from requests<3.0dev,>=2.13.0->google-gax<0.16dev,>=0.15.7->gapic-google-cloud-pubsub-v1<0.16dev,>=0.15.0->google-cloud-pubsub==0.26.0->apache-beam==2.4.0.dev0)
Requirement already satisfied: certifi>=2017.4.17 in /home/jenkins/.local/lib/python2.7/site-packages (from requests<3.0dev,>=2.13.0->google-gax<0.16dev,>=0.15.7->gapic-google-cloud-pubsub-v1<0.16dev,>=0.15.0->google-cloud-pubsub==0.26.0->apache-beam==2.4.0.dev0)
Installing collected packages: apache-beam
Found existing installation: apache-beam 2.4.0.dev0
Not uninstalling apache-beam at <https://builds.apache.org/job/beam_PerformanceTests_TFRecordIOIT/ws/src/sdks/python,> outside environment <https://builds.apache.org/job/beam_PerformanceTests_TFRecordIOIT/ws/.env>
Running setup.py develop for apache-beam
Successfully installed apache-beam
[beam_PerformanceTests_TFRecordIOIT] $ /bin/bash -xe /tmp/jenkins5951771631745763901.sh
+ .env/bin/python PerfKitBenchmarker/pkb.py --project=apache-beam-testing --dpb_log_level=INFO --maven_binary=/home/jenkins/tools/maven/latest/bin/mvn --bigquery_table=beam_performance.tfrecordioit_pkb_results --temp_dir=<https://builds.apache.org/job/beam_PerformanceTests_TFRecordIOIT/ws/> --official=true --benchmarks=beam_integration_benchmark --beam_it_timeout=1200 --beam_it_profile=io-it --beam_prebuilt=true --beam_sdk=java --beam_it_module=sdks/java/io/file-based-io-tests --beam_it_class=org.apache.beam.sdk.io.tfrecord.TFRecordIOIT '--beam_it_options=[--project=apache-beam-testing,--tempRoot=gs://temp-storage-for-perf-tests,--numberOfRecords=1000000,--filenamePrefix=gs://temp-storage-for-perf-tests/beam_PerformanceTests_TFRecordIOIT/93/]' '--beam_extra_mvn_properties=[filesystem=gcs]'
2018-02-02 20:32:30,616 240abbd7 MainThread INFO Verbose logging to: <https://builds.apache.org/job/beam_PerformanceTests_TFRecordIOIT/ws/runs/240abbd7/pkb.log>
2018-02-02 20:32:30,616 240abbd7 MainThread INFO PerfKitBenchmarker version: v1.12.0-260-ge324e61
2018-02-02 20:32:30,616 240abbd7 MainThread INFO Flag values:
--beam_extra_mvn_properties=[filesystem=gcs]
--beam_it_class=org.apache.beam.sdk.io.tfrecord.TFRecordIOIT
--beam_it_timeout=1200
--beam_sdk=java
--temp_dir=<https://builds.apache.org/job/beam_PerformanceTests_TFRecordIOIT/ws/>
--maven_binary=/home/jenkins/tools/maven/latest/bin/mvn
--beam_it_options=[--project=apache-beam-testing,--tempRoot=gs://temp-storage-for-perf-tests,--numberOfRecords=1000000,--filenamePrefix=gs://temp-storage-for-perf-tests/beam_PerformanceTests_TFRecordIOIT/93/]
--beam_prebuilt
--project=apache-beam-testing
--bigquery_table=beam_performance.tfrecordioit_pkb_results
--official
--beam_it_module=sdks/java/io/file-based-io-tests
--dpb_log_level=INFO
--beam_it_profile=io-it
--benchmarks=beam_integration_benchmark
2018-02-02 20:32:31,030 240abbd7 MainThread WARNING The key "flags" was not in the default config, but was in user overrides. This may indicate a typo.
2018-02-02 20:32:31,030 240abbd7 MainThread INFO Initializing the edw service decoder
2018-02-02 20:32:31,143 240abbd7 MainThread beam_integration_benchmark(1/1) INFO Provisioning resources for benchmark beam_integration_benchmark
2018-02-02 20:32:31,146 240abbd7 MainThread beam_integration_benchmark(1/1) INFO Preparing benchmark beam_integration_benchmark
2018-02-02 20:32:31,147 240abbd7 MainThread beam_integration_benchmark(1/1) INFO Running: git clone https://github.com/apache/beam.git
2018-02-02 20:32:37,137 240abbd7 MainThread beam_integration_benchmark(1/1) INFO Running benchmark beam_integration_benchmark
2018-02-02 20:32:37,143 240abbd7 MainThread beam_integration_benchmark(1/1) INFO Running: /home/jenkins/tools/maven/latest/bin/mvn -e verify -Dit.test=org.apache.beam.sdk.io.tfrecord.TFRecordIOIT -DskipITs=false -pl sdks/java/io/file-based-io-tests -Pio-it -Pdataflow-runner -Dfilesystem=gcs -DintegrationTestPipelineOptions=["--project=apache-beam-testing","--tempRoot=gs://temp-storage-for-perf-tests","--numberOfRecords=1000000","--filenamePrefix=gs://temp-storage-for-perf-tests/beam_PerformanceTests_TFRecordIOIT/93/","--runner=TestDataflowRunner"]
2018-02-02 20:32:57,942 240abbd7 MainThread beam_integration_benchmark(1/1) INFO Ran /home/jenkins/tools/maven/latest/bin/mvn -e verify -Dit.test=org.apache.beam.sdk.io.tfrecord.TFRecordIOIT -DskipITs=false -pl sdks/java/io/file-based-io-tests -Pio-it -Pdataflow-runner -Dfilesystem=gcs -DintegrationTestPipelineOptions=["--project=apache-beam-testing","--tempRoot=gs://temp-storage-for-perf-tests","--numberOfRecords=1000000","--filenamePrefix=gs://temp-storage-for-perf-tests/beam_PerformanceTests_TFRecordIOIT/93/","--runner=TestDataflowRunner"]. Got return code (1).
STDOUT: [INFO] Error stacktraces are turned on.
[INFO] Scanning for projects...
[WARNING]
[WARNING] Some problems were encountered while building the effective model for org.apache.beam:beam-runners-java-fn-execution:jar:2.4.0-SNAPSHOT
[WARNING] 'dependencies.dependency.(groupId:artifactId:type:classifier)' must be unique: com.google.protobuf:protobuf-java:jar -> duplicate declaration of version (?) @ org.apache.beam:beam-runners-java-fn-execution:[unknown-version], <https://builds.apache.org/job/beam_PerformanceTests_TFRecordIOIT/ws/runs/240abbd7/beam/runners/java-fn-execution/pom.xml,> line 66, column 17
[WARNING] 'dependencies.dependency.(groupId:artifactId:type:classifier)' must be unique: org.apache.beam:beam-runners-core-construction-java:jar -> duplicate declaration of version (?) @ org.apache.beam:beam-runners-java-fn-execution:[unknown-version], <https://builds.apache.org/job/beam_PerformanceTests_TFRecordIOIT/ws/runs/240abbd7/beam/runners/java-fn-execution/pom.xml,> line 115, column 17
[WARNING]
[WARNING] It is highly recommended to fix these problems because they threaten the stability of your build.
[WARNING]
[WARNING] For this reason, future Maven versions might no longer support building such malformed projects.
[WARNING]
[INFO] ------------------------------------------------------------------------
[INFO] Detecting the operating system and CPU architecture
[INFO] ------------------------------------------------------------------------
[INFO] os.detected.name: linux
[INFO] os.detected.arch: x86_64
[INFO] os.detected.version: 4.4
[INFO] os.detected.version.major: 4
[INFO] os.detected.version.minor: 4
[INFO] os.detected.release: ubuntu
[INFO] os.detected.release.version: 14.04
[INFO] os.detected.release.like.ubuntu: true
[INFO] os.detected.release.like.debian: true
[INFO] os.detected.classifier: linux-x86_64
[INFO]
[INFO] ------------------------------------------------------------------------
[INFO] Building Apache Beam :: SDKs :: Java :: IO :: File-based-io-tests 2.4.0-SNAPSHOT
[INFO] ------------------------------------------------------------------------
[INFO]
[INFO] --- maven-enforcer-plugin:3.0.0-M1:enforce (enforce-maven-version) @ beam-sdks-java-io-file-based-io-tests ---
[INFO]
[INFO] --- maven-enforcer-plugin:3.0.0-M1:enforce (enforce) @ beam-sdks-java-io-file-based-io-tests ---
[INFO]
[INFO] --- maven-enforcer-plugin:3.0.0-M1:enforce (enforce-banned-dependencies) @ beam-sdks-java-io-file-based-io-tests ---
[INFO]
[INFO] --- maven-remote-resources-plugin:1.5:process (process-resource-bundles) @ beam-sdks-java-io-file-based-io-tests ---
[INFO]
[INFO] --- maven-resources-plugin:3.0.2:resources (default-resources) @ beam-sdks-java-io-file-based-io-tests ---
[INFO] Using 'UTF-8' encoding to copy filtered resources.
[INFO] skip non existing resourceDirectory <https://builds.apache.org/job/beam_PerformanceTests_TFRecordIOIT/ws/runs/240abbd7/beam/sdks/java/io/file-based-io-tests/src/main/resources>
[INFO] Copying 3 resources
[INFO]
[INFO] --- maven-compiler-plugin:3.7.0:compile (default-compile) @ beam-sdks-java-io-file-based-io-tests ---
[INFO] No sources to compile
[INFO]
[INFO] --- maven-resources-plugin:3.0.2:testResources (default-testResources) @ beam-sdks-java-io-file-based-io-tests ---
[INFO] Using 'UTF-8' encoding to copy filtered resources.
[INFO] skip non existing resourceDirectory <https://builds.apache.org/job/beam_PerformanceTests_TFRecordIOIT/ws/runs/240abbd7/beam/sdks/java/io/file-based-io-tests/src/test/resources>
[INFO] Copying 3 resources
[INFO]
[INFO] --- maven-compiler-plugin:3.7.0:testCompile (default-testCompile) @ beam-sdks-java-io-file-based-io-tests ---
[INFO] Changes detected - recompiling the module!
[INFO] Compiling 4 source files to <https://builds.apache.org/job/beam_PerformanceTests_TFRecordIOIT/ws/runs/240abbd7/beam/sdks/java/io/file-based-io-tests/target/test-classes>
[INFO] <https://builds.apache.org/job/beam_PerformanceTests_TFRecordIOIT/ws/runs/240abbd7/beam/sdks/java/io/file-based-io-tests/src/test/java/org/apache/beam/sdk/io/tfrecord/TFRecordIOIT.java>: Some input files use or override a deprecated API.
[INFO] <https://builds.apache.org/job/beam_PerformanceTests_TFRecordIOIT/ws/runs/240abbd7/beam/sdks/java/io/file-based-io-tests/src/test/java/org/apache/beam/sdk/io/tfrecord/TFRecordIOIT.java>: Recompile with -Xlint:deprecation for details.
[INFO]
[INFO] --- maven-checkstyle-plugin:3.0.0:check (default) @ beam-sdks-java-io-file-based-io-tests ---
[INFO] ------------------------------------------------------------------------
[INFO] BUILD FAILURE
[INFO] ------------------------------------------------------------------------
[INFO] Total time: 19.072 s
[INFO] Finished at: 2018-02-02T20:32:57Z
[INFO] Final Memory: 73M/928M
[INFO] ------------------------------------------------------------------------
[ERROR] Failed to execute goal org.apache.maven.plugins:maven-checkstyle-plugin:3.0.0:check (default) on project beam-sdks-java-io-file-based-io-tests: Failed during checkstyle configuration: SuppressionCommentFilter is not allowed as a child in Checker -> [Help 1]
org.apache.maven.lifecycle.LifecycleExecutionException: Failed to execute goal org.apache.maven.plugins:maven-checkstyle-plugin:3.0.0:check (default) on project beam-sdks-java-io-file-based-io-tests: Failed during checkstyle configuration
at org.apache.maven.lifecycle.internal.MojoExecutor.execute (MojoExecutor.java:213)
at org.apache.maven.lifecycle.internal.MojoExecutor.execute (MojoExecutor.java:154)
at org.apache.maven.lifecycle.internal.MojoExecutor.execute (MojoExecutor.java:146)
at org.apache.maven.lifecycle.internal.LifecycleModuleBuilder.buildProject (LifecycleModuleBuilder.java:117)
at org.apache.maven.lifecycle.internal.LifecycleModuleBuilder.buildProject (LifecycleModuleBuilder.java:81)
at org.apache.maven.lifecycle.internal.builder.singlethreaded.SingleThreadedBuilder.build (SingleThreadedBuilder.java:51)
at org.apache.maven.lifecycle.internal.LifecycleStarter.execute (LifecycleStarter.java:128)
at org.apache.maven.DefaultMaven.doExecute (DefaultMaven.java:309)
at org.apache.maven.DefaultMaven.doExecute (DefaultMaven.java:194)
at org.apache.maven.DefaultMaven.execute (DefaultMaven.java:107)
at org.apache.maven.cli.MavenCli.execute (MavenCli.java:955)
at org.apache.maven.cli.MavenCli.doMain (MavenCli.java:290)
at org.apache.maven.cli.MavenCli.main (MavenCli.java:194)
at sun.reflect.NativeMethodAccessorImpl.invoke0 (Native Method)
at sun.reflect.NativeMethodAccessorImpl.invoke (NativeMethodAccessorImpl.java:62)
at sun.reflect.DelegatingMethodAccessorImpl.invoke (DelegatingMethodAccessorImpl.java:43)
at java.lang.reflect.Method.invoke (Method.java:498)
at org.codehaus.plexus.classworlds.launcher.Launcher.launchEnhanced (Launcher.java:289)
at org.codehaus.plexus.classworlds.launcher.Launcher.launch (Launcher.java:229)
at org.codehaus.plexus.classworlds.launcher.Launcher.mainWithExitCode (Launcher.java:415)
at org.codehaus.plexus.classworlds.launcher.Launcher.main (Launcher.java:356)
Caused by: org.apache.maven.plugin.MojoExecutionException: Failed during checkstyle configuration
at org.apache.maven.plugins.checkstyle.CheckstyleViolationCheckMojo.execute (CheckstyleViolationCheckMojo.java:534)
at org.apache.maven.plugin.DefaultBuildPluginManager.executeMojo (DefaultBuildPluginManager.java:134)
at org.apache.maven.lifecycle.internal.MojoExecutor.execute (MojoExecutor.java:208)
at org.apache.maven.lifecycle.internal.MojoExecutor.execute (MojoExecutor.java:154)
at org.apache.maven.lifecycle.internal.MojoExecutor.execute (MojoExecutor.java:146)
at org.apache.maven.lifecycle.internal.LifecycleModuleBuilder.buildProject (LifecycleModuleBuilder.java:117)
at org.apache.maven.lifecycle.internal.LifecycleModuleBuilder.buildProject (LifecycleModuleBuilder.java:81)
at org.apache.maven.lifecycle.internal.builder.singlethreaded.SingleThreadedBuilder.build (SingleThreadedBuilder.java:51)
at org.apache.maven.lifecycle.internal.LifecycleStarter.execute (LifecycleStarter.java:128)
at org.apache.maven.DefaultMaven.doExecute (DefaultMaven.java:309)
at org.apache.maven.DefaultMaven.doExecute (DefaultMaven.java:194)
at org.apache.maven.DefaultMaven.execute (DefaultMaven.java:107)
at org.apache.maven.cli.MavenCli.execute (MavenCli.java:955)
at org.apache.maven.cli.MavenCli.doMain (MavenCli.java:290)
at org.apache.maven.cli.MavenCli.main (MavenCli.java:194)
at sun.reflect.NativeMethodAccessorImpl.invoke0 (Native Method)
at sun.reflect.NativeMethodAccessorImpl.invoke (NativeMethodAccessorImpl.java:62)
at sun.reflect.DelegatingMethodAccessorImpl.invoke (DelegatingMethodAccessorImpl.java:43)
at java.lang.reflect.Method.invoke (Method.java:498)
at org.codehaus.plexus.classworlds.launcher.Launcher.launchEnhanced (Launcher.java:289)
at org.codehaus.plexus.classworlds.launcher.Launcher.launch (Launcher.java:229)
at org.codehaus.plexus.classworlds.launcher.Launcher.mainWithExitCode (Launcher.java:415)
at org.codehaus.plexus.classworlds.launcher.Launcher.main (Launcher.java:356)
Caused by: com.puppycrawl.tools.checkstyle.api.CheckstyleException: SuppressionCommentFilter is not allowed as a child in Checker
at com.puppycrawl.tools.checkstyle.Checker.setupChild (Checker.java:484)
at com.puppycrawl.tools.checkstyle.api.AutomaticBean.configure (AutomaticBean.java:197)
at org.apache.maven.plugins.checkstyle.exec.DefaultCheckstyleExecutor.executeCheckstyle (DefaultCheckstyleExecutor.java:214)
at org.apache.maven.plugins.checkstyle.CheckstyleViolationCheckMojo.execute (CheckstyleViolationCheckMojo.java:529)
at org.apache.maven.plugin.DefaultBuildPluginManager.executeMojo (DefaultBuildPluginManager.java:134)
at org.apache.maven.lifecycle.internal.MojoExecutor.execute (MojoExecutor.java:208)
at org.apache.maven.lifecycle.internal.MojoExecutor.execute (MojoExecutor.java:154)
at org.apache.maven.lifecycle.internal.MojoExecutor.execute (MojoExecutor.java:146)
at org.apache.maven.lifecycle.internal.LifecycleModuleBuilder.buildProject (LifecycleModuleBuilder.java:117)
at org.apache.maven.lifecycle.internal.LifecycleModuleBuilder.buildProject (LifecycleModuleBuilder.java:81)
at org.apache.maven.lifecycle.internal.builder.singlethreaded.SingleThreadedBuilder.build (SingleThreadedBuilder.java:51)
at org.apache.maven.lifecycle.internal.LifecycleStarter.execute (LifecycleStarter.java:128)
at org.apache.maven.DefaultMaven.doExecute (DefaultMaven.java:309)
at org.apache.maven.DefaultMaven.doExecute (DefaultMaven.java:194)
at org.apache.maven.DefaultMaven.execute (DefaultMaven.java:107)
at org.apache.maven.cli.MavenCli.execute (MavenCli.java:955)
at org.apache.maven.cli.MavenCli.doMain (MavenCli.java:290)
at org.apache.maven.cli.MavenCli.main (MavenCli.java:194)
at sun.reflect.NativeMethodAccessorImpl.invoke0 (Native Method)
at sun.reflect.NativeMethodAccessorImpl.invoke (NativeMethodAccessorImpl.java:62)
at sun.reflect.DelegatingMethodAccessorImpl.invoke (DelegatingMethodAccessorImpl.java:43)
at java.lang.reflect.Method.invoke (Method.java:498)
at org.codehaus.plexus.classworlds.launcher.Launcher.launchEnhanced (Launcher.java:289)
at org.codehaus.plexus.classworlds.launcher.Launcher.launch (Launcher.java:229)
at org.codehaus.plexus.classworlds.launcher.Launcher.mainWithExitCode (Launcher.java:415)
at org.codehaus.plexus.classworlds.launcher.Launcher.main (Launcher.java:356)
[ERROR]
[ERROR] Re-run Maven using the -X switch to enable full debug logging.
[ERROR]
[ERROR] For more information about the errors and possible solutions, please read the following articles:
[ERROR] [Help 1] http://cwiki.apache.org/confluence/display/MAVEN/MojoExecutionException
STDERR:
2018-02-02 20:32:57,943 240abbd7 MainThread beam_integration_benchmark(1/1) ERROR Error during benchmark beam_integration_benchmark
Traceback (most recent call last):
File "<https://builds.apache.org/job/beam_PerformanceTests_TFRecordIOIT/ws/PerfKitBenchmarker/perfkitbenchmarker/pkb.py",> line 601, in RunBenchmark
DoRunPhase(spec, collector, detailed_timer)
File "<https://builds.apache.org/job/beam_PerformanceTests_TFRecordIOIT/ws/PerfKitBenchmarker/perfkitbenchmarker/pkb.py",> line 504, in DoRunPhase
samples = spec.BenchmarkRun(spec)
File "<https://builds.apache.org/job/beam_PerformanceTests_TFRecordIOIT/ws/PerfKitBenchmarker/perfkitbenchmarker/linux_benchmarks/beam_integration_benchmark.py",> line 159, in Run
job_type=job_type)
File "<https://builds.apache.org/job/beam_PerformanceTests_TFRecordIOIT/ws/PerfKitBenchmarker/perfkitbenchmarker/providers/gcp/gcp_dpb_dataflow.py",> line 90, in SubmitJob
assert retcode == 0, "Integration Test Failed."
AssertionError: Integration Test Failed.
2018-02-02 20:32:57,944 240abbd7 MainThread beam_integration_benchmark(1/1) INFO Cleaning up benchmark beam_integration_benchmark
2018-02-02 20:32:57,945 240abbd7 MainThread beam_integration_benchmark(1/1) ERROR Benchmark 1/1 beam_integration_benchmark (UID: beam_integration_benchmark0) failed. Execution will continue.
2018-02-02 20:32:57,965 240abbd7 MainThread INFO Benchmark run statuses:
---------------------------------------------------------------
Name UID Status
---------------------------------------------------------------
beam_integration_benchmark beam_integration_benchmark0 FAILED
---------------------------------------------------------------
Success rate: 0.00% (0/1)
2018-02-02 20:32:57,966 240abbd7 MainThread INFO Complete logs can be found at: <https://builds.apache.org/job/beam_PerformanceTests_TFRecordIOIT/ws/runs/240abbd7/pkb.log>
2018-02-02 20:32:57,966 240abbd7 MainThread INFO Completion statuses can be found at: <https://builds.apache.org/job/beam_PerformanceTests_TFRecordIOIT/ws/runs/240abbd7/completion_statuses.json>
Build step 'Execute shell' marked build as failure
Jenkins build is back to normal :
beam_PerformanceTests_TFRecordIOIT #94
Posted by Apache Jenkins Server <je...@builds.apache.org>.
See <https://builds.apache.org/job/beam_PerformanceTests_TFRecordIOIT/94/display/redirect?page=changes>