You are viewing a plain text version of this content. The canonical link for it is here.
Posted to builds@beam.apache.org by Apache Jenkins Server <je...@builds.apache.org> on 2023/05/15 20:56:25 UTC
Build failed in Jenkins: beam_PostCommit_Py_ValCont_with_RC #123
See <https://ci-beam.apache.org/job/beam_PostCommit_Py_ValCont_with_RC/123/display/redirect>
Changes:
------------------------------------------
[...truncated 2.74 MB...]
#16 1.134 objsize==0.6.1
#16 1.134 opt-einsum==3.3.0
#16 1.134 orjson==3.8.12
#16 1.134 overrides==6.5.0
#16 1.134 packaging==23.1
#16 1.134 pandas==1.5.3
#16 1.134 parameterized==0.9.0
#16 1.134 pip==23.1.2
#16 1.134 pluggy==1.0.0
#16 1.134 proto-plus==1.22.2
#16 1.134 protobuf==4.22.5
#16 1.134 psycopg2-binary==2.9.6
#16 1.134 pyarrow==11.0.0
#16 1.134 pyasn1==0.5.0
#16 1.134 pyasn1-modules==0.3.0
#16 1.134 pycparser==2.21
#16 1.134 pydot==1.4.2
#16 1.134 PyHamcrest==2.0.4
#16 1.134 pymongo==4.4.0b0
#16 1.134 PyMySQL==1.0.3
#16 1.134 pyparsing==3.1.0b1
#16 1.134 pytest==7.3.1
#16 1.134 pytest-timeout==2.1.0
#16 1.134 pytest-xdist==3.3.0
#16 1.134 python-dateutil==2.8.2
#16 1.134 python-snappy==0.6.1
#16 1.134 pytz==2023.3
#16 1.134 PyYAML==6.0
#16 1.134 regex==2023.5.5
#16 1.134 requests==2.30.0
#16 1.134 requests-mock==1.10.0
#16 1.134 requests-oauthlib==1.3.1
#16 1.134 rsa==4.9
#16 1.134 scikit-learn==1.2.2
#16 1.134 scipy==1.10.1
#16 1.134 setuptools==67.7.2
#16 1.134 six==1.16.0
#16 1.134 sortedcontainers==2.4.0
#16 1.134 soupsieve==2.4.1
#16 1.134 SQLAlchemy==1.4.48
#16 1.134 sqlparse==0.4.4
#16 1.134 tenacity==8.2.2
#16 1.134 tensorboard==2.13.0
#16 1.134 tensorboard-data-server==0.7.0
#16 1.134 tensorflow==2.13.0rc0
#16 1.134 tensorflow-estimator==2.13.0rc0
#16 1.134 tensorflow-io-gcs-filesystem==0.32.0
#16 1.134 termcolor==2.3.0
#16 1.134 testcontainers==3.7.1
#16 1.134 threadpoolctl==3.1.0
#16 1.134 tomli==2.0.1
#16 1.134 tqdm==4.65.0
#16 1.134 typing_extensions==4.5.0
#16 1.134 urllib3==1.26.15
#16 1.134 websocket-client==1.5.1
#16 1.134 Werkzeug==2.3.4
#16 1.134 wheel==0.40.0
#16 1.134 wrapt==1.14.1
#16 1.134 zipp==3.15.0
#16 1.134 zstandard==0.21.0
#16 DONE 4.0s
#17 [beam 13/16] COPY target/LICENSE /opt/apache/beam/
#17 DONE 0.1s
#18 [beam 14/16] COPY target/LICENSE.python /opt/apache/beam/
#18 DONE 0.1s
#19 [beam 15/16] COPY target/NOTICE /opt/apache/beam/
#19 DONE 0.1s
#20 [beam 16/16] COPY target/launcher/linux_amd64/boot /opt/apache/beam/
#20 DONE 0.2s
#21 [third_party_licenses 1/4] COPY target/license_scripts /tmp/license_scripts/
#21 DONE 0.1s
#22 [third_party_licenses 2/4] COPY target/go-licenses/* /opt/apache/beam/third_party_licenses/golang/
#22 DONE 0.1s
#23 [third_party_licenses 3/4] COPY target/license_scripts /tmp/license_scripts/
#23 DONE 0.1s
#24 [third_party_licenses 4/4] RUN if [ "true" = "true" ] ; then pip install 'pip-licenses<5' pyyaml tenacity && python /tmp/license_scripts/pull_licenses_py.py ; fi
#24 1.238 Collecting pip-licenses<5
#24 1.315 Downloading pip_licenses-4.3.1-py3-none-any.whl (19 kB)
#24 1.328 Requirement already satisfied: pyyaml in /usr/local/lib/python3.9/site-packages (6.0)
#24 1.329 Requirement already satisfied: tenacity in /usr/local/lib/python3.9/site-packages (8.2.2)
#24 1.391 Collecting prettytable>=2.3.0 (from pip-licenses<5)
#24 1.408 Downloading prettytable-3.7.0-py3-none-any.whl (27 kB)
#24 1.469 Collecting wcwidth (from prettytable>=2.3.0->pip-licenses<5)
#24 1.484 Downloading wcwidth-0.2.6-py2.py3-none-any.whl (29 kB)
#24 2.698 Installing collected packages: wcwidth, prettytable, pip-licenses
#24 2.876 Successfully installed pip-licenses-4.3.1 prettytable-3.7.0 wcwidth-0.2.6
#24 2.877 WARNING: Running pip as the 'root' user can result in broken permissions and conflicting behaviour with the system package manager. It is recommended to use a virtual environment instead: https://pip.pypa.io/warnings/venv
#24 9.678 Skip pulling license for bs4
#24 9.678 Traceback (most recent call last):
#24 9.678 File "/tmp/license_scripts/pull_licenses_py.py", line 190, in <module>
#24 9.679 raise RuntimeError(
#24 9.679 RuntimeError: Could not retrieve licences for packages ['keras'] in Python3.9 environment.
#24 9.679 These licenses were not able to be pulled automatically. Please search code source of the dependencies on the internet and add urls to RAW license file at sdks/python/container/license_scripts/dep_urls_py.yaml for each missing license and rerun the test. If no such urls can be found, you need to manually add LICENSE and NOTICE (if available) files at sdks/python/container/license_scripts/manual_licenses/{dep}/ and add entries to sdks/python/container/license_scripts/dep_urls_py.yaml.
#24 ERROR: executor failed running [/bin/sh -c if [ "$pull_licenses" = "true" ] ; then pip install 'pip-licenses<5' pyyaml tenacity && python /tmp/license_scripts/pull_licenses_py.py ; fi]: exit code: 1
------
> [third_party_licenses 4/4] RUN if [ "true" = "true" ] ; then pip install 'pip-licenses<5' pyyaml tenacity && python /tmp/license_scripts/pull_licenses_py.py ; fi:
#24 1.484 Downloading wcwidth-0.2.6-py2.py3-none-any.whl (29 kB)
#24 2.698 Installing collected packages: wcwidth, prettytable, pip-licenses
#24 2.876 Successfully installed pip-licenses-4.3.1 prettytable-3.7.0 wcwidth-0.2.6
#24 2.877 WARNING: Running pip as the 'root' user can result in broken permissions and conflicting behaviour with the system package manager. It is recommended to use a virtual environment instead: https://pip.pypa.io/warnings/venv
#24 9.678 Skip pulling license for bs4
#24 9.678 Traceback (most recent call last):
#24 9.678 File "/tmp/license_scripts/pull_licenses_py.py", line 190, in <module>
#24 9.679 raise RuntimeError(
#24 9.679 RuntimeError: Could not retrieve licences for packages ['keras'] in Python3.9 environment.
#24 9.679 These licenses were not able to be pulled automatically. Please search code source of the dependencies on the internet and add urls to RAW license file at sdks/python/container/license_scripts/dep_urls_py.yaml for each missing license and rerun the test. If no such urls can be found, you need to manually add LICENSE and NOTICE (if available) files at sdks/python/container/license_scripts/manual_licenses/{dep}/ and add entries to sdks/python/container/license_scripts/dep_urls_py.yaml.
------
ERROR: failed to solve: executor failed running [/bin/sh -c if [ "$pull_licenses" = "true" ] ; then pip install 'pip-licenses<5' pyyaml tenacity && python /tmp/license_scripts/pull_licenses_py.py ; fi]: exit code: 1
> Task :sdks:python:container:py39:docker FAILED
> Task :sdks:python:test-suites:dataflow:py37:validatesContainer
function cleanup_container {
# Delete the container locally and remotely
docker rmi $CONTAINER:$TAG || echo "Failed to remove container image"
for image in $(docker images --format '{{.Repository}}:{{.Tag}}' | grep $PREBUILD_SDK_CONTAINER_REGISTRY_PATH)
do docker rmi $image || echo "Failed to remove prebuilt sdk container image"
done
gcloud --quiet container images delete $CONTAINER:$TAG || echo "Failed to delete container"
for digest in $(gcloud container images list-tags $PREBUILD_SDK_CONTAINER_REGISTRY_PATH/beam_python_prebuilt_sdk --format="get(digest)")
do gcloud container images delete $PREBUILD_SDK_CONTAINER_REGISTRY_PATH/beam_python_prebuilt_sdk@$digest --force-delete-tags --quiet || echo "Failed to remove prebuilt sdk container image"
done
echo "Removed the container"
}
trap cleanup_container EXIT
echo ">>> Successfully built and push container $CONTAINER"
cd sdks/python
SDK_LOCATION=$2
# Run ValidatesRunner tests on Google Cloud Dataflow service
echo ">>> RUNNING DATAFLOW RUNNER VALIDATESCONTAINER TEST"
pytest -o junit_suite_name=$IMAGE_NAME \
-m="it_validatescontainer" \
--show-capture=no \
--numprocesses=1 \
--timeout=1800 \
--junitxml=$XUNIT_FILE \
--ignore-glob '.*py3\d?\.py$' \
--log-cli-level=INFO \
--test-pipeline-options=" \
--runner=TestDataflowRunner \
--project=$PROJECT \
--region=$REGION \
--sdk_container_image=$CONTAINER:$TAG \
--staging_location=$GCS_LOCATION/staging-validatesrunner-test \
--temp_location=$GCS_LOCATION/temp-validatesrunner-test \
--output=$GCS_LOCATION/output \
--sdk_location=$SDK_LOCATION \
--num_workers=1 \
--docker_registry_push_url=$PREBUILD_SDK_CONTAINER_REGISTRY_PATH"
echo ">>> SUCCESS DATAFLOW RUNNER VALIDATESCONTAINER TEST"
cleanup_container
WARNING: Successfully resolved tag to sha256, but it is recommended to use sha256 directly.
Digests:
- us.gcr.io/apache-beam-testing/jenkins/beam_python3.7_sdk@sha256:3546211fe0184704cdebcc7ad5c18c2d8ec09669055ca88526d6b6991dcc552d
Associated tags:
- 20230515-202720945043406
Tags:
- us.gcr.io/apache-beam-testing/jenkins/beam_python3.7_sdk:20230515-202720945043406
Deleted [us.gcr.io/apache-beam-testing/jenkins/beam_python3.7_sdk:20230515-202720945043406].
Deleted [us.gcr.io/apache-beam-testing/jenkins/beam_python3.7_sdk@sha256:3546211fe0184704cdebcc7ad5c18c2d8ec09669055ca88526d6b6991dcc552d].
Digests:
- us.gcr.io/apache-beam-testing/jenkins/prebuild_python37_sdk/beam_python_prebuilt_sdk@sha256:4c6c3199a9dd9c7e4459963a6ddf191a085f72ee1c8342b109751bcf2228b1f8
Associated tags:
- 6738be8d-b50e-4bb3-80ab-34f26e0e9f80
Deleted [us.gcr.io/apache-beam-testing/jenkins/prebuild_python37_sdk/beam_python_prebuilt_sdk:6738be8d-b50e-4bb3-80ab-34f26e0e9f80].
Deleted [us.gcr.io/apache-beam-testing/jenkins/prebuild_python37_sdk/beam_python_prebuilt_sdk@sha256:4c6c3199a9dd9c7e4459963a6ddf191a085f72ee1c8342b109751bcf2228b1f8].
Digests:
- us.gcr.io/apache-beam-testing/jenkins/prebuild_python37_sdk/beam_python_prebuilt_sdk@sha256:6e8bb6837e722e13515f22dfff88f89ce4616b680f48331bd17bb643206abb9b
Associated tags:
- 34833749-1c9b-4a32-9b32-98ec1becccd8
Deleted [us.gcr.io/apache-beam-testing/jenkins/prebuild_python37_sdk/beam_python_prebuilt_sdk:34833749-1c9b-4a32-9b32-98ec1becccd8].
Deleted [us.gcr.io/apache-beam-testing/jenkins/prebuild_python37_sdk/beam_python_prebuilt_sdk@sha256:6e8bb6837e722e13515f22dfff88f89ce4616b680f48331bd17bb643206abb9b].
FAILURE: Build completed with 4 failures.
1: Task failed with an exception.
-----------
* What went wrong:
Execution failed for task ':sdks:python:container:py311:docker'.
> Process 'command 'docker'' finished with non-zero exit value 1
* Try:
> Run with --stacktrace option to get the stack trace.
> Run with --info or --debug option to get more log output.
==============================================================================
2: Task failed with an exception.
-----------
* What went wrong:
Execution failed for task ':sdks:python:container:py310:docker'.
> Process 'command 'docker'' finished with non-zero exit value 1
* Try:
> Run with --stacktrace option to get the stack trace.
> Run with --info or --debug option to get more log output.
==============================================================================
3: Task failed with an exception.
-----------
* What went wrong:
Execution failed for task ':sdks:python:container:py38:docker'.
> Process 'command 'docker'' finished with non-zero exit value 1
* Try:
> Run with --stacktrace option to get the stack trace.
> Run with --info or --debug option to get more log output.
==============================================================================
4: Task failed with an exception.
-----------
* What went wrong:
Execution failed for task ':sdks:python:container:py39:docker'.
> Process 'command 'docker'' finished with non-zero exit value 1
* Try:
> Run with --stacktrace option to get the stack trace.
> Run with --info or --debug option to get more log output.
==============================================================================
* Get more help at https://help.gradle.org
Deprecated Gradle features were used in this build, making it incompatible with Gradle 8.0.
You can use '--warning-mode all' to show the individual deprecation warnings and determine if they come from your own scripts or plugins.
See https://docs.gradle.org/7.5.1/userguide/command_line_interface.html#sec:command_line_warnings
BUILD FAILED in 42m 55s
74 actionable tasks: 68 executed, 6 up-to-date
Publishing build scan...
https://ge.apache.org/s/tx3kuaeuivgps
Build step 'Invoke Gradle script' changed build result to FAILURE
Build step 'Invoke Gradle script' marked build as failure
---------------------------------------------------------------------
To unsubscribe, e-mail: builds-unsubscribe@beam.apache.org
For additional commands, e-mail: builds-help@beam.apache.org
Jenkins build is back to normal : beam_PostCommit_Py_ValCont_with_RC #126
Posted by Apache Jenkins Server <je...@builds.apache.org>.
See <https://ci-beam.apache.org/job/beam_PostCommit_Py_ValCont_with_RC/126/display/redirect?page=changes>
---------------------------------------------------------------------
To unsubscribe, e-mail: builds-unsubscribe@beam.apache.org
For additional commands, e-mail: builds-help@beam.apache.org
Build failed in Jenkins: beam_PostCommit_Py_ValCont_with_RC #125
Posted by Apache Jenkins Server <je...@builds.apache.org>.
See <https://ci-beam.apache.org/job/beam_PostCommit_Py_ValCont_with_RC/125/display/redirect>
Changes:
------------------------------------------
[...truncated 2.81 MB...]
#16 1.294 tqdm==4.65.0
#16 1.294 typing_extensions==4.5.0
#16 1.294 uritemplate==4.1.1
#16 1.294 urllib3==1.26.15
#16 1.294 websocket-client==1.5.1
#16 1.294 Werkzeug==2.3.4
#16 1.294 wheel==0.40.0
#16 1.294 wrapt==1.14.1
#16 1.294 zipp==3.15.0
#16 1.294 zstandard==0.21.0
#16 DONE 1.5s
#17 [beam 13/16] COPY target/LICENSE /opt/apache/beam/
#17 DONE 0.0s
#18 [beam 14/16] COPY target/LICENSE.python /opt/apache/beam/
#18 DONE 0.0s
#19 [beam 15/16] COPY target/NOTICE /opt/apache/beam/
#19 DONE 0.1s
#20 [beam 16/16] COPY target/launcher/linux_amd64/boot /opt/apache/beam/
#20 DONE 0.2s
#21 [third_party_licenses 1/4] COPY target/license_scripts /tmp/license_scripts/
#21 DONE 0.1s
#22 [third_party_licenses 2/4] COPY target/go-licenses/* /opt/apache/beam/third_party_licenses/golang/
#22 DONE 0.0s
#23 [third_party_licenses 3/4] COPY target/license_scripts /tmp/license_scripts/
#23 DONE 0.1s
#24 [third_party_licenses 4/4] RUN if [ "true" = "true" ] ; then pip install 'pip-licenses<5' pyyaml tenacity && python /tmp/license_scripts/pull_licenses_py.py ; fi
#24 1.527 Collecting pip-licenses<5
#24 1.600 Downloading pip_licenses-4.3.1-py3-none-any.whl (19 kB)
#24 1.611 Requirement already satisfied: pyyaml in /usr/local/lib/python3.9/site-packages (6.0)
#24 1.612 Requirement already satisfied: tenacity in /usr/local/lib/python3.9/site-packages (8.2.2)
#24 1.697 Collecting prettytable>=2.3.0 (from pip-licenses<5)
#24 1.717 Downloading prettytable-3.7.0-py3-none-any.whl (27 kB)
#24 1.796 Collecting wcwidth (from prettytable>=2.3.0->pip-licenses<5)
#24 1.815 Downloading wcwidth-0.2.6-py2.py3-none-any.whl (29 kB)
> Task :sdks:python:test-suites:dataflow:py37:validatesContainer
============================= test session starts ==============================
platform linux -- Python 3.7.12, pytest-7.3.1, pluggy-1.0.0
rootdir: <https://ci-beam.apache.org/job/beam_PostCommit_Py_ValCont_with_RC/ws/src/sdks/python>
configfile: pytest.ini
plugins: xdist-3.3.0, hypothesis-6.75.3, timeout-2.1.0, requests-mock-1.10.0
timeout: 1800.0s
timeout method: signal
timeout func_only: False
created: 1/1 worker
1 worker [5 items]
scheduling tests via LoadScheduling
apache_beam/examples/wordcount_it_test.py::WordCountIT::test_wordcount_fnapi_it
> Task :sdks:python:container:py39:docker FAILED
#24 3.587 Installing collected packages: wcwidth, prettytable, pip-licenses
#24 3.834 Successfully installed pip-licenses-4.3.1 prettytable-3.7.0 wcwidth-0.2.6
#24 3.835 WARNING: Running pip as the 'root' user can result in broken permissions and conflicting behaviour with the system package manager. It is recommended to use a virtual environment instead: https://pip.pypa.io/warnings/venv
#24 13.22 Skip pulling license for bs4
#24 13.22 Traceback (most recent call last):
#24 13.22 File "/tmp/license_scripts/pull_licenses_py.py", line 190, in <module>
#24 13.22 raise RuntimeError(
#24 13.22 RuntimeError: Could not retrieve licences for packages ['keras'] in Python3.9 environment.
#24 13.22 These licenses were not able to be pulled automatically. Please search code source of the dependencies on the internet and add urls to RAW license file at sdks/python/container/license_scripts/dep_urls_py.yaml for each missing license and rerun the test. If no such urls can be found, you need to manually add LICENSE and NOTICE (if available) files at sdks/python/container/license_scripts/manual_licenses/{dep}/ and add entries to sdks/python/container/license_scripts/dep_urls_py.yaml.
#24 ERROR: executor failed running [/bin/sh -c if [ "$pull_licenses" = "true" ] ; then pip install 'pip-licenses<5' pyyaml tenacity && python /tmp/license_scripts/pull_licenses_py.py ; fi]: exit code: 1
------
> [third_party_licenses 4/4] RUN if [ "true" = "true" ] ; then pip install 'pip-licenses<5' pyyaml tenacity && python /tmp/license_scripts/pull_licenses_py.py ; fi:
#24 1.815 Downloading wcwidth-0.2.6-py2.py3-none-any.whl (29 kB)
#24 3.587 Installing collected packages: wcwidth, prettytable, pip-licenses
#24 3.834 Successfully installed pip-licenses-4.3.1 prettytable-3.7.0 wcwidth-0.2.6
#24 3.835 WARNING: Running pip as the 'root' user can result in broken permissions and conflicting behaviour with the system package manager. It is recommended to use a virtual environment instead: https://pip.pypa.io/warnings/venv
#24 13.22 Skip pulling license for bs4
#24 13.22 Traceback (most recent call last):
#24 13.22 File "/tmp/license_scripts/pull_licenses_py.py", line 190, in <module>
#24 13.22 raise RuntimeError(
#24 13.22 RuntimeError: Could not retrieve licences for packages ['keras'] in Python3.9 environment.
#24 13.22 These licenses were not able to be pulled automatically. Please search code source of the dependencies on the internet and add urls to RAW license file at sdks/python/container/license_scripts/dep_urls_py.yaml for each missing license and rerun the test. If no such urls can be found, you need to manually add LICENSE and NOTICE (if available) files at sdks/python/container/license_scripts/manual_licenses/{dep}/ and add entries to sdks/python/container/license_scripts/dep_urls_py.yaml.
------
ERROR: failed to solve: executor failed running [/bin/sh -c if [ "$pull_licenses" = "true" ] ; then pip install 'pip-licenses<5' pyyaml tenacity && python /tmp/license_scripts/pull_licenses_py.py ; fi]: exit code: 1
> Task :sdks:python:test-suites:dataflow:py37:validatesContainer
[gw0] [ 20%] PASSED apache_beam/examples/wordcount_it_test.py::WordCountIT::test_wordcount_fnapi_it
apache_beam/examples/wordcount_it_test.py::WordCountIT::test_wordcount_it_with_prebuilt_sdk_container_cloud_build
[gw0] [ 40%] PASSED apache_beam/examples/wordcount_it_test.py::WordCountIT::test_wordcount_it_with_prebuilt_sdk_container_cloud_build
apache_beam/examples/wordcount_it_test.py::WordCountIT::test_wordcount_it_with_prebuilt_sdk_container_local_docker
[gw0] [ 60%] PASSED apache_beam/examples/wordcount_it_test.py::WordCountIT::test_wordcount_it_with_prebuilt_sdk_container_local_docker
apache_beam/examples/wordcount_it_test.py::WordCountIT::test_wordcount_it_with_use_sibling_sdk_workers
[gw0] [ 80%] PASSED apache_beam/examples/wordcount_it_test.py::WordCountIT::test_wordcount_it_with_use_sibling_sdk_workers
apache_beam/runners/dataflow/dataflow_exercise_metrics_pipeline_test.py::ExerciseMetricsPipelineTest::test_metrics_fnapi_it
[gw0] [100%] SKIPPED apache_beam/runners/dataflow/dataflow_exercise_metrics_pipeline_test.py::ExerciseMetricsPipelineTest::test_metrics_fnapi_it
=============================== warnings summary ===============================
../../build/gradleenv/-1734967052/lib/python3.7/site-packages/hdfs/config.py:15
../../build/gradleenv/-1734967052/lib/python3.7/site-packages/hdfs/config.py:15
<https://ci-beam.apache.org/job/beam_PostCommit_Py_ValCont_with_RC/ws/src/build/gradleenv/-1734967052/lib/python3.7/site-packages/hdfs/config.py>:15: DeprecationWarning: the imp module is deprecated in favour of importlib; see the module's documentation for alternative uses
from imp import load_source
../../build/gradleenv/-1734967052/lib/python3.7/site-packages/pkg_resources/__init__.py:121
../../build/gradleenv/-1734967052/lib/python3.7/site-packages/pkg_resources/__init__.py:121
<https://ci-beam.apache.org/job/beam_PostCommit_Py_ValCont_with_RC/ws/src/build/gradleenv/-1734967052/lib/python3.7/site-packages/pkg_resources/__init__.py>:121: DeprecationWarning: pkg_resources is deprecated as an API
warnings.warn("pkg_resources is deprecated as an API", DeprecationWarning)
../../build/gradleenv/-1734967052/lib/python3.7/site-packages/pkg_resources/__init__.py:2870: 36 warnings
<https://ci-beam.apache.org/job/beam_PostCommit_Py_ValCont_with_RC/ws/src/build/gradleenv/-1734967052/lib/python3.7/site-packages/pkg_resources/__init__.py>:2870: DeprecationWarning: Deprecated call to `pkg_resources.declare_namespace('google')`.
Implementing implicit namespace packages (as specified in PEP 420) is preferred to `pkg_resources.declare_namespace`. See https://setuptools.pypa.io/en/latest/references/keywords.html#keyword-namespace-packages
declare_namespace(pkg)
../../build/gradleenv/-1734967052/lib/python3.7/site-packages/pkg_resources/__init__.py:2870: 26 warnings
<https://ci-beam.apache.org/job/beam_PostCommit_Py_ValCont_with_RC/ws/src/build/gradleenv/-1734967052/lib/python3.7/site-packages/pkg_resources/__init__.py>:2870: DeprecationWarning: Deprecated call to `pkg_resources.declare_namespace('google.cloud')`.
Implementing implicit namespace packages (as specified in PEP 420) is preferred to `pkg_resources.declare_namespace`. See https://setuptools.pypa.io/en/latest/references/keywords.html#keyword-namespace-packages
declare_namespace(pkg)
../../build/gradleenv/-1734967052/lib/python3.7/site-packages/pkg_resources/__init__.py:2349
../../build/gradleenv/-1734967052/lib/python3.7/site-packages/pkg_resources/__init__.py:2349
../../build/gradleenv/-1734967052/lib/python3.7/site-packages/pkg_resources/__init__.py:2349
../../build/gradleenv/-1734967052/lib/python3.7/site-packages/pkg_resources/__init__.py:2349
../../build/gradleenv/-1734967052/lib/python3.7/site-packages/pkg_resources/__init__.py:2349
../../build/gradleenv/-1734967052/lib/python3.7/site-packages/pkg_resources/__init__.py:2349
../../build/gradleenv/-1734967052/lib/python3.7/site-packages/pkg_resources/__init__.py:2349
../../build/gradleenv/-1734967052/lib/python3.7/site-packages/pkg_resources/__init__.py:2349
<https://ci-beam.apache.org/job/beam_PostCommit_Py_ValCont_with_RC/ws/src/build/gradleenv/-1734967052/lib/python3.7/site-packages/pkg_resources/__init__.py>:2349: DeprecationWarning: Deprecated call to `pkg_resources.declare_namespace('google')`.
Implementing implicit namespace packages (as specified in PEP 420) is preferred to `pkg_resources.declare_namespace`. See https://setuptools.pypa.io/en/latest/references/keywords.html#keyword-namespace-packages
declare_namespace(parent)
../../build/gradleenv/-1734967052/lib/python3.7/site-packages/pkg_resources/__init__.py:2870
../../build/gradleenv/-1734967052/lib/python3.7/site-packages/pkg_resources/__init__.py:2870
<https://ci-beam.apache.org/job/beam_PostCommit_Py_ValCont_with_RC/ws/src/build/gradleenv/-1734967052/lib/python3.7/site-packages/pkg_resources/__init__.py>:2870: DeprecationWarning: Deprecated call to `pkg_resources.declare_namespace('google.logging')`.
Implementing implicit namespace packages (as specified in PEP 420) is preferred to `pkg_resources.declare_namespace`. See https://setuptools.pypa.io/en/latest/references/keywords.html#keyword-namespace-packages
declare_namespace(pkg)
../../build/gradleenv/-1734967052/lib/python3.7/site-packages/pkg_resources/__init__.py:2870
../../build/gradleenv/-1734967052/lib/python3.7/site-packages/pkg_resources/__init__.py:2870
<https://ci-beam.apache.org/job/beam_PostCommit_Py_ValCont_with_RC/ws/src/build/gradleenv/-1734967052/lib/python3.7/site-packages/pkg_resources/__init__.py>:2870: DeprecationWarning: Deprecated call to `pkg_resources.declare_namespace('google.iam')`.
Implementing implicit namespace packages (as specified in PEP 420) is preferred to `pkg_resources.declare_namespace`. See https://setuptools.pypa.io/en/latest/references/keywords.html#keyword-namespace-packages
declare_namespace(pkg)
../../build/gradleenv/-1734967052/lib/python3.7/site-packages/google/rpc/__init__.py:20
../../build/gradleenv/-1734967052/lib/python3.7/site-packages/google/rpc/__init__.py:20
<https://ci-beam.apache.org/job/beam_PostCommit_Py_ValCont_with_RC/ws/src/build/gradleenv/-1734967052/lib/python3.7/site-packages/google/rpc/__init__.py>:20: DeprecationWarning: Deprecated call to `pkg_resources.declare_namespace('google.rpc')`.
Implementing implicit namespace packages (as specified in PEP 420) is preferred to `pkg_resources.declare_namespace`. See https://setuptools.pypa.io/en/latest/references/keywords.html#keyword-namespace-packages
pkg_resources.declare_namespace(__name__)
-- Docs: https://docs.pytest.org/en/stable/how-to/capture-warnings.html
- generated xml file: <https://ci-beam.apache.org/job/beam_PostCommit_Py_ValCont_with_RC/ws/src/sdks/python/pytest-beam_python3.7_sdk.xml> -
=========== 4 passed, 10 skipped, 80 warnings in 1653.59s (0:27:33) ============
echo ">>> SUCCESS DATAFLOW RUNNER VALIDATESCONTAINER TEST"
>>> SUCCESS DATAFLOW RUNNER VALIDATESCONTAINER TEST
cleanup_container
Untagged: us.gcr.io/apache-beam-testing/jenkins/beam_python3.7_sdk:20230516-115737147428756
Untagged: us.gcr.io/apache-beam-testing/jenkins/beam_python3.7_sdk@sha256:6b353f86488a59c5d4fcafb4f9f0bae5e82e2b015bc4a3c18f75021f3afd8b46
Untagged: us.gcr.io/apache-beam-testing/jenkins/prebuild_python37_sdk/beam_python_prebuilt_sdk:7368275e-e046-4762-91a3-e94e2a8c928f
Untagged: us.gcr.io/apache-beam-testing/jenkins/prebuild_python37_sdk/beam_python_prebuilt_sdk@sha256:4ecca08651e69d83c7e16fc544214f72d016dc9b50d0ccb7f208018a368bfbd8
Deleted: sha256:0b8533cc41a2cfb651aa111792df98e7cec4d0d34003d267612ca5ae5b612493
Deleted: sha256:6374000f9920254c158fe85021fdea11f292be0a95626c505cc64e2a21f4d092
Deleted: sha256:feb235273d0d10bc3c7149c17da18b0cf422296fc53c14ea5e7fecb3e8568dd3
Deleted: sha256:dfde39d63f37e44483c298271a60c8947125aca21d3b317f9d06387fef3fd60b
Deleted: sha256:d68ef4fd282218458b12c0911a2758f79ceb3e9bdebe570a47a16ced60422aa8
Deleted: sha256:267226e3777449a400694d19f15e20bbde4564380753cf6252afa10ec2c6c723
WARNING: Successfully resolved tag to sha256, but it is recommended to use sha256 directly.
Digests:
- us.gcr.io/apache-beam-testing/jenkins/beam_python3.7_sdk@sha256:6b353f86488a59c5d4fcafb4f9f0bae5e82e2b015bc4a3c18f75021f3afd8b46
Associated tags:
- 20230516-115737147428756
Tags:
- us.gcr.io/apache-beam-testing/jenkins/beam_python3.7_sdk:20230516-115737147428756
Deleted [us.gcr.io/apache-beam-testing/jenkins/beam_python3.7_sdk:20230516-115737147428756].
Deleted [us.gcr.io/apache-beam-testing/jenkins/beam_python3.7_sdk@sha256:6b353f86488a59c5d4fcafb4f9f0bae5e82e2b015bc4a3c18f75021f3afd8b46].
Digests:
- us.gcr.io/apache-beam-testing/jenkins/prebuild_python37_sdk/beam_python_prebuilt_sdk@sha256:4ecca08651e69d83c7e16fc544214f72d016dc9b50d0ccb7f208018a368bfbd8
Associated tags:
- 7368275e-e046-4762-91a3-e94e2a8c928f
Deleted [us.gcr.io/apache-beam-testing/jenkins/prebuild_python37_sdk/beam_python_prebuilt_sdk:7368275e-e046-4762-91a3-e94e2a8c928f].
Deleted [us.gcr.io/apache-beam-testing/jenkins/prebuild_python37_sdk/beam_python_prebuilt_sdk@sha256:4ecca08651e69d83c7e16fc544214f72d016dc9b50d0ccb7f208018a368bfbd8].
Digests:
- us.gcr.io/apache-beam-testing/jenkins/prebuild_python37_sdk/beam_python_prebuilt_sdk@sha256:aff13c8fd08f15a0232afe0c9b4865f6ad9e0e20a31d3fdedef46f873e14e362
Associated tags:
- f358982a-7c6a-484c-a0b7-8f31383227db
Deleted [us.gcr.io/apache-beam-testing/jenkins/prebuild_python37_sdk/beam_python_prebuilt_sdk:f358982a-7c6a-484c-a0b7-8f31383227db].
Deleted [us.gcr.io/apache-beam-testing/jenkins/prebuild_python37_sdk/beam_python_prebuilt_sdk@sha256:aff13c8fd08f15a0232afe0c9b4865f6ad9e0e20a31d3fdedef46f873e14e362].
Removed the container
FAILURE: Build completed with 4 failures.
1: Task failed with an exception.
-----------
* What went wrong:
Execution failed for task ':sdks:python:container:py311:docker'.
> Process 'command 'docker'' finished with non-zero exit value 1
* Try:
> Run with --stacktrace option to get the stack trace.
> Run with --info or --debug option to get more log output.
==============================================================================
2: Task failed with an exception.
-----------
* What went wrong:
Execution failed for task ':sdks:python:container:py310:docker'.
> Process 'command 'docker'' finished with non-zero exit value 1
* Try:
> Run with --stacktrace option to get the stack trace.
> Run with --info or --debug option to get more log output.
==============================================================================
3: Task failed with an exception.
-----------
* What went wrong:
Execution failed for task ':sdks:python:container:py38:docker'.
> Process 'command 'docker'' finished with non-zero exit value 1
* Try:
> Run with --stacktrace option to get the stack trace.
> Run with --info or --debug option to get more log output.
==============================================================================
4: Task failed with an exception.
-----------
* What went wrong:
Execution failed for task ':sdks:python:container:py39:docker'.
> Process 'command 'docker'' finished with non-zero exit value 1
* Try:
> Run with --stacktrace option to get the stack trace.
> Run with --info or --debug option to get more log output.
==============================================================================
* Get more help at https://help.gradle.org
Deprecated Gradle features were used in this build, making it incompatible with Gradle 8.0.
You can use '--warning-mode all' to show the individual deprecation warnings and determine if they come from your own scripts or plugins.
See https://docs.gradle.org/7.5.1/userguide/command_line_interface.html#sec:command_line_warnings
BUILD FAILED in 48m 46s
74 actionable tasks: 68 executed, 6 up-to-date
Publishing build scan...
https://ge.apache.org/s/uqer3a34xmpik
Build step 'Invoke Gradle script' changed build result to FAILURE
Build step 'Invoke Gradle script' marked build as failure
---------------------------------------------------------------------
To unsubscribe, e-mail: builds-unsubscribe@beam.apache.org
For additional commands, e-mail: builds-help@beam.apache.org
Build failed in Jenkins: beam_PostCommit_Py_ValCont_with_RC #124
Posted by Apache Jenkins Server <je...@builds.apache.org>.
See <https://ci-beam.apache.org/job/beam_PostCommit_Py_ValCont_with_RC/124/display/redirect>
Changes:
------------------------------------------
[...truncated 2.76 MB...]
#16 1.249 opt-einsum==3.3.0
#16 1.249 orjson==3.8.12
#16 1.249 overrides==6.5.0
#16 1.249 packaging==23.1
#16 1.249 pandas==1.5.3
#16 1.249 parameterized==0.9.0
#16 1.249 pip==23.1.2
#16 1.249 pluggy==1.0.0
#16 1.249 proto-plus==1.22.2
#16 1.249 protobuf==4.22.5
#16 1.249 psycopg2-binary==2.9.6
#16 1.249 pyarrow==11.0.0
#16 1.249 pyasn1==0.5.0
#16 1.249 pyasn1-modules==0.3.0
#16 1.249 pycparser==2.21
#16 1.249 pydot==1.4.2
#16 1.249 PyHamcrest==2.0.4
#16 1.249 pymongo==4.4.0b0
#16 1.249 PyMySQL==1.0.3
#16 1.249 pyparsing==3.1.0b1
#16 1.249 pytest==7.3.1
#16 1.249 pytest-timeout==2.1.0
#16 1.249 pytest-xdist==3.3.0
#16 1.249 python-dateutil==2.8.2
#16 1.249 python-snappy==0.6.1
#16 1.249 pytz==2023.3
#16 1.249 PyYAML==6.0
#16 1.249 regex==2023.5.5
#16 1.249 requests==2.30.0
#16 1.249 requests-mock==1.10.0
#16 1.249 requests-oauthlib==1.3.1
#16 1.249 rsa==4.9
#16 1.249 scikit-learn==1.2.2
#16 1.249 scipy==1.10.1
#16 1.249 setuptools==67.7.2
#16 1.249 six==1.16.0
#16 1.249 sortedcontainers==2.4.0
#16 1.249 soupsieve==2.4.1
#16 1.249 SQLAlchemy==1.4.48
#16 1.249 sqlparse==0.4.4
#16 1.249 tenacity==8.2.2
#16 1.249 tensorboard==2.13.0
#16 1.249 tensorboard-data-server==0.7.0
#16 1.249 tensorflow==2.13.0rc0
#16 1.249 tensorflow-estimator==2.13.0rc0
#16 1.249 tensorflow-io-gcs-filesystem==0.32.0
#16 1.249 termcolor==2.3.0
#16 1.249 testcontainers==3.7.1
#16 1.249 threadpoolctl==3.1.0
#16 1.249 tomli==2.0.1
#16 1.249 tqdm==4.65.0
#16 1.249 typing_extensions==4.5.0
#16 1.249 uritemplate==4.1.1
#16 1.249 urllib3==1.26.15
#16 1.249 websocket-client==1.5.1
#16 1.249 Werkzeug==2.3.4
#16 1.249 wheel==0.40.0
#16 1.249 wrapt==1.14.1
#16 1.249 zipp==3.15.0
#16 1.249 zstandard==0.21.0
#16 DONE 1.4s
#17 [beam 13/16] COPY target/LICENSE /opt/apache/beam/
#17 DONE 0.1s
#18 [beam 14/16] COPY target/LICENSE.python /opt/apache/beam/
#18 DONE 0.1s
#19 [beam 15/16] COPY target/NOTICE /opt/apache/beam/
#19 DONE 0.1s
#20 [beam 16/16] COPY target/launcher/linux_amd64/boot /opt/apache/beam/
#20 DONE 0.2s
#21 [third_party_licenses 1/4] COPY target/license_scripts /tmp/license_scripts/
#21 DONE 0.1s
#22 [third_party_licenses 2/4] COPY target/go-licenses/* /opt/apache/beam/third_party_licenses/golang/
#22 DONE 0.1s
#23 [third_party_licenses 3/4] COPY target/license_scripts /tmp/license_scripts/
#23 DONE 0.1s
#24 [third_party_licenses 4/4] RUN if [ "true" = "true" ] ; then pip install 'pip-licenses<5' pyyaml tenacity && python /tmp/license_scripts/pull_licenses_py.py ; fi
#24 1.164 Collecting pip-licenses<5
#24 1.232 Downloading pip_licenses-4.3.1-py3-none-any.whl (19 kB)
#24 1.244 Requirement already satisfied: pyyaml in /usr/local/lib/python3.9/site-packages (6.0)
#24 1.245 Requirement already satisfied: tenacity in /usr/local/lib/python3.9/site-packages (8.2.2)
#24 1.316 Collecting prettytable>=2.3.0 (from pip-licenses<5)
#24 1.339 Downloading prettytable-3.7.0-py3-none-any.whl (27 kB)
#24 1.417 Collecting wcwidth (from prettytable>=2.3.0->pip-licenses<5)
#24 1.454 Downloading wcwidth-0.2.6-py2.py3-none-any.whl (29 kB)
#24 3.195 Installing collected packages: wcwidth, prettytable, pip-licenses
#24 3.421 Successfully installed pip-licenses-4.3.1 prettytable-3.7.0 wcwidth-0.2.6
#24 3.422 WARNING: Running pip as the 'root' user can result in broken permissions and conflicting behaviour with the system package manager. It is recommended to use a virtual environment instead: https://pip.pypa.io/warnings/venv
#24 13.52 Traceback (most recent call last):
#24 13.52 File "/tmp/license_scripts/pull_licenses_py.py", line 190, in <module>
#24 13.52 Skip pulling license for bs4
#24 13.52 raise RuntimeError(
#24 13.52 RuntimeError: Could not retrieve licences for packages ['keras'] in Python3.9 environment.
#24 13.52 These licenses were not able to be pulled automatically. Please search code source of the dependencies on the internet and add urls to RAW license file at sdks/python/container/license_scripts/dep_urls_py.yaml for each missing license and rerun the test. If no such urls can be found, you need to manually add LICENSE and NOTICE (if available) files at sdks/python/container/license_scripts/manual_licenses/{dep}/ and add entries to sdks/python/container/license_scripts/dep_urls_py.yaml.
#24 ERROR: executor failed running [/bin/sh -c if [ "$pull_licenses" = "true" ] ; then pip install 'pip-licenses<5' pyyaml tenacity && python /tmp/license_scripts/pull_licenses_py.py ; fi]: exit code: 1
------
> [third_party_licenses 4/4] RUN if [ "true" = "true" ] ; then pip install 'pip-licenses<5' pyyaml tenacity && python /tmp/license_scripts/pull_licenses_py.py ; fi:
#24 1.454 Downloading wcwidth-0.2.6-py2.py3-none-any.whl (29 kB)
#24 3.195 Installing collected packages: wcwidth, prettytable, pip-licenses
#24 3.421 Successfully installed pip-licenses-4.3.1 prettytable-3.7.0 wcwidth-0.2.6
#24 3.422 WARNING: Running pip as the 'root' user can result in broken permissions and conflicting behaviour with the system package manager. It is recommended to use a virtual environment instead: https://pip.pypa.io/warnings/venv
#24 13.52 Traceback (most recent call last):
#24 13.52 File "/tmp/license_scripts/pull_licenses_py.py", line 190, in <module>
#24 13.52 Skip pulling license for bs4
#24 13.52 raise RuntimeError(
#24 13.52 RuntimeError: Could not retrieve licences for packages ['keras'] in Python3.9 environment.
#24 13.52 These licenses were not able to be pulled automatically. Please search code source of the dependencies on the internet and add urls to RAW license file at sdks/python/container/license_scripts/dep_urls_py.yaml for each missing license and rerun the test. If no such urls can be found, you need to manually add LICENSE and NOTICE (if available) files at sdks/python/container/license_scripts/manual_licenses/{dep}/ and add entries to sdks/python/container/license_scripts/dep_urls_py.yaml.
------
ERROR: failed to solve: executor failed running [/bin/sh -c if [ "$pull_licenses" = "true" ] ; then pip install 'pip-licenses<5' pyyaml tenacity && python /tmp/license_scripts/pull_licenses_py.py ; fi]: exit code: 1
> Task :sdks:python:container:py39:docker FAILED
> Task :sdks:python:test-suites:dataflow:py37:validatesContainer
function cleanup_container {
# Delete the container locally and remotely
docker rmi $CONTAINER:$TAG || echo "Failed to remove container image"
for image in $(docker images --format '{{.Repository}}:{{.Tag}}' | grep $PREBUILD_SDK_CONTAINER_REGISTRY_PATH)
do docker rmi $image || echo "Failed to remove prebuilt sdk container image"
done
gcloud --quiet container images delete $CONTAINER:$TAG || echo "Failed to delete container"
for digest in $(gcloud container images list-tags $PREBUILD_SDK_CONTAINER_REGISTRY_PATH/beam_python_prebuilt_sdk --format="get(digest)")
do gcloud container images delete $PREBUILD_SDK_CONTAINER_REGISTRY_PATH/beam_python_prebuilt_sdk@$digest --force-delete-tags --quiet || echo "Failed to remove prebuilt sdk container image"
done
echo "Removed the container"
}
trap cleanup_container EXIT
echo ">>> Successfully built and push container $CONTAINER"
cd sdks/python
SDK_LOCATION=$2
# Run ValidatesRunner tests on Google Cloud Dataflow service
echo ">>> RUNNING DATAFLOW RUNNER VALIDATESCONTAINER TEST"
pytest -o junit_suite_name=$IMAGE_NAME \
-m="it_validatescontainer" \
--show-capture=no \
--numprocesses=1 \
--timeout=1800 \
--junitxml=$XUNIT_FILE \
--ignore-glob '.*py3\d?\.py$' \
--log-cli-level=INFO \
--test-pipeline-options=" \
--runner=TestDataflowRunner \
--project=$PROJECT \
--region=$REGION \
--sdk_container_image=$CONTAINER:$TAG \
--staging_location=$GCS_LOCATION/staging-validatesrunner-test \
--temp_location=$GCS_LOCATION/temp-validatesrunner-test \
--output=$GCS_LOCATION/output \
--sdk_location=$SDK_LOCATION \
--num_workers=1 \
--docker_registry_push_url=$PREBUILD_SDK_CONTAINER_REGISTRY_PATH"
echo ">>> SUCCESS DATAFLOW RUNNER VALIDATESCONTAINER TEST"
cleanup_container
WARNING: Successfully resolved tag to sha256, but it is recommended to use sha256 directly.
Digests:
- us.gcr.io/apache-beam-testing/jenkins/beam_python3.7_sdk@sha256:1b546cb4e42f1d21d4fa037203232c27be101af31fef91f3e60a0689835e8ff3
Associated tags:
- 20230516-023032326184670
Tags:
- us.gcr.io/apache-beam-testing/jenkins/beam_python3.7_sdk:20230516-023032326184670
Deleted [us.gcr.io/apache-beam-testing/jenkins/beam_python3.7_sdk:20230516-023032326184670].
Deleted [us.gcr.io/apache-beam-testing/jenkins/beam_python3.7_sdk@sha256:1b546cb4e42f1d21d4fa037203232c27be101af31fef91f3e60a0689835e8ff3].
Digests:
- us.gcr.io/apache-beam-testing/jenkins/prebuild_python37_sdk/beam_python_prebuilt_sdk@sha256:bed58b3d6d4e8b8253a4d39c764744e426d647e62d51afc4386a9bf361131a79
Associated tags:
- 888d5a30-8f70-4264-99d7-ff4cfc2a1d7d
Deleted [us.gcr.io/apache-beam-testing/jenkins/prebuild_python37_sdk/beam_python_prebuilt_sdk:888d5a30-8f70-4264-99d7-ff4cfc2a1d7d].
Deleted [us.gcr.io/apache-beam-testing/jenkins/prebuild_python37_sdk/beam_python_prebuilt_sdk@sha256:bed58b3d6d4e8b8253a4d39c764744e426d647e62d51afc4386a9bf361131a79].
Digests:
- us.gcr.io/apache-beam-testing/jenkins/prebuild_python37_sdk/beam_python_prebuilt_sdk@sha256:89b79bed0243b95093f305bf20468af4b998a55807ca86edbd96b8bc9156dba7
Associated tags:
- ba7eefb3-4f4f-4fb6-ba05-f39822a70bd5
Deleted [us.gcr.io/apache-beam-testing/jenkins/prebuild_python37_sdk/beam_python_prebuilt_sdk:ba7eefb3-4f4f-4fb6-ba05-f39822a70bd5].
Deleted [us.gcr.io/apache-beam-testing/jenkins/prebuild_python37_sdk/beam_python_prebuilt_sdk@sha256:89b79bed0243b95093f305bf20468af4b998a55807ca86edbd96b8bc9156dba7].
FAILURE: Build completed with 4 failures.
1: Task failed with an exception.
-----------
* What went wrong:
Execution failed for task ':sdks:python:container:py311:docker'.
> Process 'command 'docker'' finished with non-zero exit value 1
* Try:
> Run with --stacktrace option to get the stack trace.
> Run with --info or --debug option to get more log output.
==============================================================================
2: Task failed with an exception.
-----------
* What went wrong:
Execution failed for task ':sdks:python:container:py310:docker'.
> Process 'command 'docker'' finished with non-zero exit value 1
* Try:
> Run with --stacktrace option to get the stack trace.
> Run with --info or --debug option to get more log output.
==============================================================================
3: Task failed with an exception.
-----------
* What went wrong:
Execution failed for task ':sdks:python:container:py38:docker'.
> Process 'command 'docker'' finished with non-zero exit value 1
* Try:
> Run with --stacktrace option to get the stack trace.
> Run with --info or --debug option to get more log output.
==============================================================================
4: Task failed with an exception.
-----------
* What went wrong:
Execution failed for task ':sdks:python:container:py39:docker'.
> Process 'command 'docker'' finished with non-zero exit value 1
* Try:
> Run with --stacktrace option to get the stack trace.
> Run with --info or --debug option to get more log output.
==============================================================================
* Get more help at https://help.gradle.org
Deprecated Gradle features were used in this build, making it incompatible with Gradle 8.0.
You can use '--warning-mode all' to show the individual deprecation warnings and determine if they come from your own scripts or plugins.
See https://docs.gradle.org/7.5.1/userguide/command_line_interface.html#sec:command_line_warnings
BUILD FAILED in 45m 5s
74 actionable tasks: 68 executed, 6 up-to-date
Publishing build scan...
https://ge.apache.org/s/3iscskizgkzbc
Build step 'Invoke Gradle script' changed build result to FAILURE
Build step 'Invoke Gradle script' marked build as failure
---------------------------------------------------------------------
To unsubscribe, e-mail: builds-unsubscribe@beam.apache.org
For additional commands, e-mail: builds-help@beam.apache.org