You are viewing a plain text version of this content. The canonical link for it is here.
Posted to builds@lucene.apache.org by Apache Jenkins Server <je...@builds.apache.org> on 2026/06/23 15:15:53 UTC

[JENKINS] Lucene » Lucene-NightlyTests-10.5 - Build # 4 - Unstable!

Build: https://ci-builds.apache.org/job/Lucene/job/Lucene-NightlyTests-10.5/4/

2 tests failed.
FAILED:  org.apache.lucene.search.comparators.TestTermOrdValComparatorAdaptiveSkipping.testSkippingEffectiveForClusteredData

Error Message:
java.lang.AssertionError: Expected skip-enabled totalHits (200000) to be significantly lower than non-skip (200000), proving skipping was not incorrectly disabled

Stack Trace:
java.lang.AssertionError: Expected skip-enabled totalHits (200000) to be significantly lower than non-skip (200000), proving skipping was not incorrectly disabled
	at __randomizedtesting.SeedInfo.seed([C6024C6A3E23BA68:256965C9C320B67C]:0)
	at org.junit.Assert.fail(Assert.java:89)
	at org.junit.Assert.assertTrue(Assert.java:42)
	at org.apache.lucene.search.comparators.TestTermOrdValComparatorAdaptiveSkipping.testSkippingEffectiveForClusteredData(TestTermOrdValComparatorAdaptiveSkipping.java:94)
	at java.base/jdk.internal.reflect.DirectMethodHandleAccessor.invoke(DirectMethodHandleAccessor.java:103)
	at java.base/java.lang.reflect.Method.invoke(Method.java:580)
	at com.carrotsearch.randomizedtesting.RandomizedRunner.invoke(RandomizedRunner.java:1758)
	at com.carrotsearch.randomizedtesting.RandomizedRunner$8.evaluate(RandomizedRunner.java:946)
	at com.carrotsearch.randomizedtesting.RandomizedRunner$9.evaluate(RandomizedRunner.java:982)
	at com.carrotsearch.randomizedtesting.RandomizedRunner$10.evaluate(RandomizedRunner.java:996)
	at org.apache.lucene.tests.util.TestRuleSetupTeardownChained$1.evaluate(TestRuleSetupTeardownChained.java:48)
	at org.apache.lucene.tests.util.AbstractBeforeAfterRule$1.evaluate(AbstractBeforeAfterRule.java:43)
	at org.apache.lucene.tests.util.TestRuleThreadAndTestName$1.evaluate(TestRuleThreadAndTestName.java:45)
	at org.apache.lucene.tests.util.TestRuleIgnoreAfterMaxFailures$1.evaluate(TestRuleIgnoreAfterMaxFailures.java:60)
	at org.apache.lucene.tests.util.TestRuleMarkFailure$1.evaluate(TestRuleMarkFailure.java:44)
	at org.junit.rules.RunRules.evaluate(RunRules.java:20)
	at com.carrotsearch.randomizedtesting.rules.StatementAdapter.evaluate(StatementAdapter.java:36)
	at com.carrotsearch.randomizedtesting.ThreadLeakControl$StatementRunner.run(ThreadLeakControl.java:390)
	at com.carrotsearch.randomizedtesting.ThreadLeakControl.forkTimeoutingTask(ThreadLeakControl.java:843)
	at com.carrotsearch.randomizedtesting.ThreadLeakControl$3.evaluate(ThreadLeakControl.java:490)
	at com.carrotsearch.randomizedtesting.RandomizedRunner.runSingleTest(RandomizedRunner.java:955)
	at com.carrotsearch.randomizedtesting.RandomizedRunner$5.evaluate(RandomizedRunner.java:840)
	at com.carrotsearch.randomizedtesting.RandomizedRunner$6.evaluate(RandomizedRunner.java:891)
	at com.carrotsearch.randomizedtesting.RandomizedRunner$7.evaluate(RandomizedRunner.java:902)
	at org.apache.lucene.tests.util.AbstractBeforeAfterRule$1.evaluate(AbstractBeforeAfterRule.java:43)
	at com.carrotsearch.randomizedtesting.rules.StatementAdapter.evaluate(StatementAdapter.java:36)
	at org.apache.lucene.tests.util.TestRuleStoreClassName$1.evaluate(TestRuleStoreClassName.java:38)
	at com.carrotsearch.randomizedtesting.rules.NoShadowingOrOverridesOnMethodsRule$1.evaluate(NoShadowingOrOverridesOnMethodsRule.java:40)
	at com.carrotsearch.randomizedtesting.rules.NoShadowingOrOverridesOnMethodsRule$1.evaluate(NoShadowingOrOverridesOnMethodsRule.java:40)
	at com.carrotsearch.randomizedtesting.rules.StatementAdapter.evaluate(StatementAdapter.java:36)
	at com.carrotsearch.randomizedtesting.rules.StatementAdapter.evaluate(StatementAdapter.java:36)
	at org.apache.lucene.tests.util.TestRuleAssertionsRequired$1.evaluate(TestRuleAssertionsRequired.java:53)
	at org.apache.lucene.tests.util.AbstractBeforeAfterRule$1.evaluate(AbstractBeforeAfterRule.java:43)
	at org.apache.lucene.tests.util.TestRuleMarkFailure$1.evaluate(TestRuleMarkFailure.java:44)
	at org.apache.lucene.tests.util.TestRuleIgnoreAfterMaxFailures$1.evaluate(TestRuleIgnoreAfterMaxFailures.java:60)
	at org.apache.lucene.tests.util.TestRuleIgnoreTestSuites$1.evaluate(TestRuleIgnoreTestSuites.java:47)
	at org.junit.rules.RunRules.evaluate(RunRules.java:20)
	at com.carrotsearch.randomizedtesting.rules.StatementAdapter.evaluate(StatementAdapter.java:36)
	at com.carrotsearch.randomizedtesting.ThreadLeakControl$StatementRunner.run(ThreadLeakControl.java:390)
	at com.carrotsearch.randomizedtesting.ThreadLeakControl.lambda$forkTimeoutingTask$0(ThreadLeakControl.java:850)
	at java.base/java.lang.Thread.run(Thread.java:1583)


FAILED:  org.apache.lucene.search.comparators.TestTermOrdValComparatorAdaptiveSkipping.testAdaptiveDisablingDoesNotFireForClusteredData

Error Message:
java.lang.AssertionError: Skipping should remain active for clustered data

Stack Trace:
java.lang.AssertionError: Skipping should remain active for clustered data
	at __randomizedtesting.SeedInfo.seed([C6024C6A3E23BA68:AC1BEF2581F718D8]:0)
	at org.junit.Assert.fail(Assert.java:89)
	at org.junit.Assert.assertTrue(Assert.java:42)
	at org.junit.Assert.assertFalse(Assert.java:65)
	at org.apache.lucene.search.comparators.TestTermOrdValComparatorAdaptiveSkipping.testAdaptiveDisablingDoesNotFireForClusteredData(TestTermOrdValComparatorAdaptiveSkipping.java:206)
	at java.base/jdk.internal.reflect.DirectMethodHandleAccessor.invoke(DirectMethodHandleAccessor.java:103)
	at java.base/java.lang.reflect.Method.invoke(Method.java:580)
	at com.carrotsearch.randomizedtesting.RandomizedRunner.invoke(RandomizedRunner.java:1758)
	at com.carrotsearch.randomizedtesting.RandomizedRunner$8.evaluate(RandomizedRunner.java:946)
	at com.carrotsearch.randomizedtesting.RandomizedRunner$9.evaluate(RandomizedRunner.java:982)
	at com.carrotsearch.randomizedtesting.RandomizedRunner$10.evaluate(RandomizedRunner.java:996)
	at org.apache.lucene.tests.util.TestRuleSetupTeardownChained$1.evaluate(TestRuleSetupTeardownChained.java:48)
	at org.apache.lucene.tests.util.AbstractBeforeAfterRule$1.evaluate(AbstractBeforeAfterRule.java:43)
	at org.apache.lucene.tests.util.TestRuleThreadAndTestName$1.evaluate(TestRuleThreadAndTestName.java:45)
	at org.apache.lucene.tests.util.TestRuleIgnoreAfterMaxFailures$1.evaluate(TestRuleIgnoreAfterMaxFailures.java:60)
	at org.apache.lucene.tests.util.TestRuleMarkFailure$1.evaluate(TestRuleMarkFailure.java:44)
	at org.junit.rules.RunRules.evaluate(RunRules.java:20)
	at com.carrotsearch.randomizedtesting.rules.StatementAdapter.evaluate(StatementAdapter.java:36)
	at com.carrotsearch.randomizedtesting.ThreadLeakControl$StatementRunner.run(ThreadLeakControl.java:390)
	at com.carrotsearch.randomizedtesting.ThreadLeakControl.forkTimeoutingTask(ThreadLeakControl.java:843)
	at com.carrotsearch.randomizedtesting.ThreadLeakControl$3.evaluate(ThreadLeakControl.java:490)
	at com.carrotsearch.randomizedtesting.RandomizedRunner.runSingleTest(RandomizedRunner.java:955)
	at com.carrotsearch.randomizedtesting.RandomizedRunner$5.evaluate(RandomizedRunner.java:840)
	at com.carrotsearch.randomizedtesting.RandomizedRunner$6.evaluate(RandomizedRunner.java:891)
	at com.carrotsearch.randomizedtesting.RandomizedRunner$7.evaluate(RandomizedRunner.java:902)
	at org.apache.lucene.tests.util.AbstractBeforeAfterRule$1.evaluate(AbstractBeforeAfterRule.java:43)
	at com.carrotsearch.randomizedtesting.rules.StatementAdapter.evaluate(StatementAdapter.java:36)
	at org.apache.lucene.tests.util.TestRuleStoreClassName$1.evaluate(TestRuleStoreClassName.java:38)
	at com.carrotsearch.randomizedtesting.rules.NoShadowingOrOverridesOnMethodsRule$1.evaluate(NoShadowingOrOverridesOnMethodsRule.java:40)
	at com.carrotsearch.randomizedtesting.rules.NoShadowingOrOverridesOnMethodsRule$1.evaluate(NoShadowingOrOverridesOnMethodsRule.java:40)
	at com.carrotsearch.randomizedtesting.rules.StatementAdapter.evaluate(StatementAdapter.java:36)
	at com.carrotsearch.randomizedtesting.rules.StatementAdapter.evaluate(StatementAdapter.java:36)
	at org.apache.lucene.tests.util.TestRuleAssertionsRequired$1.evaluate(TestRuleAssertionsRequired.java:53)
	at org.apache.lucene.tests.util.AbstractBeforeAfterRule$1.evaluate(AbstractBeforeAfterRule.java:43)
	at org.apache.lucene.tests.util.TestRuleMarkFailure$1.evaluate(TestRuleMarkFailure.java:44)
	at org.apache.lucene.tests.util.TestRuleIgnoreAfterMaxFailures$1.evaluate(TestRuleIgnoreAfterMaxFailures.java:60)
	at org.apache.lucene.tests.util.TestRuleIgnoreTestSuites$1.evaluate(TestRuleIgnoreTestSuites.java:47)
	at org.junit.rules.RunRules.evaluate(RunRules.java:20)
	at com.carrotsearch.randomizedtesting.rules.StatementAdapter.evaluate(StatementAdapter.java:36)
	at com.carrotsearch.randomizedtesting.ThreadLeakControl$StatementRunner.run(ThreadLeakControl.java:390)
	at com.carrotsearch.randomizedtesting.ThreadLeakControl.lambda$forkTimeoutingTask$0(ThreadLeakControl.java:850)
	at java.base/java.lang.Thread.run(Thread.java:1583)




Build Log:
[...truncated 1478 lines...]
ERROR: The following test(s) have failed:
  - org.apache.lucene.search.comparators.TestTermOrdValComparatorAdaptiveSkipping.testSkippingEffectiveForClusteredData (:lucene:core)
    Test output: /home/jenkins/jenkins-agent/workspace/Lucene/Lucene-NightlyTests-10.5/checkout/lucene/core/build/test-results/test/outputs/OUTPUT-org.apache.lucene.search.comparators.TestTermOrdValComparatorAdaptiveSkipping.txt
    Reproduce with: gradlew :lucene:core:test --tests "org.apache.lucene.search.comparators.TestTermOrdValComparatorAdaptiveSkipping.testSkippingEffectiveForClusteredData" -Ptests.jvms=4 -Ptests.jvmargs= -Ptests.seed=C6024C6A3E23BA68 -Ptests.multiplier=2 -Ptests.useSecurityManager=true -Ptests.nightly=true -Ptests.gui=true -Ptests.file.encoding=ISO-8859-1 -Ptests.linedocsfile=/home/jenkins/jenkins-agent/workspace/Lucene/Lucene-NightlyTests-10.5/test-data/enwiki.random.lines.txt -Ptests.vectorsize=512 -Ptests.forceintegervectors=true

  - org.apache.lucene.search.comparators.TestTermOrdValComparatorAdaptiveSkipping.testAdaptiveDisablingDoesNotFireForClusteredData (:lucene:core)
    Test output: /home/jenkins/jenkins-agent/workspace/Lucene/Lucene-NightlyTests-10.5/checkout/lucene/core/build/test-results/test/outputs/OUTPUT-org.apache.lucene.search.comparators.TestTermOrdValComparatorAdaptiveSkipping.txt
    Reproduce with: gradlew :lucene:core:test --tests "org.apache.lucene.search.comparators.TestTermOrdValComparatorAdaptiveSkipping.testAdaptiveDisablingDoesNotFireForClusteredData" -Ptests.jvms=4 -Ptests.jvmargs= -Ptests.seed=C6024C6A3E23BA68 -Ptests.multiplier=2 -Ptests.useSecurityManager=true -Ptests.nightly=true -Ptests.gui=true -Ptests.file.encoding=ISO-8859-1 -Ptests.linedocsfile=/home/jenkins/jenkins-agent/workspace/Lucene/Lucene-NightlyTests-10.5/test-data/enwiki.random.lines.txt -Ptests.vectorsize=512 -Ptests.forceintegervectors=true


[Incubating] Problems report is available at: file:///home/jenkins/jenkins-agent/workspace/Lucene/Lucene-NightlyTests-10.5/checkout/build/reports/problems/problems-report.html

Deprecated Gradle features were used in this build, making it incompatible with Gradle 9.0.

You can use '--warning-mode all' to show the individual deprecation warnings and determine if they come from your own scripts or plugins.

For more on this, please refer to https://docs.gradle.org/8.14/userguide/command_line_interface.html#sec:command_line_warnings in the Gradle documentation.

BUILD SUCCESSFUL in 1h 47m 43s
249 actionable tasks: 183 executed, 66 up-to-date
Build step 'Invoke Gradle script' changed build result to SUCCESS
Archiving artifacts
‘**/build*/**/tests-cwd/*.hprof’ doesn’t match anything: ‘**’ exists but not ‘**/build*/**/tests-cwd/*.hprof’
No artifacts found that match the file pattern "**/build*/**/tests-cwd/*.hprof,**/*_pid*.log". Configuration error?
Recording test results
[Checks API] No suitable checks publisher found.
Build step 'Publish JUnit test result report' changed build result to UNSTABLE
Email was triggered for: Unstable (Test Failures)
Sending email for trigger: Unstable (Test Failures)