You are viewing a plain text version of this content. The canonical link for it is here.
Posted to dev@hama.apache.org by Apache Jenkins Server <je...@builds.apache.org> on 2015/02/24 02:03:05 UTC

Build failed in Jenkins: Hama-Nightly-for-Hadoop-1.x #1531

See <https://builds.apache.org/job/Hama-Nightly-for-Hadoop-1.x/1531/changes>

Changes:

[edwardyoon] The finishVertexComputation() method should be called only after compute() is called.

------------------------------------------
[...truncated 124691 lines...]
402708, 4.792113564533352, 2.9861216440626746, -0.9197892138069559, -0.541835138835484]	4.792011704063929
[7.094064149371662, -4.309408625114272, 5.412141869325169, 4.778229824554746, 2.964266980841808, -0.9456148394991056, -0.5756316615194502]	4.570228216084243
[7.086130978849286, -4.338807201271834, 5.402275517130851, 4.7644971285507856, 2.94260112270095, -0.9712138933828114, -0.6091638550517424]	4.35070477467997
[7.078279787575417, -4.367467991903288, 5.392573118458076, 4.751092332714601, 2.9213451436250497, -0.9963210944084716, -0.6421222134455117]	4.136204544458424
[7.070590165967807, -4.394674703108866, 5.383193849479623, 4.738333790121049, 2.900896989537819, -1.0204589152235353, -0.6739496088942645]	3.9320992443258813
[7.063167338947803, -4.419480340330619, 5.374348153444877, 4.72664238634335, 2.881782773619096, -1.0429960293855516, -0.7039094777967867]	3.746724152620719
[7.0560842347812, -4.441228589854085, 5.366181878052325, 4.716309814532597, 2.864367120496723, -1.0634948990816013, -0.7314913386809223]	3.5882736744855825
[7.0560842347812, -4.441228589854085, 5.366181878052325, 4.716309814532597, 2.864367120496723, -1.0634948990816013, -0.7314913386809223]	3.458803849984058

Job Finished in 3.215 seconds
Tests run: 1, Failures: 0, Errors: 0, Skipped: 0, Time elapsed: 0.007 sec
Running org.apache.hama.examples.BipartiteMatchingTest
15/02/24 01:02:45 WARN util.NativeCodeLoader: Unable to load native-hadoop library for your platform... using builtin-java classes where applicable

15/02/24 01:02:45 INFO bsp.FileInputFormat: Total input paths to process : 1

15/02/24 01:02:45 WARN snappy.LoadSnappy: Snappy native library not loaded

15/02/24 01:02:45 INFO bsp.FileInputFormat: Total input paths to process : 1

15/02/24 01:02:45 WARN bsp.BSPJobClient: No job jar file set.  User classes may not be found. See BSPJob#setJar(String) or check Your jar file.

15/02/24 01:02:45 INFO bsp.BSPJobClient: Running job: job_localrunner_0001

15/02/24 01:02:45 INFO bsp.LocalBSPRunner: Setting up a new barrier for 1 tasks!

15/02/24 01:02:48 INFO bsp.BSPJobClient: Current supersteps number: 1

15/02/24 01:02:48 INFO bsp.BSPJobClient: The total number of supersteps: 1

15/02/24 01:02:48 INFO bsp.BSPJobClient: Counters: 6

15/02/24 01:02:48 INFO bsp.BSPJobClient:   org.apache.hama.bsp.JobInProgress$JobCounter

15/02/24 01:02:48 INFO bsp.BSPJobClient:     SUPERSTEPS=1

15/02/24 01:02:48 INFO bsp.BSPJobClient:     LAUNCHED_TASKS=1

15/02/24 01:02:48 INFO bsp.BSPJobClient:   org.apache.hama.bsp.BSPPeerImpl$PeerCounter

15/02/24 01:02:48 INFO bsp.BSPJobClient:     SUPERSTEP_SUM=2

15/02/24 01:02:48 INFO bsp.BSPJobClient:     IO_BYTES_READ=26

15/02/24 01:02:48 INFO bsp.BSPJobClient:     TIME_IN_SYNC_MS=0

15/02/24 01:02:48 INFO bsp.BSPJobClient:     TASK_INPUT_RECORDS=4

15/02/24 01:02:48 INFO bsp.FileInputFormat: Total input paths to process : 2

15/02/24 01:02:48 WARN bsp.BSPJobClient: No job jar file set.  User classes may not be found. See BSPJob#setJar(String) or check Your jar file.

15/02/24 01:02:48 INFO bsp.LocalBSPRunner: Setting up a new barrier for 2 tasks!

15/02/24 01:02:48 INFO bsp.BSPJobClient: Running job: job_localrunner_0001

15/02/24 01:02:48 INFO graph.GraphJobRunner: 2 vertices are loaded into local:1

15/02/24 01:02:48 INFO graph.GraphJobRunner: 2 vertices are loaded into local:0

15/02/24 01:02:51 INFO bsp.BSPJobClient: Current supersteps number: 7

15/02/24 01:02:51 INFO bsp.BSPJobClient: The total number of supersteps: 7

15/02/24 01:02:51 INFO bsp.BSPJobClient: Counters: 12

15/02/24 01:02:51 INFO bsp.BSPJobClient:   org.apache.hama.graph.GraphJobRunner$GraphJobCounter

15/02/24 01:02:51 INFO bsp.BSPJobClient:     ITERATIONS=6

15/02/24 01:02:51 INFO bsp.BSPJobClient:     INPUT_VERTICES=4

15/02/24 01:02:51 INFO bsp.BSPJobClient:   org.apache.hama.bsp.JobInProgress$JobCounter

15/02/24 01:02:51 INFO bsp.BSPJobClient:     SUPERSTEPS=7

15/02/24 01:02:51 INFO bsp.BSPJobClient:     LAUNCHED_TASKS=2

15/02/24 01:02:51 INFO bsp.BSPJobClient:   org.apache.hama.bsp.BSPPeerImpl$PeerCounter

15/02/24 01:02:51 INFO bsp.BSPJobClient:     SUPERSTEP_SUM=16

15/02/24 01:02:51 INFO bsp.BSPJobClient:     MESSAGE_BYTES_TRANSFERED=916

15/02/24 01:02:51 INFO bsp.BSPJobClient:     IO_BYTES_READ=90

15/02/24 01:02:51 INFO bsp.BSPJobClient:     TIME_IN_SYNC_MS=8

15/02/24 01:02:51 INFO bsp.BSPJobClient:     TOTAL_MESSAGES_SENT=38

15/02/24 01:02:51 INFO bsp.BSPJobClient:     TASK_INPUT_RECORDS=4

15/02/24 01:02:51 INFO bsp.BSPJobClient:     TOTAL_MESSAGES_RECEIVED=36

15/02/24 01:02:51 INFO bsp.BSPJobClient:     TASK_OUTPUT_RECORDS=4

Job Finished in 6.36 seconds
C -> D L expvalue = D L
A -> B L expvalue = B L
D -> C R expvalue = C R
B -> A R expvalue = A R
Tests run: 1, Failures: 0, Errors: 0, Skipped: 0, Time elapsed: 0.008 sec
Running org.apache.hama.examples.SemiClusterMatchingTest
15/02/24 01:02:52 WARN util.NativeCodeLoader: Unable to load native-hadoop library for your platform... using builtin-java classes where applicable

15/02/24 01:02:52 INFO bsp.FileInputFormat: Total input paths to process : 1

15/02/24 01:02:52 WARN snappy.LoadSnappy: Snappy native library not loaded

15/02/24 01:02:52 INFO bsp.FileInputFormat: Total input paths to process : 1

15/02/24 01:02:52 WARN bsp.BSPJobClient: No job jar file set.  User classes may not be found. See BSPJob#setJar(String) or check Your jar file.

15/02/24 01:02:52 INFO bsp.BSPJobClient: Running job: job_localrunner_0001

15/02/24 01:02:52 INFO bsp.LocalBSPRunner: Setting up a new barrier for 1 tasks!

15/02/24 01:02:55 INFO bsp.BSPJobClient: Current supersteps number: 1

15/02/24 01:02:55 INFO bsp.BSPJobClient: The total number of supersteps: 1

15/02/24 01:02:55 INFO bsp.BSPJobClient: Counters: 6

15/02/24 01:02:55 INFO bsp.BSPJobClient:   org.apache.hama.bsp.JobInProgress$JobCounter

15/02/24 01:02:55 INFO bsp.BSPJobClient:     SUPERSTEPS=1

15/02/24 01:02:55 INFO bsp.BSPJobClient:     LAUNCHED_TASKS=1

15/02/24 01:02:55 INFO bsp.BSPJobClient:   org.apache.hama.bsp.BSPPeerImpl$PeerCounter

15/02/24 01:02:55 INFO bsp.BSPJobClient:     SUPERSTEP_SUM=2

15/02/24 01:02:55 INFO bsp.BSPJobClient:     IO_BYTES_READ=7189

15/02/24 01:02:55 INFO bsp.BSPJobClient:     TIME_IN_SYNC_MS=0

15/02/24 01:02:55 INFO bsp.BSPJobClient:     TASK_INPUT_RECORDS=100

15/02/24 01:02:55 INFO bsp.FileInputFormat: Total input paths to process : 3

15/02/24 01:02:55 WARN bsp.BSPJobClient: No job jar file set.  User classes may not be found. See BSPJob#setJar(String) or check Your jar file.

15/02/24 01:02:55 INFO bsp.LocalBSPRunner: Setting up a new barrier for 3 tasks!

15/02/24 01:02:55 INFO bsp.BSPJobClient: Running job: job_localrunner_0001

15/02/24 01:02:55 INFO graph.GraphJobRunner: 33 vertices are loaded into local:2

15/02/24 01:02:55 INFO graph.GraphJobRunner: 34 vertices are loaded into local:1

15/02/24 01:02:55 INFO graph.GraphJobRunner: 33 vertices are loaded into local:0

15/02/24 01:02:58 INFO bsp.BSPJobClient: Current supersteps number: 15

15/02/24 01:02:58 INFO bsp.BSPJobClient: The total number of supersteps: 15

15/02/24 01:02:58 INFO bsp.BSPJobClient: Counters: 12

15/02/24 01:02:58 INFO bsp.BSPJobClient:   org.apache.hama.graph.GraphJobRunner$GraphJobCounter

15/02/24 01:02:58 INFO bsp.BSPJobClient:     ITERATIONS=15

15/02/24 01:02:58 INFO bsp.BSPJobClient:     INPUT_VERTICES=100

15/02/24 01:02:58 INFO bsp.BSPJobClient:   org.apache.hama.bsp.JobInProgress$JobCounter

15/02/24 01:02:58 INFO bsp.BSPJobClient:     SUPERSTEPS=15

15/02/24 01:02:58 INFO bsp.BSPJobClient:     LAUNCHED_TASKS=3

15/02/24 01:02:58 INFO bsp.BSPJobClient:   org.apache.hama.bsp.BSPPeerImpl$PeerCounter

15/02/24 01:02:58 INFO bsp.BSPJobClient:     SUPERSTEP_SUM=48

15/02/24 01:02:58 INFO bsp.BSPJobClient:     MESSAGE_BYTES_TRANSFERED=24655041

15/02/24 01:02:58 INFO bsp.BSPJobClient:     IO_BYTES_READ=8850

15/02/24 01:02:58 INFO bsp.BSPJobClient:     TIME_IN_SYNC_MS=204

15/02/24 01:02:58 INFO bsp.BSPJobClient:     TOTAL_MESSAGES_SENT=166202

15/02/24 01:02:58 INFO bsp.BSPJobClient:     TASK_INPUT_RECORDS=100

15/02/24 01:02:58 INFO bsp.BSPJobClient:     TOTAL_MESSAGES_RECEIVED=4596

15/02/24 01:02:58 INFO bsp.BSPJobClient:     TASK_OUTPUT_RECORDS=100

Job Finished in 6.382 seconds
C1691 = [41, 44, 47, 42, 45, 48, 40, 43, 46, 49]
C1598 = [14, 17, 11, 18, 15, 12, 19, 16, 10, 13]
C1784 = [77, 74, 71, 78, 72, 75, 79, 76, 73, 70]
C1722 = [56, 59, 50, 53, 57, 54, 51, 55, 58, 52]
C1815 = [86, 83, 80, 89, 84, 81, 87, 85, 82, 88]
C79 = [5, 8, 2, 0, 6, 3, 9, 7, 1, 4]
C1753 = [62, 65, 68, 60, 63, 69, 66, 64, 61, 67]
C1629 = [26, 20, 23, 29, 27, 21, 24, 25, 28, 22]
C1846 = [98, 92, 95, 99, 90, 93, 96, 91, 94, 97]
C1660 = [38, 35, 32, 39, 36, 33, 30, 37, 34, 31]
Tests run: 1, Failures: 0, Errors: 0, Skipped: 0, Time elapsed: 0.008 sec

Results :

Failed tests: 

Tests run: 21, Failures: 1, Errors: 0, Skipped: 0

[INFO] ------------------------------------------------------------------------
[INFO] Reactor Summary:
[INFO] 
[INFO] Apache Hama parent POM ............................ SUCCESS [37.628s]
[INFO] pipes ............................................. SUCCESS [32.078s]
[INFO] commons ........................................... SUCCESS [18.462s]
[INFO] core .............................................. SUCCESS [3:09.014s]
[INFO] graph ............................................. SUCCESS [19.162s]
[INFO] machine learning .................................. SUCCESS [1:51.686s]
[INFO] examples .......................................... FAILURE [1:37.022s]
[INFO] mesos ............................................. SKIPPED
[INFO] hama-dist ......................................... SKIPPED
[INFO] ------------------------------------------------------------------------
[INFO] BUILD FAILURE
[INFO] ------------------------------------------------------------------------
[INFO] Total time: 8:27.787s
[INFO] Finished at: Tue Feb 24 01:02:58 UTC 2015
[INFO] Final Memory: 94M/196M
[INFO] ------------------------------------------------------------------------
[ERROR] Failed to execute goal org.apache.maven.plugins:maven-surefire-plugin:2.6:test (default-test) on project hama-examples: There are test failures.
[ERROR] 
[ERROR] Please refer to <https://builds.apache.org/job/Hama-Nightly-for-Hadoop-1.x/ws/trunk/examples/target/surefire-reports> for the individual test results.
[ERROR] -> [Help 1]
[ERROR] 
[ERROR] To see the full stack trace of the errors, re-run Maven with the -e switch.
[ERROR] Re-run Maven using the -X switch to enable full debug logging.
[ERROR] 
[ERROR] For more information about the errors and possible solutions, please read the following articles:
[ERROR] [Help 1] http://cwiki.apache.org/confluence/display/MAVEN/MojoFailureException
[ERROR] 
[ERROR] After correcting the problems, you can resume the build with the command
[ERROR]   mvn <goals> -rf :hama-examples
Build step 'Invoke top-level Maven targets' marked build as failure
Archiving artifacts
Sending artifact delta relative to Hama-Nightly-for-Hadoop-1.x #1530
Archived 143 artifacts
Archive block size is 32768
Received 0 blocks and 401061 bytes
Compression is 0.0%
Took 2.3 sec
Recording test results

Jenkins build is back to normal : Hama-Nightly-for-Hadoop-1.x #1533

Posted by Apache Jenkins Server <je...@builds.apache.org>.
See <https://builds.apache.org/job/Hama-Nightly-for-Hadoop-1.x/1533/>


Build failed in Jenkins: Hama-Nightly-for-Hadoop-1.x #1532

Posted by Apache Jenkins Server <je...@builds.apache.org>.
See <https://builds.apache.org/job/Hama-Nightly-for-Hadoop-1.x/1532/>

------------------------------------------
[...truncated 5346 lines...]
Tests run: 1, Failures: 0, Errors: 0, Skipped: 0, Time elapsed: 0.009 sec
Running org.apache.hama.bsp.TestZooKeeper
15/02/25 00:00:09 ERROR quorum.QuorumPeerConfig: Invalid configuration, only one server specified (ignoring)

15/02/25 00:00:09 INFO server.ZooKeeperServerMain: Starting server

15/02/25 00:00:09 INFO server.ZooKeeperServer: Server environment:zookeeper.version=3.4.5-1392090, built on 09/30/2012 17:52 GMT

15/02/25 00:00:09 INFO server.ZooKeeperServer: Server environment:host.name=asf910.gq1.ygridcore.net

15/02/25 00:00:09 INFO server.ZooKeeperServer: Server environment:java.version=1.7.0_25

15/02/25 00:00:09 INFO server.ZooKeeperServer: Server environment:java.vendor=Oracle Corporation

15/02/25 00:00:09 INFO server.ZooKeeperServer: Server environment:java.home=/home/jenkins/tools/java/jdk1.7.0_25-32/jre

15/02/25 00:00:09 INFO server.ZooKeeperServer: Server environment:java.class.path=/tmp/surefirebooter7926283837283709483.jar

15/02/25 00:00:09 INFO server.ZooKeeperServer: Server environment:java.library.path=/usr/java/packages/lib/i386:/lib:/usr/lib

15/02/25 00:00:09 INFO server.ZooKeeperServer: Server environment:java.io.tmpdir=/tmp

15/02/25 00:00:09 INFO server.ZooKeeperServer: Server environment:java.compiler=<NA>

15/02/25 00:00:09 INFO server.ZooKeeperServer: Server environment:os.name=Linux

15/02/25 00:00:09 INFO server.ZooKeeperServer: Server environment:os.arch=i386

15/02/25 00:00:09 INFO server.ZooKeeperServer: Server environment:os.version=3.13.0-36-lowlatency

15/02/25 00:00:09 INFO server.ZooKeeperServer: Server environment:user.name=jenkins

15/02/25 00:00:09 INFO server.ZooKeeperServer: Server environment:user.home=/home/jenkins

15/02/25 00:00:09 INFO server.ZooKeeperServer: Server environment:user.dir=/tmp

15/02/25 00:00:09 INFO server.ZooKeeperServer: tickTime set to 3000

15/02/25 00:00:09 INFO server.ZooKeeperServer: minSessionTimeout set to -1

15/02/25 00:00:09 INFO server.ZooKeeperServer: maxSessionTimeout set to 1200000

15/02/25 00:00:09 INFO server.NIOServerCnxnFactory: binding to port 0.0.0.0/0.0.0.0:20000

15/02/25 00:00:09 INFO persistence.FileSnap: Reading snapshot /tmp/hama-testzookeeper/version-2/snapshot.350

15/02/25 00:00:09 INFO persistence.FileTxnSnapLog: Snapshotting: 0x355 to /tmp/hama-testzookeeper/version-2/snapshot.355

15/02/25 00:00:19 INFO zookeeper.ZooKeeper: Client environment:zookeeper.version=3.4.5-1392090, built on 09/30/2012 17:52 GMT

15/02/25 00:00:19 INFO zookeeper.ZooKeeper: Client environment:host.name=asf910.gq1.ygridcore.net

15/02/25 00:00:19 INFO zookeeper.ZooKeeper: Client environment:java.version=1.7.0_25

15/02/25 00:00:19 INFO zookeeper.ZooKeeper: Client environment:java.vendor=Oracle Corporation

15/02/25 00:00:19 INFO zookeeper.ZooKeeper: Client environment:java.home=/home/jenkins/tools/java/jdk1.7.0_25-32/jre

15/02/25 00:00:19 INFO zookeeper.ZooKeeper: Client environment:java.class.path=/tmp/surefirebooter7926283837283709483.jar

15/02/25 00:00:19 INFO zookeeper.ZooKeeper: Client environment:java.library.path=/usr/java/packages/lib/i386:/lib:/usr/lib

15/02/25 00:00:19 INFO zookeeper.ZooKeeper: Client environment:java.io.tmpdir=/tmp

15/02/25 00:00:19 INFO zookeeper.ZooKeeper: Client environment:java.compiler=<NA>

15/02/25 00:00:19 INFO zookeeper.ZooKeeper: Client environment:os.name=Linux

15/02/25 00:00:19 INFO zookeeper.ZooKeeper: Client environment:os.arch=i386

15/02/25 00:00:19 INFO zookeeper.ZooKeeper: Client environment:os.version=3.13.0-36-lowlatency

15/02/25 00:00:19 INFO zookeeper.ZooKeeper: Client environment:user.name=jenkins

15/02/25 00:00:19 INFO zookeeper.ZooKeeper: Client environment:user.home=/home/jenkins

15/02/25 00:00:19 INFO zookeeper.ZooKeeper: Client environment:user.dir=/tmp

15/02/25 00:00:19 INFO zookeeper.ZooKeeper: Initiating client connection, connectString=localhost:20000 sessionTimeout=1200000 watcher=org.apache.hama.bsp.sync.ZKSyncBSPMasterClient@dfb596

15/02/25 00:00:19 INFO sync.ZKSyncBSPMasterClient: Initialized ZK false

15/02/25 00:00:19 INFO sync.ZKSyncClient: Initializing ZK Sync Client

15/02/25 00:00:19 INFO zookeeper.ClientCnxn: Opening socket connection to server localhost/0:0:0:0:0:0:0:1:20000. Will not attempt to authenticate using SASL (unknown error)

15/02/25 00:00:19 INFO server.NIOServerCnxnFactory: Accepted socket connection from /0:0:0:0:0:0:0:1:34288

15/02/25 00:00:19 INFO zookeeper.ClientCnxn: Socket connection established to localhost/0:0:0:0:0:0:0:1:20000, initiating session

15/02/25 00:00:19 INFO server.ZooKeeperServer: Client attempting to establish new session at /0:0:0:0:0:0:0:1:34288

15/02/25 00:00:19 INFO persistence.FileTxnLog: Creating new log file: log.356

15/02/25 00:00:19 INFO server.ZooKeeperServer: Established session 0x14bbe08986b0000 with negotiated timeout 1200000 for client /0:0:0:0:0:0:0:1:34288

15/02/25 00:00:19 INFO zookeeper.ClientCnxn: Session establishment complete on server localhost/0:0:0:0:0:0:0:1:20000, sessionid = 0x14bbe08986b0000, negotiated timeout = 1200000

15/02/25 00:00:19 INFO mortbay.log: Logging to org.slf4j.impl.Log4jLoggerAdapter(org.mortbay.log) via org.mortbay.log.Slf4jLog

15/02/25 00:00:19 INFO mortbay.log: Created master and client sync clients

15/02/25 00:00:19 INFO mortbay.log: BSP root exists

15/02/25 00:00:19 INFO zookeeper.ZooKeeper: Initiating client connection, connectString=localhost:20000 sessionTimeout=1200000 watcher=org.apache.hama.bsp.sync.ZooKeeperSyncClientImpl@12add53

15/02/25 00:00:19 INFO zookeeper.ClientCnxn: Opening socket connection to server localhost/0:0:0:0:0:0:0:1:20000. Will not attempt to authenticate using SASL (unknown error)

15/02/25 00:00:19 INFO sync.ZKSyncClient: Initializing ZK Sync Client

15/02/25 00:00:19 INFO sync.ZooKeeperSyncClientImpl: Start connecting to Zookeeper! At /0.0.0.0:21815

15/02/25 00:00:19 INFO zookeeper.ClientCnxn: Socket connection established to localhost/0:0:0:0:0:0:0:1:20000, initiating session

15/02/25 00:00:19 INFO server.NIOServerCnxnFactory: Accepted socket connection from /0:0:0:0:0:0:0:1:34289

15/02/25 00:00:19 INFO server.ZooKeeperServer: Client attempting to establish new session at /0:0:0:0:0:0:0:1:34289

15/02/25 00:00:19 INFO server.ZooKeeperServer: Established session 0x14bbe08986b0001 with negotiated timeout 1200000 for client /0:0:0:0:0:0:0:1:34289

15/02/25 00:00:19 INFO zookeeper.ClientCnxn: Session establishment complete on server localhost/0:0:0:0:0:0:0:1:20000, sessionid = 0x14bbe08986b0001, negotiated timeout = 1200000

15/02/25 00:00:19 INFO sync.ZKSyncClient: Writing data /bsp/job_test1_0001/info/level2

15/02/25 00:00:19 INFO mortbay.log: Found child count = 2

15/02/25 00:00:19 INFO mortbay.log: Passed the child count test

15/02/25 00:00:19 INFO mortbay.log: Found child count = 2

15/02/25 00:00:19 INFO mortbay.log:  Peer name 2

15/02/25 00:00:19 INFO mortbay.log:  Peer name 1

15/02/25 00:00:19 INFO mortbay.log: Passed the child key set test

15/02/25 00:00:19 INFO mortbay.log: /bsp/job_test1_0001

15/02/25 00:00:19 INFO mortbay.log: Passed the key presence test

15/02/25 00:00:19 INFO sync.ZKSyncClient: Writing data /bsp/job_test1_0001/info/level3

15/02/25 00:00:19 INFO mortbay.log: Passed array writable test

15/02/25 00:00:19 INFO server.NIOServerCnxn: Closed socket connection for client /0:0:0:0:0:0:0:1:34289 which had sessionid 0x14bbe08986b0001

15/02/25 00:00:19 INFO zookeeper.ClientCnxn: Unable to read additional data from server sessionid 0x14bbe08986b0001, likely server has closed socket, closing socket connection and attempting reconnect

15/02/25 00:00:19 INFO server.NIOServerCnxn: Closed socket connection for client /0:0:0:0:0:0:0:1:34288 which had sessionid 0x14bbe08986b0000

15/02/25 00:00:19 INFO zookeeper.ClientCnxn: Unable to read additional data from server sessionid 0x14bbe08986b0000, likely server has closed socket, closing socket connection and attempting reconnect

15/02/25 00:00:19 INFO server.NIOServerCnxnFactory: NIOServerCnxn factory exited run method

15/02/25 00:00:19 INFO server.ZooKeeperServer: shutting down

15/02/25 00:00:19 INFO server.ZooKeeperServer: shutting down

15/02/25 00:00:19 INFO server.SessionTrackerImpl: Shutting down

15/02/25 00:00:19 INFO server.SessionTrackerImpl: Shutting down

15/02/25 00:00:19 INFO server.PrepRequestProcessor: Shutting down

15/02/25 00:00:19 INFO server.PrepRequestProcessor: Shutting down

15/02/25 00:00:19 INFO server.PrepRequestProcessor: PrepRequestProcessor exited loop!

15/02/25 00:00:19 INFO server.SyncRequestProcessor: Shutting down

15/02/25 00:00:19 INFO server.SyncRequestProcessor: Shutting down

15/02/25 00:00:19 INFO server.SyncRequestProcessor: SyncRequestProcessor exited!

15/02/25 00:00:19 INFO server.FinalRequestProcessor: shutdown of request processor complete

15/02/25 00:00:19 INFO server.FinalRequestProcessor: shutdown of request processor complete

15/02/25 00:00:19 WARN jmx.MBeanRegistry: Failed to unregister MBean InMemoryDataTree

15/02/25 00:00:19 WARN jmx.MBeanRegistry: Error during unregister
javax.management.InstanceNotFoundException: org.apache.ZooKeeperService:name0=StandaloneServer_port-1,name1=InMemoryDataTree
	at com.sun.jmx.interceptor.DefaultMBeanServerInterceptor.getMBean(DefaultMBeanServerInterceptor.java:1095)
	at com.sun.jmx.interceptor.DefaultMBeanServerInterceptor.exclusiveUnregisterMBean(DefaultMBeanServerInterceptor.java:427)
	at com.sun.jmx.interceptor.DefaultMBeanServerInterceptor.unregisterMBean(DefaultMBeanServerInterceptor.java:415)
	at com.sun.jmx.mbeanserver.JmxMBeanServer.unregisterMBean(JmxMBeanServer.java:546)
	at org.apache.zookeeper.jmx.MBeanRegistry.unregister(MBeanRegistry.java:115)
	at org.apache.zookeeper.jmx.MBeanRegistry.unregister(MBeanRegistry.java:132)
	at org.apache.zookeeper.server.ZooKeeperServer.unregisterJMX(ZooKeeperServer.java:443)
	at org.apache.zookeeper.server.ZooKeeperServer.shutdown(ZooKeeperServer.java:436)
	at org.apache.zookeeper.server.ZooKeeperServerMain.runFromConfig(ZooKeeperServerMain.java:115)
	at org.apache.hama.bsp.sync.ZooKeeperSyncServerImpl.start(ZooKeeperSyncServerImpl.java:79)
	at org.apache.hama.bsp.TestZooKeeper$1.run(TestZooKeeper.java:76)
	at java.util.concurrent.Executors$RunnableAdapter.call(Executors.java:471)
	at java.util.concurrent.FutureTask$Sync.innerRun(FutureTask.java:334)
	at java.util.concurrent.FutureTask.run(FutureTask.java:166)
	at java.util.concurrent.ThreadPoolExecutor.runWorker(ThreadPoolExecutor.java:1145)
	at java.util.concurrent.ThreadPoolExecutor$Worker.run(ThreadPoolExecutor.java:615)
	at java.lang.Thread.run(Thread.java:724)

Tests run: 1, Failures: 0, Errors: 0, Skipped: 0, Time elapsed: 0.015 sec

Results :

Failed tests: 

Tests run: 66, Failures: 1, Errors: 0, Skipped: 0

[INFO] ------------------------------------------------------------------------
[INFO] Reactor Summary:
[INFO] 
[INFO] Apache Hama parent POM ............................ SUCCESS [3.995s]
[INFO] pipes ............................................. SUCCESS [15.392s]
[INFO] commons ........................................... SUCCESS [6.698s]
[INFO] core .............................................. FAILURE [2:44.943s]
[INFO] graph ............................................. SKIPPED
[INFO] machine learning .................................. SKIPPED
[INFO] examples .......................................... SKIPPED
[INFO] mesos ............................................. SKIPPED
[INFO] hama-dist ......................................... SKIPPED
[INFO] ------------------------------------------------------------------------
[INFO] BUILD FAILURE
[INFO] ------------------------------------------------------------------------
[INFO] Total time: 3:11.668s
[INFO] Finished at: Wed Feb 25 00:00:19 UTC 2015
[INFO] Final Memory: 56M/570M
[INFO] ------------------------------------------------------------------------
[ERROR] Failed to execute goal org.apache.maven.plugins:maven-surefire-plugin:2.6:test (default-test) on project hama-core: There are test failures.
[ERROR] 
[ERROR] Please refer to <https://builds.apache.org/job/Hama-Nightly-for-Hadoop-1.x/ws/trunk/core/target/surefire-reports> for the individual test results.
[ERROR] -> [Help 1]
[ERROR] 
[ERROR] To see the full stack trace of the errors, re-run Maven with the -e switch.
[ERROR] Re-run Maven using the -X switch to enable full debug logging.
[ERROR] 
[ERROR] For more information about the errors and possible solutions, please read the following articles:
[ERROR] [Help 1] http://cwiki.apache.org/confluence/display/MAVEN/MojoFailureException
[ERROR] 
[ERROR] After correcting the problems, you can resume the build with the command
[ERROR]   mvn <goals> -rf :hama-core
Build step 'Invoke top-level Maven targets' marked build as failure
Archiving artifacts
Sending artifact delta relative to Hama-Nightly-for-Hadoop-1.x #1530
Archived 76 artifacts
Archive block size is 32768
Received 0 blocks and 253824 bytes
Compression is 0.0%
Took 2.7 sec
Recording test results