You are viewing a plain text version of this content. The canonical link for it is here.
Posted to builds@solr.apache.org by Apache Jenkins Server <je...@builds.apache.org> on 2025/11/07 07:05:55 UTC

[JENKINS] Solr » Solr-reference-guide-9.x - Build # 1179 - Still Failing!

Build: https://ci-builds.apache.org/job/Solr/job/Solr-reference-guide-9.x/1179/

Log: 
Started by an SCM change
Running as SYSTEM
[EnvInject] - Loading node environment variables.
Building remotely on websites3 (git-websites svn-websites) in workspace /home/jenkins/712657a4/workspace/Solr/Solr-reference-guide-9.x
The recommended git tool is: NONE
No credentials specified
 > git rev-parse --resolve-git-dir /home/jenkins/712657a4/workspace/Solr/Solr-reference-guide-9.x/.git # timeout=10
Fetching changes from the remote Git repository
 > git config remote.origin.url https://gitbox.apache.org/repos/asf/solr.git # timeout=10
Cleaning workspace
 > git rev-parse --verify HEAD # timeout=10
Resetting working tree
 > git reset --hard # timeout=10
 > git clean -fdx # timeout=10
Fetching upstream changes from https://gitbox.apache.org/repos/asf/solr.git
 > git --version # timeout=10
 > git --version # 'git version 2.34.1'
 > git fetch --tags --force --progress -- https://gitbox.apache.org/repos/asf/solr.git +refs/heads/*:refs/remotes/origin/* # timeout=10
 > git rev-parse refs/remotes/origin/branch_9x^{commit} # timeout=10
Checking out Revision d9c0eb439144f7f8dbeaac53a481524165f689c0 (refs/remotes/origin/branch_9x)
 > git config core.sparsecheckout # timeout=10
 > git checkout -f d9c0eb439144f7f8dbeaac53a481524165f689c0 # timeout=10
Commit message: "DOAP changes for release 9.10.0"
 > git rev-list --no-walk 1829e89d7c07e81812d7668fd738b99985118c41 # timeout=10
No emails were triggered.
[Gradle] - Launching build.
[Solr-reference-guide-9.x] $ /home/jenkins/712657a4/workspace/Solr/Solr-reference-guide-9.x/gradlew checkSite
Downloading gradle-wrapper.jar from https://raw.githubusercontent.com/gradle/gradle/v8.10.2/gradle/wrapper/gradle-wrapper.jar
Generating gradle.properties
To honour the JVM settings for this build a single-use Daemon process will be forked. For more on this, please refer to https://docs.gradle.org/8.10/userguide/gradle_daemon.html#sec:disabling_the_daemon in the Gradle documentation.
Daemon will be stopped at the end of the build 

> Task :buildSrc:compileJava
Note: /home/jenkins/712657a4/workspace/Solr/Solr-reference-guide-9.x/buildSrc/src/main/java/org/apache/lucene/gradle/Checksum.java uses or overrides a deprecated API.
Note: Recompile with -Xlint:deprecation for details.

> Task :buildSrc:compileGroovy NO-SOURCE
> Task :buildSrc:processResources NO-SOURCE
> Task :buildSrc:classes
> Task :buildSrc:jar

FAILURE: Build completed with 2 failures.

1: Task failed with an exception.
-----------
* Where:
Build file '/home/jenkins/712657a4/workspace/Solr/Solr-reference-guide-9.x/build.gradle' line: 125

* What went wrong:
A problem occurred evaluating root project 'solr-root'.
> Could not read workspace metadata from /home/jenkins/.gradle/caches/8.10/groovy-dsl/c5c4d75e434c9f0f66f7b3ce0eb9cb83/metadata.bin

* Try:
> Run with --stacktrace option to get the stack trace.
> Run with --info or --debug option to get more log output.
> Get more help at https://help.gradle.org.
==============================================================================

2: Task failed with an exception.
-----------
* Where:
Build file '/home/jenkins/712657a4/workspace/Solr/Solr-reference-guide-9.x/solr/core/build.gradle' line: 28

* What went wrong:
A problem occurred evaluating project ':solr:core'.
> Could not find method permitUnusedDeclared() for arguments [com.github.spotbugs:spotbugs-annotations] on object of type org.gradle.api.internal.artifacts.dsl.dependencies.DefaultDependencyHandler.

* Try:
> Run with --stacktrace option to get the stack trace.
> Run with --info or --debug option to get more log output.
> Get more help at https://help.gradle.org.
==============================================================================

BUILD FAILED in 22s
2 actionable tasks: 2 executed

Publishing build scan...
https://develocity.apache.org/s/szw2l7dqkwqh6

Build step 'Invoke Gradle script' changed build result to FAILURE
Build step 'Invoke Gradle script' marked build as failure
SSH: Current build result is [FAILURE], not going to run.
Email was triggered for: Failure - Any
Sending email for trigger: Failure - Any

[JENKINS] Solr » Solr-reference-guide-9.x - Build # 1181 - Still Failing!

Posted by Apache Jenkins Server <je...@builds.apache.org>.
Build: https://ci-builds.apache.org/job/Solr/job/Solr-reference-guide-9.x/1181/

Log: 
Started by an SCM change
Running as SYSTEM
[EnvInject] - Loading node environment variables.
Building remotely on websites2 (git-websites svn-websites) in workspace /home/jenkins/712657a4/workspace/Solr/Solr-reference-guide-9.x
The recommended git tool is: NONE
No credentials specified
Cloning the remote Git repository
Cloning repository https://gitbox.apache.org/repos/asf/solr.git
 > git init /home/jenkins/712657a4/workspace/Solr/Solr-reference-guide-9.x # timeout=10
Fetching upstream changes from https://gitbox.apache.org/repos/asf/solr.git
 > git --version # timeout=10
 > git --version # 'git version 2.43.0'
 > git fetch --tags --force --progress -- https://gitbox.apache.org/repos/asf/solr.git +refs/heads/*:refs/remotes/origin/* # timeout=10
 > git config remote.origin.url https://gitbox.apache.org/repos/asf/solr.git # timeout=10
 > git config --add remote.origin.fetch +refs/heads/*:refs/remotes/origin/* # timeout=10
Avoid second fetch
 > git rev-parse refs/remotes/origin/branch_9x^{commit} # timeout=10
Checking out Revision faab7a2f0cd46f92d856975406e484c120061bb9 (refs/remotes/origin/branch_9x)
 > git config core.sparsecheckout # timeout=10
 > git checkout -f faab7a2f0cd46f92d856975406e484c120061bb9 # timeout=10
Commit message: "SOLR-17985: Speed up no-rows distributed queries (#3849)"
 > git rev-list --no-walk d9c0eb439144f7f8dbeaac53a481524165f689c0 # timeout=10
No emails were triggered.
[Gradle] - Launching build.
[Solr-reference-guide-9.x] $ /home/jenkins/712657a4/workspace/Solr/Solr-reference-guide-9.x/gradlew checkSite

ERROR: JAVA_HOME is set to an invalid directory: /home/jenkins/tools/java/latest11

Please set the JAVA_HOME variable in your environment to match the
location of your Java installation.

Build step 'Invoke Gradle script' changed build result to FAILURE
Build step 'Invoke Gradle script' marked build as failure
SSH: Current build result is [FAILURE], not going to run.
Email was triggered for: Failure - Any
Sending email for trigger: Failure - Any

[JENKINS] Solr » Solr-reference-guide-9.x - Build # 1180 - Still Failing!

Posted by Apache Jenkins Server <je...@builds.apache.org>.
Build: https://ci-builds.apache.org/job/Solr/job/Solr-reference-guide-9.x/1180/

Log: 
Started by an SCM change
Running as SYSTEM
[EnvInject] - Loading node environment variables.
Building remotely on websites1 (git-websites svn-websites) in workspace /home/jenkins/712657a4/workspace/Solr/Solr-reference-guide-9.x
The recommended git tool is: NONE
No credentials specified
 > git rev-parse --resolve-git-dir /home/jenkins/712657a4/workspace/Solr/Solr-reference-guide-9.x/.git # timeout=10
Fetching changes from the remote Git repository
 > git config remote.origin.url https://gitbox.apache.org/repos/asf/solr.git # timeout=10
Cleaning workspace
 > git rev-parse --verify HEAD # timeout=10
Resetting working tree
 > git reset --hard # timeout=10
 > git clean -fdx # timeout=10
Fetching upstream changes from https://gitbox.apache.org/repos/asf/solr.git
 > git --version # timeout=10
 > git --version # 'git version 2.43.0'
 > git fetch --tags --force --progress -- https://gitbox.apache.org/repos/asf/solr.git +refs/heads/*:refs/remotes/origin/* # timeout=10
ERROR: Error fetching remote repo 'origin'
hudson.plugins.git.GitException: Failed to fetch from https://gitbox.apache.org/repos/asf/solr.git
	at PluginClassLoader for git//hudson.plugins.git.GitSCM.fetchFrom(GitSCM.java:997)
	at PluginClassLoader for git//hudson.plugins.git.GitSCM.retrieveChanges(GitSCM.java:1239)
	at PluginClassLoader for git//hudson.plugins.git.GitSCM._checkout(GitSCM.java:1310)
	at PluginClassLoader for git//hudson.plugins.git.GitSCM.checkout(GitSCM.java:1277)
	at hudson.scm.SCM.checkout(SCM.java:540)
	at hudson.model.AbstractProject.checkout(AbstractProject.java:1250)
	at hudson.model.AbstractBuild$AbstractBuildExecution.defaultCheckout(AbstractBuild.java:649)
	at jenkins.scm.SCMCheckoutStrategy.checkout(SCMCheckoutStrategy.java:85)
	at hudson.model.AbstractBuild$AbstractBuildExecution.run(AbstractBuild.java:522)
	at hudson.model.Run.execute(Run.java:1833)
	at hudson.model.FreeStyleBuild.run(FreeStyleBuild.java:44)
	at hudson.model.ResourceController.execute(ResourceController.java:101)
	at hudson.model.Executor.run(Executor.java:446)
Caused by: hudson.plugins.git.GitException: Command "git fetch --tags --force --progress -- https://gitbox.apache.org/repos/asf/solr.git +refs/heads/*:refs/remotes/origin/*" returned status code 128:
stdout: 
stderr: error: RPC failed; curl 56 Recv failure: Connection reset by peer
error: 7 bytes of body are still expected
fatal: expected flush after ref listing

	at PluginClassLoader for git-client//org.jenkinsci.plugins.gitclient.CliGitAPIImpl.launchCommandIn(CliGitAPIImpl.java:2848)
	at PluginClassLoader for git-client//org.jenkinsci.plugins.gitclient.CliGitAPIImpl.launchCommandWithCredentials(CliGitAPIImpl.java:2184)
	at PluginClassLoader for git-client//org.jenkinsci.plugins.gitclient.CliGitAPIImpl$1.execute(CliGitAPIImpl.java:635)
	at PluginClassLoader for git-client//org.jenkinsci.plugins.gitclient.RemoteGitImpl$CommandInvocationHandler$GitCommandMasterToSlaveCallable.call(RemoteGitImpl.java:170)
	at PluginClassLoader for git-client//org.jenkinsci.plugins.gitclient.RemoteGitImpl$CommandInvocationHandler$GitCommandMasterToSlaveCallable.call(RemoteGitImpl.java:161)
	at hudson.remoting.UserRequest.perform(UserRequest.java:225)
	at hudson.remoting.UserRequest.perform(UserRequest.java:50)
	at hudson.remoting.Request$2.run(Request.java:391)
	at hudson.remoting.InterceptingExecutorService.lambda$wrap$0(InterceptingExecutorService.java:81)
	at java.base/java.util.concurrent.FutureTask.run(FutureTask.java:264)
	at java.base/java.util.concurrent.ThreadPoolExecutor.runWorker(ThreadPoolExecutor.java:1136)
	at java.base/java.util.concurrent.ThreadPoolExecutor$Worker.run(ThreadPoolExecutor.java:635)
	at java.base/java.lang.Thread.run(Thread.java:840)
	Suppressed: hudson.remoting.Channel$CallSiteStackTrace: Remote call to websites1
		at hudson.remoting.Channel.attachCallSiteStackTrace(Channel.java:1923)
		at hudson.remoting.UserRequest$ExceptionResponse.retrieve(UserRequest.java:384)
		at hudson.remoting.Channel.call(Channel.java:1112)
		at PluginClassLoader for git-client//org.jenkinsci.plugins.gitclient.RemoteGitImpl$CommandInvocationHandler.execute(RemoteGitImpl.java:153)
		at jdk.internal.reflect.GeneratedMethodAccessor1122.invoke(Unknown Source)
		at java.base/jdk.internal.reflect.DelegatingMethodAccessorImpl.invoke(DelegatingMethodAccessorImpl.java:43)
		at java.base/java.lang.reflect.Method.invoke(Method.java:569)
		at PluginClassLoader for git-client//org.jenkinsci.plugins.gitclient.RemoteGitImpl$CommandInvocationHandler.invoke(RemoteGitImpl.java:138)
		at PluginClassLoader for git-client/jdk.proxy119/jdk.proxy119.$Proxy247.execute(Unknown Source)
		at PluginClassLoader for git//hudson.plugins.git.GitSCM.fetchFrom(GitSCM.java:995)
		at PluginClassLoader for git//hudson.plugins.git.GitSCM.retrieveChanges(GitSCM.java:1239)
		at PluginClassLoader for git//hudson.plugins.git.GitSCM._checkout(GitSCM.java:1310)
		at PluginClassLoader for git//hudson.plugins.git.GitSCM.checkout(GitSCM.java:1277)
		at hudson.scm.SCM.checkout(SCM.java:540)
		at hudson.model.AbstractProject.checkout(AbstractProject.java:1250)
		at hudson.model.AbstractBuild$AbstractBuildExecution.defaultCheckout(AbstractBuild.java:649)
		at jenkins.scm.SCMCheckoutStrategy.checkout(SCMCheckoutStrategy.java:85)
		at hudson.model.AbstractBuild$AbstractBuildExecution.run(AbstractBuild.java:522)
		at hudson.model.Run.execute(Run.java:1833)
		at hudson.model.FreeStyleBuild.run(FreeStyleBuild.java:44)
		at hudson.model.ResourceController.execute(ResourceController.java:101)
		at hudson.model.Executor.run(Executor.java:446)
ERROR: Error fetching remote repo 'origin'
SSH: Current build result is [FAILURE], not going to run.
Email was triggered for: Failure - Any
Sending email for trigger: Failure - Any