You are viewing a plain text version of this content. The canonical link for it is here.
Posted to notifications@zookeeper.apache.org by Apache Jenkins Server <je...@builds.apache.org> on 2020/05/29 17:51:03 UTC

Build failed in Jenkins: PreCommit-ZOOKEEPER-github-pr-build-maven #2084

See <https://builds.apache.org/job/PreCommit-ZOOKEEPER-github-pr-build-maven/2084/display/redirect?page=changes>

Changes:

[jordan] ZOOKEEPER-3831 - add a compatibility test module


------------------------------------------
[...truncated 909.19 KB...]
[INFO] Downloaded from central: https://repo.maven.apache.org/maven2/org/apache/maven/scm/maven-scm-manager-plexus/1.9.2/maven-scm-manager-plexus-1.9.2.jar (11 kB at 709 kB/s)
[INFO] Downloaded from central: https://repo.maven.apache.org/maven2/org/apache/maven/scm/maven-scm-provider-gitexe/1.9.2/maven-scm-provider-gitexe-1.9.2.jar (64 kB at 3.8 MB/s)
[INFO] Downloaded from central: https://repo.maven.apache.org/maven2/com/github/stephenc/wagon/wagon-gitsite/0.5/wagon-gitsite-0.5.jar (20 kB at 1.1 MB/s)
[INFO] Downloaded from central: https://repo.maven.apache.org/maven2/org/apache/maven/scm/maven-scm-api/1.9.2/maven-scm-api-1.9.2.jar (106 kB at 5.9 MB/s)
[INFO] Downloaded from central: https://repo.maven.apache.org/maven2/org/apache/maven/scm/maven-scm-provider-git-commons/1.9.2/maven-scm-provider-git-commons-1.9.2.jar (38 kB at 1.2 MB/s)
[INFO] Downloading from central: https://repo.maven.apache.org/maven2/org/apache/felix/maven-bundle-plugin/2.3.7/maven-bundle-plugin-2.3.7.pom
[INFO] Downloaded from central: https://repo.maven.apache.org/maven2/org/apache/felix/maven-bundle-plugin/2.3.7/maven-bundle-plugin-2.3.7.pom (4.0 kB at 267 kB/s)
[INFO] Downloading from central: https://repo.maven.apache.org/maven2/org/apache/felix/maven-bundle-plugin/2.3.7/maven-bundle-plugin-2.3.7.jar
[INFO] Downloaded from central: https://repo.maven.apache.org/maven2/org/apache/felix/maven-bundle-plugin/2.3.7/maven-bundle-plugin-2.3.7.jar (124 kB at 5.0 MB/s)
[INFO] Building tar: <https://builds.apache.org/job/PreCommit-ZOOKEEPER-github-pr-build-maven/ws/zookeeper-assembly/target/apache-zookeeper-3.7.0-SNAPSHOT-bin.tar.gz>
[INFO] 
[INFO] --- maven-assembly-plugin:3.1.0:single (lib-assembly) @ zookeeper-assembly ---
[INFO] Reading assembly descriptor: <https://builds.apache.org/job/PreCommit-ZOOKEEPER-github-pr-build-maven/ws/zookeeper-assembly/src/main/assembly/lib-package.xml>
[INFO] Building tar: <https://builds.apache.org/job/PreCommit-ZOOKEEPER-github-pr-build-maven/ws/zookeeper-assembly/target/apache-zookeeper-3.7.0-SNAPSHOT-lib.tar.gz>
[INFO] 
[INFO] --- checksum-maven-plugin:1.8:artifacts (default) @ zookeeper-assembly ---
[INFO] apache-zookeeper-3.7.0-SNAPSHOT-bin.tar.gz - SHA-512 : f535644cf8fa4f21a6b169339928015ca085327015a93146a6a3428d847458ed45d4f8c22c6711217f355b01dd7bdaf0b318cceb44798f62df36234eab6c49d7
[INFO] apache-zookeeper-3.7.0-SNAPSHOT-lib.tar.gz - SHA-512 : 3a7fbc68d874492d4e35b0c69eddd831bda8d0a8dac35e36fb7d65c9cfc7fe76dca49543b9a74f05768616020aad7fbbc1467ee93d5fdec9c93244bc9c12a3a2
[INFO] 
[INFO] >>> spotbugs-maven-plugin:4.0.0:check (default-cli) > :spotbugs @ zookeeper-assembly >>>
[INFO] 
[INFO] --- spotbugs-maven-plugin:4.0.0:spotbugs (spotbugs) @ zookeeper-assembly ---
[INFO] 
[INFO] <<< spotbugs-maven-plugin:4.0.0:check (default-cli) < :spotbugs @ zookeeper-assembly <<<
[INFO] 
[INFO] 
[INFO] --- spotbugs-maven-plugin:4.0.0:check (default-cli) @ zookeeper-assembly ---
[INFO] 
[INFO] --- maven-checkstyle-plugin:3.1.0:check (default-cli) @ zookeeper-assembly ---
[INFO] Starting audit...
Audit done.
[INFO] 
[INFO] ---------< org.apache.zookeeper:zookeeper-compatibility-tests >---------
[INFO] Building Apache ZooKeeper - Compatibility Tests 3.7.0-SNAPSHOT   [14/20]
[INFO] --------------------------------[ jar ]---------------------------------
[INFO] Downloading from central: https://repo.maven.apache.org/maven2/org/apache/curator/curator-recipes/5.0.0/curator-recipes-5.0.0.pom
[INFO] Downloaded from central: https://repo.maven.apache.org/maven2/org/apache/curator/curator-recipes/5.0.0/curator-recipes-5.0.0.pom (3.6 kB at 39 kB/s)
[INFO] Downloading from central: https://repo.maven.apache.org/maven2/org/apache/curator/apache-curator/5.0.0/apache-curator-5.0.0.pom
[INFO] Downloaded from central: https://repo.maven.apache.org/maven2/org/apache/curator/apache-curator/5.0.0/apache-curator-5.0.0.pom (40 kB at 1.3 MB/s)
[INFO] Downloading from central: https://repo.maven.apache.org/maven2/org/apache/curator/curator-framework/5.0.0/curator-framework-5.0.0.pom
[INFO] Downloaded from central: https://repo.maven.apache.org/maven2/org/apache/curator/curator-framework/5.0.0/curator-framework-5.0.0.pom (3.6 kB at 115 kB/s)
[INFO] Downloading from central: https://repo.maven.apache.org/maven2/org/apache/curator/curator-client/5.0.0/curator-client-5.0.0.pom
[INFO] Downloaded from central: https://repo.maven.apache.org/maven2/org/apache/curator/curator-client/5.0.0/curator-client-5.0.0.pom (4.4 kB at 244 kB/s)
[INFO] Downloading from central: https://repo.maven.apache.org/maven2/org/apache/zookeeper/zookeeper/3.6.0/zookeeper-3.6.0.pom
[INFO] Downloaded from central: https://repo.maven.apache.org/maven2/org/apache/zookeeper/zookeeper/3.6.0/zookeeper-3.6.0.pom (11 kB at 659 kB/s)
[INFO] Downloading from central: https://repo.maven.apache.org/maven2/org/apache/zookeeper/parent/3.6.0/parent-3.6.0.pom
[INFO] Downloaded from central: https://repo.maven.apache.org/maven2/org/apache/zookeeper/parent/3.6.0/parent-3.6.0.pom (34 kB at 2.1 MB/s)
[INFO] Downloading from central: https://repo.maven.apache.org/maven2/org/apache/zookeeper/zookeeper-jute/3.6.0/zookeeper-jute-3.6.0.pom
[INFO] Downloaded from central: https://repo.maven.apache.org/maven2/org/apache/zookeeper/zookeeper-jute/3.6.0/zookeeper-jute-3.6.0.pom (5.7 kB at 377 kB/s)
[INFO] Downloading from central: https://repo.maven.apache.org/maven2/org/apache/curator/curator-test/5.0.0/curator-test-5.0.0.pom
[INFO] Downloaded from central: https://repo.maven.apache.org/maven2/org/apache/curator/curator-test/5.0.0/curator-test-5.0.0.pom (4.5 kB at 344 kB/s)
[INFO] Downloading from central: https://repo.maven.apache.org/maven2/org/apache/curator/curator-recipes/5.0.0/curator-recipes-5.0.0.jar
[INFO] Downloading from central: https://repo.maven.apache.org/maven2/org/apache/curator/curator-framework/5.0.0/curator-framework-5.0.0.jar
[INFO] Downloading from central: https://repo.maven.apache.org/maven2/org/apache/curator/curator-client/5.0.0/curator-client-5.0.0.jar
[INFO] Downloading from central: https://repo.maven.apache.org/maven2/org/apache/curator/curator-test/5.0.0/curator-test-5.0.0.jar
[INFO] Downloading from central: https://repo.maven.apache.org/maven2/org/apache/zookeeper/zookeeper/3.6.0/zookeeper-3.6.0.jar
[INFO] Downloaded from central: https://repo.maven.apache.org/maven2/org/apache/curator/curator-recipes/5.0.0/curator-recipes-5.0.0.jar (315 kB at 10 MB/s)
[INFO] Downloading from central: https://repo.maven.apache.org/maven2/org/apache/zookeeper/zookeeper-jute/3.6.0/zookeeper-jute-3.6.0.jar
[INFO] Downloaded from central: https://repo.maven.apache.org/maven2/org/apache/curator/curator-framework/5.0.0/curator-framework-5.0.0.jar (324 kB at 7.0 MB/s)
[INFO] Downloaded from central: https://repo.maven.apache.org/maven2/org/apache/zookeeper/zookeeper-jute/3.6.0/zookeeper-jute-3.6.0.jar (250 kB at 4.6 MB/s)
[INFO] Downloaded from central: https://repo.maven.apache.org/maven2/org/apache/curator/curator-test/5.0.0/curator-test-5.0.0.jar (3.0 MB at 29 MB/s)
[INFO] Downloaded from central: https://repo.maven.apache.org/maven2/org/apache/curator/curator-client/5.0.0/curator-client-5.0.0.jar (3.0 MB at 27 MB/s)
[INFO] Downloaded from central: https://repo.maven.apache.org/maven2/org/apache/zookeeper/zookeeper/3.6.0/zookeeper-3.6.0.jar (1.2 MB at 11 MB/s)
[INFO] 
[INFO] --- maven-enforcer-plugin:1.4.1:enforce (enforce-maven-version) @ zookeeper-compatibility-tests ---
[INFO] 
[INFO] --- mavanagaiata:0.9.4:commit (find-current-git-revision) @ zookeeper-compatibility-tests ---
[INFO] 
[INFO] --- maven-antrun-plugin:1.8:run (default) @ zookeeper-compatibility-tests ---
[INFO] Executing tasks

main:
[INFO] Executed tasks
[INFO] 
[INFO] --- maven-resources-plugin:3.1.0:resources (default-resources) @ zookeeper-compatibility-tests ---
[INFO] Using 'UTF-8' encoding to copy filtered resources.
[INFO] skip non existing resourceDirectory <https://builds.apache.org/job/PreCommit-ZOOKEEPER-github-pr-build-maven/ws/zookeeper-compatibility-testssrc/main/java/resources>
[INFO] 
[INFO] --- maven-compiler-plugin:3.8.1:compile (default-compile) @ zookeeper-compatibility-tests ---
[INFO] No sources to compile
[INFO] 
[INFO] --- maven-resources-plugin:3.1.0:testResources (default-testResources) @ zookeeper-compatibility-tests ---
[INFO] Using 'UTF-8' encoding to copy filtered resources.
[INFO] skip non existing resourceDirectory <https://builds.apache.org/job/PreCommit-ZOOKEEPER-github-pr-build-maven/ws/zookeeper-compatibility-tests/src/test/resources>
[INFO] 
[INFO] --- maven-compiler-plugin:3.8.1:testCompile (default-testCompile) @ zookeeper-compatibility-tests ---
[INFO] Changes detected - recompiling the module!
[INFO] Compiling 1 source file to <https://builds.apache.org/job/PreCommit-ZOOKEEPER-github-pr-build-maven/ws/zookeeper-compatibility-tests/target/test-classes>
[INFO] 
[INFO] --- maven-surefire-plugin:2.22.1:test (default-test) @ zookeeper-compatibility-tests ---
[INFO] 
[INFO] -------------------------------------------------------
[INFO]  T E S T S
[INFO] -------------------------------------------------------
[INFO] Running org.apache.zookeeper.compatibility.TestApacheCuratorCompatibility
SLF4J: Failed to load class "org.slf4j.impl.StaticLoggerBinder".
SLF4J: Defaulting to no-operation (NOP) logger implementation
SLF4J: See http://www.slf4j.org/codes.html#StaticLoggerBinder for further details.
SLF4J: Failed to load class "org.slf4j.impl.StaticMDCBinder".
SLF4J: Defaulting to no-operation MDCAdapter implementation.
SLF4J: See http://www.slf4j.org/codes.html#no_static_mdc_binder for further details.
[INFO] Tests run: 1, Failures: 0, Errors: 0, Skipped: 0, Time elapsed: 0.739 s - in org.apache.zookeeper.compatibility.TestApacheCuratorCompatibility
[INFO] 
[INFO] Results:
[INFO] 
[INFO] Tests run: 1, Failures: 0, Errors: 0, Skipped: 0
[INFO] 
[JENKINS] Recording test results
[INFO] 
[INFO] --- maven-jar-plugin:3.1.0:jar (default-jar) @ zookeeper-compatibility-tests ---
[WARNING] JAR will be empty - no content was marked for inclusion!
[INFO] Building jar: <https://builds.apache.org/job/PreCommit-ZOOKEEPER-github-pr-build-maven/ws/zookeeper-compatibility-tests/target/zookeeper-compatibility-tests-3.7.0-SNAPSHOT.jar>
[INFO] 
[INFO] --- maven-site-plugin:3.7.1:attach-descriptor (attach-descriptor) @ zookeeper-compatibility-tests ---
[INFO] Skipping because packaging 'jar' is not pom.
[INFO] 
[INFO] --- maven-jar-plugin:3.1.0:test-jar (Jar Tests Package) @ zookeeper-compatibility-tests ---
[INFO] Building jar: <https://builds.apache.org/job/PreCommit-ZOOKEEPER-github-pr-build-maven/ws/zookeeper-compatibility-tests/target/zookeeper-compatibility-tests-3.7.0-SNAPSHOT-tests.jar>
[INFO] 
[INFO] >>> maven-source-plugin:3.0.1:jar (attach-sources) > generate-sources @ zookeeper-compatibility-tests >>>
[INFO] 
[INFO] --- maven-enforcer-plugin:1.4.1:enforce (enforce-maven-version) @ zookeeper-compatibility-tests ---
[INFO] 
[INFO] --- mavanagaiata:0.9.4:commit (find-current-git-revision) @ zookeeper-compatibility-tests ---
[INFO] 
[INFO] --- maven-antrun-plugin:1.8:run (default) @ zookeeper-compatibility-tests ---
[INFO] Executing tasks

main:
[INFO] Executed tasks
[WARNING] Failed to getClass for org.apache.maven.plugins.source.SourceJarMojo
[INFO] 
[INFO] <<< maven-source-plugin:3.0.1:jar (attach-sources) < generate-sources @ zookeeper-compatibility-tests <<<
[INFO] 
[INFO] 
[INFO] --- maven-source-plugin:3.0.1:jar (attach-sources) @ zookeeper-compatibility-tests ---
[INFO] No sources in project. Archive not created.
[INFO] 
[INFO] --- maven-javadoc-plugin:3.1.1:jar (attach-javadocs) @ zookeeper-compatibility-tests ---
[INFO] 
[INFO] --- checksum-maven-plugin:1.8:artifacts (default) @ zookeeper-compatibility-tests ---
[INFO] zookeeper-compatibility-tests-3.7.0-SNAPSHOT.jar - SHA-512 : cafec4101a6d866e9959042738f8e6a81656bf706354e178a52cff4ceb90eeba58f8308eb83406e3aca8bd5d6cbeb6e589ed06510643036b02862c707c5704ea
[INFO] zookeeper-compatibility-tests-3.7.0-SNAPSHOT-tests.jar - SHA-512 : 3568ca51619a6f457010be3bce0f093cbea6bb60799b03aa4cdbf4aab514a358e22e55e47c6ffb260c5eaeebfc50e0beaf2c00003a45641b7f8880804761fe36
[INFO] 
[INFO] >>> spotbugs-maven-plugin:4.0.0:check (default-cli) > :spotbugs @ zookeeper-compatibility-tests >>>
[INFO] 
[INFO] --- spotbugs-maven-plugin:4.0.0:spotbugs (spotbugs) @ zookeeper-compatibility-tests ---
[INFO] 
[INFO] <<< spotbugs-maven-plugin:4.0.0:check (default-cli) < :spotbugs @ zookeeper-compatibility-tests <<<
[INFO] 
[INFO] 
[INFO] --- spotbugs-maven-plugin:4.0.0:check (default-cli) @ zookeeper-compatibility-tests ---
[INFO] 
[INFO] --- maven-checkstyle-plugin:3.1.0:check (default-cli) @ zookeeper-compatibility-tests ---
[INFO] Starting audit...
[ERROR] <https://builds.apache.org/job/PreCommit-ZOOKEEPER-github-pr-build-maven/ws/zookeeper-compatibility-tests/src/test/java/org/apache/zookeeper/compatibility/TestApacheCuratorCompatibility.java>:43: Line is longer than 120 characters (found 127). [LineLength]
[ERROR] <https://builds.apache.org/job/PreCommit-ZOOKEEPER-github-pr-build-maven/ws/zookeeper-compatibility-tests/src/test/java/org/apache/zookeeper/compatibility/TestApacheCuratorCompatibility.java>:44:17: 'try' is not followed by whitespace. [WhitespaceAround]
Audit done.
[INFO] There are 2 errors reported by Checkstyle 8.17 with checkstyle-strict.xml ruleset.
[ERROR] src/test/java/org/apache/zookeeper/compatibility/TestApacheCuratorCompatibility.java:[43] (sizes) LineLength: Line is longer than 120 characters (found 127).
[ERROR] src/test/java/org/apache/zookeeper/compatibility/TestApacheCuratorCompatibility.java:[44,17] (whitespace) WhitespaceAround: 'try' is not followed by whitespace.
[INFO] ------------------------------------------------------------------------
[INFO] Reactor Summary for Apache ZooKeeper 3.7.0-SNAPSHOT:
[INFO] 
[INFO] Apache ZooKeeper ................................... SUCCESS [ 24.436 s]
[INFO] Apache ZooKeeper - Documentation ................... SUCCESS [  6.247 s]
[INFO] Apache ZooKeeper - Jute ............................ SUCCESS [01:34 min]
[INFO] Apache ZooKeeper - Server .......................... SUCCESS [19:18 min]
[INFO] Apache ZooKeeper - Metrics Providers ............... SUCCESS [  4.291 s]
[INFO] Apache ZooKeeper - Prometheus.io Metrics Provider .. SUCCESS [ 14.030 s]
[INFO] Apache ZooKeeper - Client .......................... SUCCESS [  4.101 s]
[INFO] Apache ZooKeeper - Client - C ...................... SUCCESS [07:57 min]
[INFO] Apache ZooKeeper - Recipes ......................... SUCCESS [  4.082 s]
[INFO] Apache ZooKeeper - Recipes - Election .............. SUCCESS [ 43.222 s]
[INFO] Apache ZooKeeper - Recipes - Lock .................. SUCCESS [ 31.751 s]
[INFO] Apache ZooKeeper - Recipes - Queue ................. SUCCESS [ 34.855 s]
[INFO] Apache ZooKeeper - Assembly ........................ SUCCESS [ 17.837 s]
[INFO] Apache ZooKeeper - Compatibility Tests ............. FAILURE [  7.531 s]
[INFO] Apache ZooKeeper - Tests ........................... SKIPPED
[INFO] Apache ZooKeeper - Contrib ......................... SKIPPED
[INFO] Apache ZooKeeper - Contrib - Fatjar ................ SKIPPED
[INFO] Apache ZooKeeper - Contrib - Loggraph .............. SKIPPED
[INFO] Apache ZooKeeper - Contrib - Rest .................. SKIPPED
[INFO] Apache ZooKeeper - Contrib - ZooInspector .......... SKIPPED
[INFO] ------------------------------------------------------------------------
[INFO] BUILD FAILURE
[INFO] ------------------------------------------------------------------------
[INFO] Total time:  33:18 min
[INFO] Finished at: 2020-05-29T17:50:29Z
[INFO] ------------------------------------------------------------------------
Waiting for Jenkins to finish collecting data
[ERROR] Failed to execute goal org.apache.maven.plugins:maven-checkstyle-plugin:3.1.0:check (default-cli) on project zookeeper-compatibility-tests: You have 2 Checkstyle violations. -> [Help 1]
[ERROR] 
[ERROR] To see the full stack trace of the errors, re-run Maven with the -e switch.
[ERROR] Re-run Maven using the -X switch to enable full debug logging.
[ERROR] 
[ERROR] For more information about the errors and possible solutions, please read the following articles:
[ERROR] [Help 1] http://cwiki.apache.org/confluence/display/MAVEN/MojoFailureException
[ERROR] 
[ERROR] After correcting the problems, you can resume the build with the command
[ERROR]   mvn <goals> -rf :zookeeper-compatibility-tests
[JENKINS] Archiving <https://builds.apache.org/job/PreCommit-ZOOKEEPER-github-pr-build-maven/ws/zookeeper-server/pom.xml> to org.apache.zookeeper/zookeeper/3.7.0-SNAPSHOT/zookeeper-3.7.0-SNAPSHOT.pom
[JENKINS] Archiving <https://builds.apache.org/job/PreCommit-ZOOKEEPER-github-pr-build-maven/ws/zookeeper-server/target/zookeeper-3.7.0-SNAPSHOT.jar> to org.apache.zookeeper/zookeeper/3.7.0-SNAPSHOT/zookeeper-3.7.0-SNAPSHOT.jar
[JENKINS] Archiving <https://builds.apache.org/job/PreCommit-ZOOKEEPER-github-pr-build-maven/ws/zookeeper-server/target/zookeeper-3.7.0-SNAPSHOT-tests.jar> to org.apache.zookeeper/zookeeper/3.7.0-SNAPSHOT/zookeeper-3.7.0-SNAPSHOT-tests.jar
[JENKINS] Archiving <https://builds.apache.org/job/PreCommit-ZOOKEEPER-github-pr-build-maven/ws/zookeeper-server/target/zookeeper-3.7.0-SNAPSHOT-sources.jar> to org.apache.zookeeper/zookeeper/3.7.0-SNAPSHOT/zookeeper-3.7.0-SNAPSHOT-sources.jar
[JENKINS] Archiving <https://builds.apache.org/job/PreCommit-ZOOKEEPER-github-pr-build-maven/ws/zookeeper-server/target/zookeeper-3.7.0-SNAPSHOT-javadoc.jar> to org.apache.zookeeper/zookeeper/3.7.0-SNAPSHOT/zookeeper-3.7.0-SNAPSHOT-javadoc.jar
[JENKINS] Archiving <https://builds.apache.org/job/PreCommit-ZOOKEEPER-github-pr-build-maven/ws/zookeeper-contrib/zookeeper-contrib-loggraph/pom.xml> to org.apache.zookeeper/zookeeper-contrib-loggraph/3.7.0-SNAPSHOT/zookeeper-contrib-loggraph-3.7.0-SNAPSHOT.pom
[JENKINS] Archiving <https://builds.apache.org/job/PreCommit-ZOOKEEPER-github-pr-build-maven/ws/zookeeper-compatibility-tests/pom.xml> to org.apache.zookeeper/zookeeper-compatibility-tests/3.7.0-SNAPSHOT/zookeeper-compatibility-tests-3.7.0-SNAPSHOT.pom
[JENKINS] Archiving <https://builds.apache.org/job/PreCommit-ZOOKEEPER-github-pr-build-maven/ws/zookeeper-compatibility-tests/target/zookeeper-compatibility-tests-3.7.0-SNAPSHOT.jar> to org.apache.zookeeper/zookeeper-compatibility-tests/3.7.0-SNAPSHOT/zookeeper-compatibility-tests-3.7.0-SNAPSHOT.jar
[JENKINS] Archiving <https://builds.apache.org/job/PreCommit-ZOOKEEPER-github-pr-build-maven/ws/zookeeper-compatibility-tests/target/zookeeper-compatibility-tests-3.7.0-SNAPSHOT-tests.jar> to org.apache.zookeeper/zookeeper-compatibility-tests/3.7.0-SNAPSHOT/zookeeper-compatibility-tests-3.7.0-SNAPSHOT-tests.jar
[Fast Archiver] No prior successful build to compare, so performing full copy of artifacts
[JENKINS] Archiving <https://builds.apache.org/job/PreCommit-ZOOKEEPER-github-pr-build-maven/ws/zookeeper-metrics-providers/pom.xml> to org.apache.zookeeper/zookeeper-metrics-providers/3.7.0-SNAPSHOT/zookeeper-metrics-providers-3.7.0-SNAPSHOT.pom
[JENKINS] Archiving <https://builds.apache.org/job/PreCommit-ZOOKEEPER-github-pr-build-maven/ws/zookeeper-metrics-providers/zookeeper-prometheus-metrics/pom.xml> to org.apache.zookeeper/zookeeper-prometheus-metrics/3.7.0-SNAPSHOT/zookeeper-prometheus-metrics-3.7.0-SNAPSHOT.pom
[JENKINS] Archiving <https://builds.apache.org/job/PreCommit-ZOOKEEPER-github-pr-build-maven/ws/zookeeper-metrics-providers/zookeeper-prometheus-metrics/target/zookeeper-prometheus-metrics-3.7.0-SNAPSHOT.jar> to org.apache.zookeeper/zookeeper-prometheus-metrics/3.7.0-SNAPSHOT/zookeeper-prometheus-metrics-3.7.0-SNAPSHOT.jar
[JENKINS] Archiving <https://builds.apache.org/job/PreCommit-ZOOKEEPER-github-pr-build-maven/ws/zookeeper-metrics-providers/zookeeper-prometheus-metrics/target/zookeeper-prometheus-metrics-3.7.0-SNAPSHOT-tests.jar> to org.apache.zookeeper/zookeeper-prometheus-metrics/3.7.0-SNAPSHOT/zookeeper-prometheus-metrics-3.7.0-SNAPSHOT-tests.jar
[JENKINS] Archiving <https://builds.apache.org/job/PreCommit-ZOOKEEPER-github-pr-build-maven/ws/zookeeper-metrics-providers/zookeeper-prometheus-metrics/target/zookeeper-prometheus-metrics-3.7.0-SNAPSHOT-sources.jar> to org.apache.zookeeper/zookeeper-prometheus-metrics/3.7.0-SNAPSHOT/zookeeper-prometheus-metrics-3.7.0-SNAPSHOT-sources.jar
[JENKINS] Archiving <https://builds.apache.org/job/PreCommit-ZOOKEEPER-github-pr-build-maven/ws/zookeeper-metrics-providers/zookeeper-prometheus-metrics/target/zookeeper-prometheus-metrics-3.7.0-SNAPSHOT-javadoc.jar> to org.apache.zookeeper/zookeeper-prometheus-metrics/3.7.0-SNAPSHOT/zookeeper-prometheus-metrics-3.7.0-SNAPSHOT-javadoc.jar
[JENKINS] Archiving <https://builds.apache.org/job/PreCommit-ZOOKEEPER-github-pr-build-maven/ws/zookeeper-recipes/zookeeper-recipes-election/pom.xml> to org.apache.zookeeper/zookeeper-recipes-election/3.7.0-SNAPSHOT/zookeeper-recipes-election-3.7.0-SNAPSHOT.pom
[JENKINS] Archiving <https://builds.apache.org/job/PreCommit-ZOOKEEPER-github-pr-build-maven/ws/zookeeper-recipes/zookeeper-recipes-election/target/zookeeper-recipes-election-3.7.0-SNAPSHOT.jar> to org.apache.zookeeper/zookeeper-recipes-election/3.7.0-SNAPSHOT/zookeeper-recipes-election-3.7.0-SNAPSHOT.jar
[JENKINS] Archiving <https://builds.apache.org/job/PreCommit-ZOOKEEPER-github-pr-build-maven/ws/zookeeper-recipes/zookeeper-recipes-election/target/zookeeper-recipes-election-3.7.0-SNAPSHOT-tests.jar> to org.apache.zookeeper/zookeeper-recipes-election/3.7.0-SNAPSHOT/zookeeper-recipes-election-3.7.0-SNAPSHOT-tests.jar
[JENKINS] Archiving <https://builds.apache.org/job/PreCommit-ZOOKEEPER-github-pr-build-maven/ws/zookeeper-recipes/zookeeper-recipes-election/target/zookeeper-recipes-election-3.7.0-SNAPSHOT-sources.jar> to org.apache.zookeeper/zookeeper-recipes-election/3.7.0-SNAPSHOT/zookeeper-recipes-election-3.7.0-SNAPSHOT-sources.jar
[JENKINS] Archiving <https://builds.apache.org/job/PreCommit-ZOOKEEPER-github-pr-build-maven/ws/pom.xml> to org.apache.zookeeper/parent/3.7.0-SNAPSHOT/parent-3.7.0-SNAPSHOT.pom
[JENKINS] Archiving <https://builds.apache.org/job/PreCommit-ZOOKEEPER-github-pr-build-maven/ws/zookeeper-recipes/zookeeper-recipes-lock/pom.xml> to org.apache.zookeeper/zookeeper-recipes-lock/3.7.0-SNAPSHOT/zookeeper-recipes-lock-3.7.0-SNAPSHOT.pom
[JENKINS] Archiving <https://builds.apache.org/job/PreCommit-ZOOKEEPER-github-pr-build-maven/ws/zookeeper-recipes/zookeeper-recipes-lock/target/zookeeper-recipes-lock-3.7.0-SNAPSHOT.jar> to org.apache.zookeeper/zookeeper-recipes-lock/3.7.0-SNAPSHOT/zookeeper-recipes-lock-3.7.0-SNAPSHOT.jar
[JENKINS] Archiving <https://builds.apache.org/job/PreCommit-ZOOKEEPER-github-pr-build-maven/ws/zookeeper-recipes/zookeeper-recipes-lock/target/zookeeper-recipes-lock-3.7.0-SNAPSHOT-tests.jar> to org.apache.zookeeper/zookeeper-recipes-lock/3.7.0-SNAPSHOT/zookeeper-recipes-lock-3.7.0-SNAPSHOT-tests.jar
[JENKINS] Archiving <https://builds.apache.org/job/PreCommit-ZOOKEEPER-github-pr-build-maven/ws/zookeeper-recipes/zookeeper-recipes-lock/target/zookeeper-recipes-lock-3.7.0-SNAPSHOT-sources.jar> to org.apache.zookeeper/zookeeper-recipes-lock/3.7.0-SNAPSHOT/zookeeper-recipes-lock-3.7.0-SNAPSHOT-sources.jar
[JENKINS] Archiving <https://builds.apache.org/job/PreCommit-ZOOKEEPER-github-pr-build-maven/ws/zookeeper-contrib/pom.xml> to org.apache.zookeeper/zookeeper-contrib/3.7.0-SNAPSHOT/zookeeper-contrib-3.7.0-SNAPSHOT.pom
[JENKINS] Archiving <https://builds.apache.org/job/PreCommit-ZOOKEEPER-github-pr-build-maven/ws/zookeeper-client/pom.xml> to org.apache.zookeeper/zookeeper-client/3.7.0-SNAPSHOT/zookeeper-client-3.7.0-SNAPSHOT.pom
[JENKINS] Archiving <https://builds.apache.org/job/PreCommit-ZOOKEEPER-github-pr-build-maven/ws/zookeeper-jute/pom.xml> to org.apache.zookeeper/zookeeper-jute/3.7.0-SNAPSHOT/zookeeper-jute-3.7.0-SNAPSHOT.pom
[JENKINS] Archiving <https://builds.apache.org/job/PreCommit-ZOOKEEPER-github-pr-build-maven/ws/zookeeper-jute/target/zookeeper-jute-3.7.0-SNAPSHOT.jar> to org.apache.zookeeper/zookeeper-jute/3.7.0-SNAPSHOT/zookeeper-jute-3.7.0-SNAPSHOT.jar
[JENKINS] Archiving <https://builds.apache.org/job/PreCommit-ZOOKEEPER-github-pr-build-maven/ws/zookeeper-jute/target/zookeeper-jute-3.7.0-SNAPSHOT-tests.jar> to org.apache.zookeeper/zookeeper-jute/3.7.0-SNAPSHOT/zookeeper-jute-3.7.0-SNAPSHOT-tests.jar
[JENKINS] Archiving <https://builds.apache.org/job/PreCommit-ZOOKEEPER-github-pr-build-maven/ws/zookeeper-jute/target/zookeeper-jute-3.7.0-SNAPSHOT-sources.jar> to org.apache.zookeeper/zookeeper-jute/3.7.0-SNAPSHOT/zookeeper-jute-3.7.0-SNAPSHOT-sources.jar
[JENKINS] Archiving <https://builds.apache.org/job/PreCommit-ZOOKEEPER-github-pr-build-maven/ws/zookeeper-jute/target/zookeeper-jute-3.7.0-SNAPSHOT-javadoc.jar> to org.apache.zookeeper/zookeeper-jute/3.7.0-SNAPSHOT/zookeeper-jute-3.7.0-SNAPSHOT-javadoc.jar
[JENKINS] Archiving <https://builds.apache.org/job/PreCommit-ZOOKEEPER-github-pr-build-maven/ws/zookeeper-recipes/zookeeper-recipes-queue/pom.xml> to org.apache.zookeeper/zookeeper-recipes-queue/3.7.0-SNAPSHOT/zookeeper-recipes-queue-3.7.0-SNAPSHOT.pom
[JENKINS] Archiving <https://builds.apache.org/job/PreCommit-ZOOKEEPER-github-pr-build-maven/ws/zookeeper-recipes/zookeeper-recipes-queue/target/zookeeper-recipes-queue-3.7.0-SNAPSHOT.jar> to org.apache.zookeeper/zookeeper-recipes-queue/3.7.0-SNAPSHOT/zookeeper-recipes-queue-3.7.0-SNAPSHOT.jar
[JENKINS] Archiving <https://builds.apache.org/job/PreCommit-ZOOKEEPER-github-pr-build-maven/ws/zookeeper-recipes/zookeeper-recipes-queue/target/zookeeper-recipes-queue-3.7.0-SNAPSHOT-tests.jar> to org.apache.zookeeper/zookeeper-recipes-queue/3.7.0-SNAPSHOT/zookeeper-recipes-queue-3.7.0-SNAPSHOT-tests.jar
[JENKINS] Archiving <https://builds.apache.org/job/PreCommit-ZOOKEEPER-github-pr-build-maven/ws/zookeeper-recipes/zookeeper-recipes-queue/target/zookeeper-recipes-queue-3.7.0-SNAPSHOT-sources.jar> to org.apache.zookeeper/zookeeper-recipes-queue/3.7.0-SNAPSHOT/zookeeper-recipes-queue-3.7.0-SNAPSHOT-sources.jar
[JENKINS] Archiving <https://builds.apache.org/job/PreCommit-ZOOKEEPER-github-pr-build-maven/ws/zookeeper-docs/pom.xml> to org.apache.zookeeper/zookeeper-docs/3.7.0-SNAPSHOT/zookeeper-docs-3.7.0-SNAPSHOT.pom
[JENKINS] Archiving <https://builds.apache.org/job/PreCommit-ZOOKEEPER-github-pr-build-maven/ws/zookeeper-recipes/pom.xml> to org.apache.zookeeper/zookeeper-recipes/3.7.0-SNAPSHOT/zookeeper-recipes-3.7.0-SNAPSHOT.pom
[JENKINS] Archiving <https://builds.apache.org/job/PreCommit-ZOOKEEPER-github-pr-build-maven/ws/zookeeper-it/pom.xml> to org.apache.zookeeper/zookeeper-it/3.7.0-SNAPSHOT/zookeeper-it-3.7.0-SNAPSHOT.pom
[JENKINS] Archiving <https://builds.apache.org/job/PreCommit-ZOOKEEPER-github-pr-build-maven/ws/zookeeper-client/zookeeper-client-c/pom.xml> to org.apache.zookeeper/zookeeper-client-c/3.7.0-SNAPSHOT/zookeeper-client-c-3.7.0-SNAPSHOT.pom
[JENKINS] Archiving <https://builds.apache.org/job/PreCommit-ZOOKEEPER-github-pr-build-maven/ws/zookeeper-contrib/zookeeper-contrib-rest/pom.xml> to org.apache.zookeeper/zookeeper-contrib-rest/3.7.0-SNAPSHOT/zookeeper-contrib-rest-3.7.0-SNAPSHOT.pom
[JENKINS] Archiving <https://builds.apache.org/job/PreCommit-ZOOKEEPER-github-pr-build-maven/ws/zookeeper-contrib/zookeeper-contrib-fatjar/pom.xml> to org.apache.zookeeper/zookeeper-contrib-fatjar/3.7.0-SNAPSHOT/zookeeper-contrib-fatjar-3.7.0-SNAPSHOT.pom
[JENKINS] Archiving <https://builds.apache.org/job/PreCommit-ZOOKEEPER-github-pr-build-maven/ws/zookeeper-assembly/pom.xml> to org.apache.zookeeper/zookeeper-assembly/3.7.0-SNAPSHOT/zookeeper-assembly-3.7.0-SNAPSHOT.pom
[JENKINS] Archiving <https://builds.apache.org/job/PreCommit-ZOOKEEPER-github-pr-build-maven/ws/zookeeper-assembly/target/apache-zookeeper-3.7.0-SNAPSHOT-lib.tar.gz> to org.apache.zookeeper/zookeeper-assembly/3.7.0-SNAPSHOT/zookeeper-assembly-3.7.0-SNAPSHOT.tar.gz
[JENKINS] Archiving <https://builds.apache.org/job/PreCommit-ZOOKEEPER-github-pr-build-maven/ws/zookeeper-contrib/zookeeper-contrib-zooinspector/pom.xml> to org.apache.zookeeper/zookeeper-contrib-zooinspector/3.7.0-SNAPSHOT/zookeeper-contrib-zooinspector-3.7.0-SNAPSHOT.pom
channel stopped
[SpotBugs] Skipping execution of recorder since overall result is 'FAILURE'
Putting comment on the pull request

Jenkins build is back to normal : PreCommit-ZOOKEEPER-github-pr-build-maven #2085

Posted by Apache Jenkins Server <je...@builds.apache.org>.
See <https://builds.apache.org/job/PreCommit-ZOOKEEPER-github-pr-build-maven/2085/display/redirect>