You are viewing a plain text version of this content. The canonical link for it is here.
Posted to dev@brooklyn.apache.org by Apache Jenkins Server <je...@builds.apache.org> on 2017/10/07 03:53:12 UTC
Build failed in Jenkins: brooklyn-library-master #450
See <https://builds.apache.org/job/brooklyn-library-master/450/display/redirect>
------------------------------------------
Started by timer
[EnvInject] - Loading node environment variables.
Building remotely on qnode1 (ubuntu xenial) in workspace <https://builds.apache.org/job/brooklyn-library-master/ws/>
> git rev-parse --is-inside-work-tree # timeout=10
Fetching changes from the remote Git repository
> git config remote.origin.url https://git-wip-us.apache.org/repos/asf/brooklyn-library.git # timeout=10
Fetching upstream changes from https://git-wip-us.apache.org/repos/asf/brooklyn-library.git
> git --version # timeout=10
> git fetch --tags --progress https://git-wip-us.apache.org/repos/asf/brooklyn-library.git +refs/heads/*:refs/remotes/origin/*
> git rev-parse origin/master^{commit} # timeout=10
Checking out Revision bd17aea7fc12395145cea0a393a989b63c2ea599 (origin/master)
Commit message: "Change version to 1.0.0-SNAPSHOT"
> git config core.sparsecheckout # timeout=10
> git checkout -f bd17aea7fc12395145cea0a393a989b63c2ea599
> git rev-list bd17aea7fc12395145cea0a393a989b63c2ea599 # timeout=10
Parsing POMs
Failed to transfer Could not find metadata org.apache.brooklyn:brooklyn-parent:1.0.0-SNAPSHOT/maven-metadata.xml in Nexus (http://repository.apache.org/snapshots)
Failed to transfer Could not find artifact org.apache.brooklyn:brooklyn-parent:pom:1.0.0-SNAPSHOT in Nexus (http://repository.apache.org/snapshots)
ERROR: Failed to parse POMs
java.io.IOException: remote file operation failed: <https://builds.apache.org/job/brooklyn-library-master/ws/> at hudson.remoting.Channel@4085889d:qnode1: hudson.remoting.ProxyException: hudson.maven.MavenModuleSetBuild$MavenExecutionException: org.apache.maven.project.ProjectBuildingException: Some problems were encountered while processing the POMs:
[FATAL] Non-resolvable parent POM: Could not find artifact org.apache.brooklyn:brooklyn-parent:pom:1.0.0-SNAPSHOT in Nexus (http://repository.apache.org/snapshots) and 'parent.relativePath' points at wrong local POM @ line 24, column 13
at hudson.FilePath.act(FilePath.java:994)
at hudson.FilePath.act(FilePath.java:976)
at hudson.maven.MavenModuleSetBuild$MavenModuleSetBuildExecution.parsePoms(MavenModuleSetBuild.java:986)
at hudson.maven.MavenModuleSetBuild$MavenModuleSetBuildExecution.doRun(MavenModuleSetBuild.java:691)
at hudson.model.AbstractBuild$AbstractBuildExecution.run(AbstractBuild.java:496)
at hudson.model.Run.execute(Run.java:1737)
at hudson.maven.MavenModuleSetBuild.run(MavenModuleSetBuild.java:543)
at hudson.model.ResourceController.execute(ResourceController.java:97)
at hudson.model.Executor.run(Executor.java:419)
Caused by: hudson.remoting.ProxyException: hudson.maven.MavenModuleSetBuild$MavenExecutionException: org.apache.maven.project.ProjectBuildingException: Some problems were encountered while processing the POMs:
[FATAL] Non-resolvable parent POM: Could not find artifact org.apache.brooklyn:brooklyn-parent:pom:1.0.0-SNAPSHOT in Nexus (http://repository.apache.org/snapshots) and 'parent.relativePath' points at wrong local POM @ line 24, column 13
at hudson.maven.MavenModuleSetBuild$PomParser.invoke(MavenModuleSetBuild.java:1391)
at hudson.maven.MavenModuleSetBuild$PomParser.invoke(MavenModuleSetBuild.java:1125)
at hudson.FilePath$FileCallableWrapper.call(FilePath.java:2750)
at hudson.remoting.UserRequest.perform(UserRequest.java:181)
at hudson.remoting.UserRequest.perform(UserRequest.java:52)
at hudson.remoting.Request$2.run(Request.java:336)
at hudson.remoting.InterceptingExecutorService$1.call(InterceptingExecutorService.java:68)
at java.util.concurrent.FutureTask.run(FutureTask.java:266)
at java.util.concurrent.ThreadPoolExecutor.runWorker(ThreadPoolExecutor.java:1142)
at java.util.concurrent.ThreadPoolExecutor$Worker.run(ThreadPoolExecutor.java:617)
at java.lang.Thread.run(Thread.java:748)
at ......remote call to qnode1(Native Method)
at hudson.remoting.Channel.attachCallSiteStackTrace(Channel.java:1554)
at hudson.remoting.UserResponse.retrieve(UserRequest.java:281)
at hudson.remoting.Channel.call(Channel.java:839)
at hudson.FilePath.act(FilePath.java:987)
... 8 more
Caused by: hudson.remoting.ProxyException: org.apache.maven.project.ProjectBuildingException: Some problems were encountered while processing the POMs:
[FATAL] Non-resolvable parent POM: Could not find artifact org.apache.brooklyn:brooklyn-parent:pom:1.0.0-SNAPSHOT in Nexus (http://repository.apache.org/snapshots) and 'parent.relativePath' points at wrong local POM @ line 24, column 13
at org.apache.maven.project.DefaultProjectBuilder.build(DefaultProjectBuilder.java:364)
at hudson.maven.MavenEmbedder.buildProjects(MavenEmbedder.java:361)
at hudson.maven.MavenEmbedder.readProjects(MavenEmbedder.java:331)
at hudson.maven.MavenModuleSetBuild$PomParser.invoke(MavenModuleSetBuild.java:1328)
at hudson.maven.MavenModuleSetBuild$PomParser.invoke(MavenModuleSetBuild.java:1125)
at hudson.FilePath$FileCallableWrapper.call(FilePath.java:2750)
at hudson.remoting.UserRequest.perform(UserRequest.java:181)
at hudson.remoting.UserRequest.perform(UserRequest.java:52)
at hudson.remoting.Request$2.run(Request.java:336)
at hudson.remoting.InterceptingExecutorService$1.call(InterceptingExecutorService.java:68)
at java.util.concurrent.FutureTask.run(FutureTask.java:266)
at java.util.concurrent.ThreadPoolExecutor.runWorker(ThreadPoolExecutor.java:1142)
at java.util.concurrent.ThreadPoolExecutor$Worker.run(ThreadPoolExecutor.java:617)
at java.lang.Thread.run(Thread.java:748)
Jenkins build is back to normal : brooklyn-library-master #453
Posted by Apache Jenkins Server <je...@builds.apache.org>.
See <https://builds.apache.org/job/brooklyn-library-master/453/display/redirect>
Build failed in Jenkins: brooklyn-library-master #452
Posted by Apache Jenkins Server <je...@builds.apache.org>.
See <https://builds.apache.org/job/brooklyn-library-master/452/display/redirect>
------------------------------------------
Started by timer
[EnvInject] - Loading node environment variables.
Building remotely on H22 (couchdbtest ubuntu xenial) in workspace <https://builds.apache.org/job/brooklyn-library-master/ws/>
> git rev-parse --is-inside-work-tree # timeout=10
Fetching changes from the remote Git repository
> git config remote.origin.url https://git-wip-us.apache.org/repos/asf/brooklyn-library.git # timeout=10
Fetching upstream changes from https://git-wip-us.apache.org/repos/asf/brooklyn-library.git
> git --version # timeout=10
> git fetch --tags --progress https://git-wip-us.apache.org/repos/asf/brooklyn-library.git +refs/heads/*:refs/remotes/origin/*
> git rev-parse origin/master^{commit} # timeout=10
Checking out Revision bd17aea7fc12395145cea0a393a989b63c2ea599 (origin/master)
Commit message: "Change version to 1.0.0-SNAPSHOT"
> git config core.sparsecheckout # timeout=10
> git checkout -f bd17aea7fc12395145cea0a393a989b63c2ea599
> git rev-list bd17aea7fc12395145cea0a393a989b63c2ea599 # timeout=10
Parsing POMs
Failed to transfer Could not find metadata org.apache.brooklyn:brooklyn-parent:1.0.0-SNAPSHOT/maven-metadata.xml in Nexus (http://repository.apache.org/snapshots)
Failed to transfer Could not find metadata org.apache.brooklyn:brooklyn-server:1.0.0-SNAPSHOT/maven-metadata.xml in Nexus (http://repository.apache.org/snapshots)
Failed to transfer Could not find metadata org.apache.brooklyn:brooklyn-parent:1.0.0-SNAPSHOT/maven-metadata.xml in clojars.org (http://clojars.org/repo)
Failed to transfer Could not find metadata org.apache.brooklyn:brooklyn-server:1.0.0-SNAPSHOT/maven-metadata.xml in clojars.org (http://clojars.org/repo)
Failed to transfer Could not find metadata org.apache.brooklyn:brooklyn-parent:1.0.0-SNAPSHOT/maven-metadata.xml in jclouds-snapshots (https://repository.apache.org/content/repositories/snapshots)
Failed to transfer Could not find metadata org.apache.brooklyn:brooklyn-server:1.0.0-SNAPSHOT/maven-metadata.xml in jclouds-snapshots (https://repository.apache.org/content/repositories/snapshots)
Modules changed, recalculating dependency graph
Established TCP socket on 46014
maven33-agent.jar already up to date
maven33-interceptor.jar already up to date
maven3-interceptor-commons.jar already up to date
[brooklyn-library-master] $ /home/jenkins/tools/java/latest1.8/bin/java -Xmx1024m -Xms512m -XX:MaxPermSize=512m -cp /home/jenkins/jenkins-slave/maven33-agent.jar:/home/jenkins/tools/maven/apache-maven-3.3.3/boot/plexus-classworlds-2.5.2.jar:/home/jenkins/tools/maven/apache-maven-3.3.3/conf/logging jenkins.maven3.agent.Maven33Main /home/jenkins/tools/maven/apache-maven-3.3.3 /home/jenkins/jenkins-slave/slave.jar /home/jenkins/jenkins-slave/maven33-interceptor.jar /home/jenkins/jenkins-slave/maven3-interceptor-commons.jar 46014
Java HotSpot(TM) 64-Bit Server VM warning: ignoring option MaxPermSize=512m; support was removed in 8.0
<===[JENKINS REMOTING CAPACITY]===> channel started
Executing Maven: -B -f <https://builds.apache.org/job/brooklyn-library-master/ws/pom.xml> -Dmaven.repo.local=/home/jenkins/jenkins-slave/maven-repositories/1 clean install
[INFO] Scanning for projects...
[INFO] ------------------------------------------------------------------------
[INFO] Reactor Build Order:
[INFO]
[INFO] Brooklyn Library Root
[INFO] Brooklyn CM Chef
[INFO] Brooklyn CM SaltStack
[INFO] Brooklyn CM Ansible
[INFO] Brooklyn CM Integration Root
[INFO] Brooklyn Network Software Entities
[INFO] Brooklyn OSGi Software Entities
[INFO] Brooklyn Database Software Entities
[INFO] Brooklyn Web App Software Entities
[INFO] Brooklyn Messaging Software Entities
[INFO] Brooklyn NoSQL Data Store Software Entities
[INFO] Brooklyn Monitoring Software Entities
[INFO] Brooklyn QA
[INFO] Brooklyn Examples Aggregator Project
[INFO] Brooklyn Examples Aggregator Project - Webapps
[INFO] hello-world-webapp Maven Webapp
[INFO] hello-world-sql-webapp Maven Webapp
[INFO] Brooklyn Simple Web Cluster Example
[INFO] Brooklyn Library Karaf integration
[INFO] Brooklyn Library Catalog
[INFO] Brooklyn Library Karaf Features
[INFO]
[INFO] ------------------------------------------------------------------------
[INFO] Building Brooklyn Library Root 1.0.0-SNAPSHOT
[INFO] ------------------------------------------------------------------------
[INFO]
[INFO] --- maven-clean-plugin:2.6.1:clean (default-clean) @ brooklyn-library ---
[INFO] Deleting <https://builds.apache.org/job/brooklyn-library-master/ws/target>
[INFO] Deleting <https://builds.apache.org/job/brooklyn-library-master/ws/> (includes = [brooklyn*.log, brooklyn*.log.*, stacktrace.log, test-output, prodDb.*], excludes = [])
[INFO]
[INFO] --- maven-replacer-plugin:1.4.1:replace (fix-eclipse-dot-classpath-mangling) @ brooklyn-library ---
[INFO] Ignoring missing file
[INFO] Replacement run on 0 file.
[INFO]
[INFO] --- buildnumber-maven-plugin:1.3:create (default) @ brooklyn-library ---
[INFO] Executing: /bin/sh -c cd <https://builds.apache.org/job/brooklyn-library-master/ws/> && git rev-parse --verify HEAD
[INFO] Working directory: <https://builds.apache.org/job/brooklyn-library-master/ws/>
[INFO] Storing buildNumber: bd17aea7fc12395145cea0a393a989b63c2ea599 at timestamp: 1507521245431
[WARNING] Cannot get the branch information from the git repository:
Detecting the current branch failed: fatal: ref HEAD is not a symbolic ref
[INFO] Executing: /bin/sh -c cd <https://builds.apache.org/job/brooklyn-library-master/ws/> && git rev-parse --verify HEAD
[INFO] Working directory: <https://builds.apache.org/job/brooklyn-library-master/ws/>
[INFO] Storing buildScmBranch: UNKNOWN
[INFO]
[INFO] --- maven-enforcer-plugin:1.4.1:enforce (brooklyn-build-req) @ brooklyn-library ---
[INFO]
[INFO] --- maven-remote-resources-plugin:1.5:process (default) @ brooklyn-library ---
[INFO]
[INFO] --- maven-checkstyle-plugin:2.17:check (verify-style) @ brooklyn-library ---
[INFO]
[INFO] --- maven-site-plugin:3.4:attach-descriptor (attach-descriptor) @ brooklyn-library ---
[INFO]
[INFO] --- apache-rat-plugin:0.12:check (default) @ brooklyn-library ---
[INFO] Enabled default license matchers.
[INFO] Will parse SCM ignores for exclusions...
[INFO] Parsing exclusions from <https://builds.apache.org/job/brooklyn-library-master/ws/.gitignore>
[INFO] Finished adding exclusions from SCM ignore files.
[INFO] 93 implicit excludes (use -debug for more details).
[INFO] Exclude: sandbox/**
[INFO] Exclude: release/**
[INFO] Exclude: README.md
[INFO] Exclude: **/.git/**
[INFO] Exclude: **/.gitignore
[INFO] Exclude: **/.repository/**
[INFO] Exclude: **/.idea/**
[INFO] Exclude: **/*.iml
[INFO] Exclude: **/.classpath/**
[INFO] Exclude: **/.project
[INFO] Exclude: **/.settings/**
[INFO] Exclude: **/*.log
[INFO] Exclude: **/brooklyn*.log.*
[INFO] Exclude: **/target/**
[INFO] Exclude: **/nbactions.xml
[INFO] Exclude: **/nb-configuration.xml
[INFO] Exclude: ignored/**
[INFO] Exclude: LICENSE.md
[INFO] Exclude: .mvn/jvm.config
[INFO] Exclude: **/src/main/license/**
[INFO] Exclude: **/src/test/license/**
[INFO] Exclude: **/MANIFEST.MF
[INFO] Exclude: **/test-output/**
[INFO] Exclude: **/*.pem.pub
[INFO] Exclude: **/*.pem
[INFO] Exclude: **/*_rsa.pub
[INFO] Exclude: **/*_rsa
[INFO] Exclude: **/*.svg
[INFO] Exclude: **/*.crt
[INFO] Exclude: **/*.csr
[INFO] Exclude: **/*.key
[INFO] Exclude: **/*.key.org
[INFO] Exclude: **/*.psd
[INFO] Exclude: **/*.json
[INFO] Exclude: **/*.plxarc
[INFO] Exclude: **/src/test/resources/org/apache/brooklyn/entity/software/base/template_with_extra_substitutions.txt
[INFO] Exclude: **/src/main/resources/banner.txt
[INFO] Exclude: **/src/test/resources/ssl/certs/localhost/info.txt
[INFO] Exclude: **/src/main/history/dependencies.xml
[INFO] Exclude: **/sandbox/examples/src/main/scripts/amis.txt
[INFO] Exclude: docs/**
[INFO] 3 resources included (use -debug for more details)
[INFO] Rat check: Summary over all files. Unapproved: 0, unknown: 0, generated: 0, approved: 1 licenses.
[INFO]
[INFO] --- maven-source-plugin:2.4:jar-no-fork (attach-sources) @ brooklyn-library ---
[INFO]
[INFO] --- maven-source-plugin:2.4:test-jar-no-fork (attach-sources) @ brooklyn-library ---
[INFO]
[INFO] --- maven-install-plugin:2.5.2:install (default-install) @ brooklyn-library ---
[INFO] Installing <https://builds.apache.org/job/brooklyn-library-master/ws/pom.xml> to /home/jenkins/jenkins-slave/maven-repositories/1/org/apache/brooklyn/brooklyn-library/1.0.0-SNAPSHOT/brooklyn-library-1.0.0-SNAPSHOT.pom
[INFO]
[INFO] ------------------------------------------------------------------------
[INFO] Building Brooklyn CM Chef 1.0.0-SNAPSHOT
[INFO] ------------------------------------------------------------------------
[INFO] Downloading: http://repository.apache.org/snapshots/org/apache/brooklyn/brooklyn-api/1.0.0-SNAPSHOT/maven-metadata.xml
[INFO] Downloading: https://repository.apache.org/content/repositories/snapshots/org/apache/brooklyn/brooklyn-api/1.0.0-SNAPSHOT/maven-metadata.xml
[INFO] Downloading: http://repository.apache.org/snapshots/org/apache/brooklyn/brooklyn-utils-common/1.0.0-SNAPSHOT/maven-metadata.xml
[INFO] Downloading: https://repository.apache.org/content/repositories/snapshots/org/apache/brooklyn/brooklyn-utils-common/1.0.0-SNAPSHOT/maven-metadata.xml
[INFO] Downloading: http://repository.apache.org/snapshots/org/apache/brooklyn/brooklyn-logback-includes/1.0.0-SNAPSHOT/maven-metadata.xml
[INFO] Downloading: https://repository.apache.org/content/repositories/snapshots/org/apache/brooklyn/brooklyn-logback-includes/1.0.0-SNAPSHOT/maven-metadata.xml
[INFO] Downloading: http://repository.apache.org/snapshots/org/apache/brooklyn/brooklyn-software-base/1.0.0-SNAPSHOT/maven-metadata.xml
[INFO] Downloading: https://repository.apache.org/content/repositories/snapshots/org/apache/brooklyn/brooklyn-software-base/1.0.0-SNAPSHOT/maven-metadata.xml
[INFO] Downloading: http://repository.apache.org/snapshots/org/apache/brooklyn/brooklyn-software-base/1.0.0-SNAPSHOT/brooklyn-software-base-1.0.0-SNAPSHOT.pom
[INFO] Downloading: https://repository.apache.org/content/repositories/snapshots/org/apache/brooklyn/brooklyn-software-base/1.0.0-SNAPSHOT/brooklyn-software-base-1.0.0-SNAPSHOT.pom
[WARNING] The POM for org.apache.brooklyn:brooklyn-software-base:jar:1.0.0-SNAPSHOT is missing, no dependency information available
[INFO] Downloading: http://repository.apache.org/snapshots/org/apache/brooklyn/brooklyn-camp/1.0.0-SNAPSHOT/maven-metadata.xml
[INFO] Downloading: https://repository.apache.org/content/repositories/snapshots/org/apache/brooklyn/brooklyn-camp/1.0.0-SNAPSHOT/maven-metadata.xml
[INFO] Downloading: http://repository.apache.org/snapshots/org/apache/brooklyn/brooklyn-camp/1.0.0-SNAPSHOT/brooklyn-camp-1.0.0-SNAPSHOT.pom
[INFO] Downloading: https://repository.apache.org/content/repositories/snapshots/org/apache/brooklyn/brooklyn-camp/1.0.0-SNAPSHOT/brooklyn-camp-1.0.0-SNAPSHOT.pom
[WARNING] The POM for org.apache.brooklyn:brooklyn-camp:jar:1.0.0-SNAPSHOT is missing, no dependency information available
[INFO] Downloading: http://repository.apache.org/snapshots/org/apache/brooklyn/brooklyn-test-support/1.0.0-SNAPSHOT/maven-metadata.xml
[INFO] Downloading: https://repository.apache.org/content/repositories/snapshots/org/apache/brooklyn/brooklyn-test-support/1.0.0-SNAPSHOT/maven-metadata.xml
[INFO] Downloading: http://repository.apache.org/snapshots/org/apache/brooklyn/brooklyn-utils-test-support/1.0.0-SNAPSHOT/maven-metadata.xml
[INFO] Downloading: https://repository.apache.org/content/repositories/snapshots/org/apache/brooklyn/brooklyn-utils-test-support/1.0.0-SNAPSHOT/maven-metadata.xml
[INFO] Downloading: http://repository.apache.org/snapshots/org/apache/brooklyn/brooklyn-core/1.0.0-SNAPSHOT/maven-metadata.xml
[INFO] Downloading: https://repository.apache.org/content/repositories/snapshots/org/apache/brooklyn/brooklyn-core/1.0.0-SNAPSHOT/maven-metadata.xml
[INFO] Downloading: http://repository.apache.org/snapshots/org/apache/brooklyn/brooklyn-core/1.0.0-SNAPSHOT/brooklyn-core-1.0.0-SNAPSHOT.pom
[INFO] Downloading: https://repository.apache.org/content/repositories/snapshots/org/apache/brooklyn/brooklyn-core/1.0.0-SNAPSHOT/brooklyn-core-1.0.0-SNAPSHOT.pom
[WARNING] The POM for org.apache.brooklyn:brooklyn-core:jar:tests:1.0.0-SNAPSHOT is missing, no dependency information available
[WARNING] The POM for org.apache.brooklyn:brooklyn-software-base:jar:tests:1.0.0-SNAPSHOT is missing, no dependency information available
[INFO] Downloading: http://repository.apache.org/snapshots/org/apache/brooklyn/brooklyn-software-base/1.0.0-SNAPSHOT/brooklyn-software-base-1.0.0-SNAPSHOT.jar
[INFO] Downloading: http://repository.apache.org/snapshots/org/apache/brooklyn/brooklyn-camp/1.0.0-SNAPSHOT/brooklyn-camp-1.0.0-SNAPSHOT.jar
[INFO] Downloading: http://repository.apache.org/snapshots/org/apache/brooklyn/brooklyn-core/1.0.0-SNAPSHOT/brooklyn-core-1.0.0-SNAPSHOT-tests.jar
[INFO] Downloading: http://repository.apache.org/snapshots/org/apache/brooklyn/brooklyn-software-base/1.0.0-SNAPSHOT/brooklyn-software-base-1.0.0-SNAPSHOT-tests.jar
[INFO] Downloading: https://repository.apache.org/content/repositories/snapshots/org/apache/brooklyn/brooklyn-software-base/1.0.0-SNAPSHOT/brooklyn-software-base-1.0.0-SNAPSHOT.jar
[INFO] Downloading: https://repository.apache.org/content/repositories/snapshots/org/apache/brooklyn/brooklyn-camp/1.0.0-SNAPSHOT/brooklyn-camp-1.0.0-SNAPSHOT.jar
[INFO] Downloading: https://repository.apache.org/content/repositories/snapshots/org/apache/brooklyn/brooklyn-core/1.0.0-SNAPSHOT/brooklyn-core-1.0.0-SNAPSHOT-tests.jar
[INFO] Downloading: https://repository.apache.org/content/repositories/snapshots/org/apache/brooklyn/brooklyn-software-base/1.0.0-SNAPSHOT/brooklyn-software-base-1.0.0-SNAPSHOT-tests.jar
[INFO] ------------------------------------------------------------------------
[INFO] Reactor Summary:
[INFO]
[INFO] Brooklyn Library Root .............................. SUCCESS [ 7.977 s]
[INFO] Brooklyn CM Chef ................................... FAILURE [ 5.400 s]
[INFO] Brooklyn CM SaltStack .............................. SKIPPED
[INFO] Brooklyn CM Ansible ................................ SKIPPED
[INFO] Brooklyn CM Integration Root ....................... SKIPPED
[INFO] Brooklyn Network Software Entities ................. SKIPPED
[INFO] Brooklyn OSGi Software Entities .................... SKIPPED
[INFO] Brooklyn Database Software Entities ................ SKIPPED
[INFO] Brooklyn Web App Software Entities ................. SKIPPED
[INFO] Brooklyn Messaging Software Entities ............... SKIPPED
[INFO] Brooklyn NoSQL Data Store Software Entities ........ SKIPPED
[INFO] Brooklyn Monitoring Software Entities .............. SKIPPED
[INFO] Brooklyn QA ........................................ SKIPPED
[INFO] Brooklyn Examples Aggregator Project ............... SKIPPED
[INFO] Brooklyn Examples Aggregator Project - Webapps ..... SKIPPED
[INFO] hello-world-webapp Maven Webapp .................... SKIPPED
[INFO] hello-world-sql-webapp Maven Webapp ................ SKIPPED
[INFO] Brooklyn Simple Web Cluster Example ................ SKIPPED
[INFO] Brooklyn Library Karaf integration ................. SKIPPED
[INFO] Brooklyn Library Catalog ........................... SKIPPED
[INFO] Brooklyn Library Karaf Features .................... SKIPPED
[INFO] ------------------------------------------------------------------------
[INFO] BUILD FAILURE
[INFO] ------------------------------------------------------------------------
[INFO] Total time: 43.222 s
[INFO] Finished at: 2017-10-09T03:54:42+00:00
[INFO] Final Memory: 50M/653M
[INFO] ------------------------------------------------------------------------
[ERROR] Failed to execute goal on project brooklyn-software-cm-chef: Could not resolve dependencies for project org.apache.brooklyn:brooklyn-software-cm-chef:jar:1.0.0-SNAPSHOT: The following artifacts could not be resolved: org.apache.brooklyn:brooklyn-software-base:jar:1.0.0-SNAPSHOT, org.apache.brooklyn:brooklyn-camp:jar:1.0.0-SNAPSHOT, org.apache.brooklyn:brooklyn-core:jar:tests:1.0.0-SNAPSHOT, org.apache.brooklyn:brooklyn-software-base:jar:tests:1.0.0-SNAPSHOT: Could not find artifact org.apache.brooklyn:brooklyn-software-base:jar:1.0.0-SNAPSHOT in Nexus (http://repository.apache.org/snapshots) -> [Help 1]
[ERROR]
[ERROR] To see the full stack trace of the errors, re-run Maven with the -e switch.
[ERROR] Re-run Maven using the -X switch to enable full debug logging.
[ERROR]
[ERROR] For more information about the errors and possible solutions, please read the following articles:
[ERROR] [Help 1] http://cwiki.apache.org/confluence/display/MAVEN/DependencyResolutionException
[ERROR]
[ERROR] After correcting the problems, you can resume the build with the command
[ERROR] mvn <goals> -rf :brooklyn-software-cm-chef
[JENKINS] Archiving <https://builds.apache.org/job/brooklyn-library-master/ws/software/cm/salt/pom.xml> to org.apache.brooklyn/brooklyn-software-cm-salt/1.0.0-SNAPSHOT/brooklyn-software-cm-salt-1.0.0-SNAPSHOT.pom
[JENKINS] Archiving <https://builds.apache.org/job/brooklyn-library-master/ws/software/osgi/pom.xml> to org.apache.brooklyn/brooklyn-software-osgi/1.0.0-SNAPSHOT/brooklyn-software-osgi-1.0.0-SNAPSHOT.pom
[JENKINS] Archiving <https://builds.apache.org/job/brooklyn-library-master/ws/pom.xml> to org.apache.brooklyn/brooklyn-library/1.0.0-SNAPSHOT/brooklyn-library-1.0.0-SNAPSHOT.pom
[JENKINS] Archiving <https://builds.apache.org/job/brooklyn-library-master/ws/software/database/pom.xml> to org.apache.brooklyn/brooklyn-software-database/1.0.0-SNAPSHOT/brooklyn-software-database-1.0.0-SNAPSHOT.pom
[JENKINS] Archiving <https://builds.apache.org/job/brooklyn-library-master/ws/examples/webapps/hello-world-webapp/pom.xml> to org.apache.brooklyn.example/brooklyn-example-hello-world-webapp/1.0.0-SNAPSHOT/brooklyn-example-hello-world-webapp-1.0.0-SNAPSHOT.pom
[JENKINS] Archiving <https://builds.apache.org/job/brooklyn-library-master/ws/software/messaging/pom.xml> to org.apache.brooklyn/brooklyn-software-messaging/1.0.0-SNAPSHOT/brooklyn-software-messaging-1.0.0-SNAPSHOT.pom
[JENKINS] Archiving <https://builds.apache.org/job/brooklyn-library-master/ws/qa/pom.xml> to org.apache.brooklyn/brooklyn-qa/1.0.0-SNAPSHOT/brooklyn-qa-1.0.0-SNAPSHOT.pom
[JENKINS] Archiving <https://builds.apache.org/job/brooklyn-library-master/ws/software/cm/ansible/pom.xml> to org.apache.brooklyn/brooklyn-software-cm-ansible/1.0.0-SNAPSHOT/brooklyn-software-cm-ansible-1.0.0-SNAPSHOT.pom
[JENKINS] Archiving <https://builds.apache.org/job/brooklyn-library-master/ws/software/monitoring/pom.xml> to org.apache.brooklyn/brooklyn-software-monitoring/1.0.0-SNAPSHOT/brooklyn-software-monitoring-1.0.0-SNAPSHOT.pom
[JENKINS] Archiving <https://builds.apache.org/job/brooklyn-library-master/ws/karaf/catalog/pom.xml> to org.apache.brooklyn/brooklyn-library-catalog/1.0.0-SNAPSHOT/brooklyn-library-catalog-1.0.0-SNAPSHOT.pom
[JENKINS] Archiving <https://builds.apache.org/job/brooklyn-library-master/ws/software/cm/pom.xml> to org.apache.brooklyn/brooklyn-software-cm/1.0.0-SNAPSHOT/brooklyn-software-cm-1.0.0-SNAPSHOT.pom
[JENKINS] Archiving <https://builds.apache.org/job/brooklyn-library-master/ws/examples/webapps/hello-world-sql/pom.xml> to org.apache.brooklyn.example/brooklyn-example-hello-world-sql-webapp/1.0.0-SNAPSHOT/brooklyn-example-hello-world-sql-webapp-1.0.0-SNAPSHOT.pom
[JENKINS] Archiving <https://builds.apache.org/job/brooklyn-library-master/ws/software/network/pom.xml> to org.apache.brooklyn/brooklyn-software-network/1.0.0-SNAPSHOT/brooklyn-software-network-1.0.0-SNAPSHOT.pom
[JENKINS] Archiving <https://builds.apache.org/job/brooklyn-library-master/ws/software/webapp/pom.xml> to org.apache.brooklyn/brooklyn-software-webapp/1.0.0-SNAPSHOT/brooklyn-software-webapp-1.0.0-SNAPSHOT.pom
[JENKINS] Archiving <https://builds.apache.org/job/brooklyn-library-master/ws/software/nosql/pom.xml> to org.apache.brooklyn/brooklyn-software-nosql/1.0.0-SNAPSHOT/brooklyn-software-nosql-1.0.0-SNAPSHOT.pom
[JENKINS] Archiving <https://builds.apache.org/job/brooklyn-library-master/ws/karaf/features/pom.xml> to org.apache.brooklyn/brooklyn-library-features/1.0.0-SNAPSHOT/brooklyn-library-features-1.0.0-SNAPSHOT.pom
[JENKINS] Archiving <https://builds.apache.org/job/brooklyn-library-master/ws/karaf/pom.xml> to org.apache.brooklyn/brooklyn-library-karaf/1.0.0-SNAPSHOT/brooklyn-library-karaf-1.0.0-SNAPSHOT.pom
[JENKINS] Archiving <https://builds.apache.org/job/brooklyn-library-master/ws/examples/webapps/pom.xml> to org.apache.brooklyn.example/brooklyn-examples-webapps-parent/1.0.0-SNAPSHOT/brooklyn-examples-webapps-parent-1.0.0-SNAPSHOT.pom
[JENKINS] Archiving <https://builds.apache.org/job/brooklyn-library-master/ws/examples/simple-web-cluster/pom.xml> to org.apache.brooklyn.example/brooklyn-example-simple-web-cluster/1.0.0-SNAPSHOT/brooklyn-example-simple-web-cluster-1.0.0-SNAPSHOT.pom
[JENKINS] Archiving <https://builds.apache.org/job/brooklyn-library-master/ws/software/cm/chef/pom.xml> to org.apache.brooklyn/brooklyn-software-cm-chef/1.0.0-SNAPSHOT/brooklyn-software-cm-chef-1.0.0-SNAPSHOT.pom
[JENKINS] Archiving <https://builds.apache.org/job/brooklyn-library-master/ws/examples/pom.xml> to org.apache.brooklyn.example/brooklyn-examples-parent/1.0.0-SNAPSHOT/brooklyn-examples-parent-1.0.0-SNAPSHOT.pom
channel stopped
Build failed in Jenkins: brooklyn-library-master #451
Posted by Apache Jenkins Server <je...@builds.apache.org>.
See <https://builds.apache.org/job/brooklyn-library-master/451/display/redirect>
------------------------------------------
Started by timer
[EnvInject] - Loading node environment variables.
Building remotely on H27 (ubuntu xenial) in workspace <https://builds.apache.org/job/brooklyn-library-master/ws/>
> git rev-parse --is-inside-work-tree # timeout=10
Fetching changes from the remote Git repository
> git config remote.origin.url https://git-wip-us.apache.org/repos/asf/brooklyn-library.git # timeout=10
Fetching upstream changes from https://git-wip-us.apache.org/repos/asf/brooklyn-library.git
> git --version # timeout=10
> git fetch --tags --progress https://git-wip-us.apache.org/repos/asf/brooklyn-library.git +refs/heads/*:refs/remotes/origin/*
> git rev-parse origin/master^{commit} # timeout=10
Checking out Revision bd17aea7fc12395145cea0a393a989b63c2ea599 (origin/master)
Commit message: "Change version to 1.0.0-SNAPSHOT"
> git config core.sparsecheckout # timeout=10
> git checkout -f bd17aea7fc12395145cea0a393a989b63c2ea599
> git rev-list bd17aea7fc12395145cea0a393a989b63c2ea599 # timeout=10
Parsing POMs
Failed to transfer Could not find metadata org.apache.brooklyn:brooklyn-parent:1.0.0-SNAPSHOT/maven-metadata.xml in Nexus (http://repository.apache.org/snapshots)
Failed to transfer Could not find artifact org.apache.brooklyn:brooklyn-parent:pom:1.0.0-SNAPSHOT in Nexus (http://repository.apache.org/snapshots)
ERROR: Failed to parse POMs
java.io.IOException: remote file operation failed: <https://builds.apache.org/job/brooklyn-library-master/ws/> at hudson.remoting.Channel@1445642c:H27: hudson.remoting.ProxyException: hudson.maven.MavenModuleSetBuild$MavenExecutionException: org.apache.maven.project.ProjectBuildingException: Some problems were encountered while processing the POMs:
[FATAL] Non-resolvable parent POM: Could not find artifact org.apache.brooklyn:brooklyn-parent:pom:1.0.0-SNAPSHOT in Nexus (http://repository.apache.org/snapshots) and 'parent.relativePath' points at wrong local POM @ line 24, column 13
at hudson.FilePath.act(FilePath.java:994)
at hudson.FilePath.act(FilePath.java:976)
at hudson.maven.MavenModuleSetBuild$MavenModuleSetBuildExecution.parsePoms(MavenModuleSetBuild.java:986)
at hudson.maven.MavenModuleSetBuild$MavenModuleSetBuildExecution.doRun(MavenModuleSetBuild.java:691)
at hudson.model.AbstractBuild$AbstractBuildExecution.run(AbstractBuild.java:496)
at hudson.model.Run.execute(Run.java:1737)
at hudson.maven.MavenModuleSetBuild.run(MavenModuleSetBuild.java:543)
at hudson.model.ResourceController.execute(ResourceController.java:97)
at hudson.model.Executor.run(Executor.java:419)
Caused by: hudson.remoting.ProxyException: hudson.maven.MavenModuleSetBuild$MavenExecutionException: org.apache.maven.project.ProjectBuildingException: Some problems were encountered while processing the POMs:
[FATAL] Non-resolvable parent POM: Could not find artifact org.apache.brooklyn:brooklyn-parent:pom:1.0.0-SNAPSHOT in Nexus (http://repository.apache.org/snapshots) and 'parent.relativePath' points at wrong local POM @ line 24, column 13
at hudson.maven.MavenModuleSetBuild$PomParser.invoke(MavenModuleSetBuild.java:1391)
at hudson.maven.MavenModuleSetBuild$PomParser.invoke(MavenModuleSetBuild.java:1125)
at hudson.FilePath$FileCallableWrapper.call(FilePath.java:2750)
at hudson.remoting.UserRequest.perform(UserRequest.java:181)
at hudson.remoting.UserRequest.perform(UserRequest.java:52)
at hudson.remoting.Request$2.run(Request.java:336)
at hudson.remoting.InterceptingExecutorService$1.call(InterceptingExecutorService.java:68)
at java.util.concurrent.FutureTask.run(FutureTask.java:266)
at java.util.concurrent.ThreadPoolExecutor.runWorker(ThreadPoolExecutor.java:1142)
at java.util.concurrent.ThreadPoolExecutor$Worker.run(ThreadPoolExecutor.java:617)
at java.lang.Thread.run(Thread.java:748)
at ......remote call to H27(Native Method)
at hudson.remoting.Channel.attachCallSiteStackTrace(Channel.java:1554)
at hudson.remoting.UserResponse.retrieve(UserRequest.java:281)
at hudson.remoting.Channel.call(Channel.java:839)
at hudson.FilePath.act(FilePath.java:987)
... 8 more
Caused by: hudson.remoting.ProxyException: org.apache.maven.project.ProjectBuildingException: Some problems were encountered while processing the POMs:
[FATAL] Non-resolvable parent POM: Could not find artifact org.apache.brooklyn:brooklyn-parent:pom:1.0.0-SNAPSHOT in Nexus (http://repository.apache.org/snapshots) and 'parent.relativePath' points at wrong local POM @ line 24, column 13
at org.apache.maven.project.DefaultProjectBuilder.build(DefaultProjectBuilder.java:364)
at hudson.maven.MavenEmbedder.buildProjects(MavenEmbedder.java:361)
at hudson.maven.MavenEmbedder.readProjects(MavenEmbedder.java:331)
at hudson.maven.MavenModuleSetBuild$PomParser.invoke(MavenModuleSetBuild.java:1328)
at hudson.maven.MavenModuleSetBuild$PomParser.invoke(MavenModuleSetBuild.java:1125)
at hudson.FilePath$FileCallableWrapper.call(FilePath.java:2750)
at hudson.remoting.UserRequest.perform(UserRequest.java:181)
at hudson.remoting.UserRequest.perform(UserRequest.java:52)
at hudson.remoting.Request$2.run(Request.java:336)
at hudson.remoting.InterceptingExecutorService$1.call(InterceptingExecutorService.java:68)
at java.util.concurrent.FutureTask.run(FutureTask.java:266)
at java.util.concurrent.ThreadPoolExecutor.runWorker(ThreadPoolExecutor.java:1142)
at java.util.concurrent.ThreadPoolExecutor$Worker.run(ThreadPoolExecutor.java:617)
at java.lang.Thread.run(Thread.java:748)