You are viewing a plain text version of this content. The canonical link for it is here.
Posted to dev@geode.apache.org by Apache Jenkins Server <je...@builds.apache.org> on 2016/06/18 14:19:33 UTC

Build failed in Jenkins: Geode-nightly #503

See <https://builds.apache.org/job/Geode-nightly/503/changes>

Changes:

[agingade] GEODE-1209: Test changes, removing a sleep call which is not needed...

[klund] GEODE-1349: prevent 'java.lang.InternalError: MemoryPool not found'

[klund] GEODE-1559: add javadocs to OptionJFormatter

[klund] GEODE-835: remove developer name from comments

[klund] GEODE-1563: apply FlakyTest category to testExecuteFunctionOnGroups

[klund] GEODE-1551: apply FlakyTest category to testSimulateForEntireDS

[klund] GEODE-985: rebrand GFSH help for Apache Geode GEODE-1408: correct alter

[sboorlagadda] GEODE-1493: config/gemfire.properties that is shipped with the geode

------------------------------------------
[...truncated 829 lines...]
            How long the region can remain in the cache without being accessed or updated. The default
            is no expiration of this type.
            Required: false
            Default (if the parameter is specified without value): -1
        region-time-to-live-expiration-action
            Action to be taken on a region that has exceeded the TTL expiration.
            Required: false
            Default (if the parameter is specified without value): INVALIDATE
        cache-listener
            Fully qualified class name of a plug-in to be instantiated for receiving after-event
            notification of changes to the region and its entries. Any number of cache listeners can be
            configured.
            Required: false
        cache-loader
            Fully qualified class name of a plug-in to be instantiated for receiving notification of
            cache misses in the region. At most, one cache loader can be defined in each member for the
            region. For distributed regions, a cache loader may be invoked remotely from other members
            that have the region defined.
            Required: false
            Default (if the parameter is specified without value): help
        cache-writer
            Fully qualified class name of a plug-in to be instantiated for receiving before-event
            notification of changes to the region and its entries. The plug-in may cancel the event. At
            most, one cache writer can be defined in each member for the region.
            Required: false
            Default (if the parameter is specified without value): null]
        async-event-que...>
        at org.junit.Assert.assertEquals(Assert.java:115)
        at org.junit.Assert.assertEquals(Assert.java:144)
        at com.gemstone.gemfire.management.internal.cli.commands.HelpCommandsIntegrationTest.testOfflineHelp(HelpCommandsIntegrationTest.java:96)

3181 tests completed, 1 failed, 148 skipped
:geode-core:integrationTest FAILED
:geode-cq:assemble
:geode-cq:compileTestJavaNote: Some input files use or override a deprecated API.
Note: Recompile with -Xlint:deprecation for details.
Note: Some input files use unchecked or unsafe operations.
Note: Recompile with -Xlint:unchecked for details.

:geode-cq:processTestResources
:geode-cq:testClasses
:geode-cq:checkMissedTests
:geode-cq:test
:geode-cq:check
:geode-cq:build
:geode-cq:distributedTest
:geode-cq:flakyTest
:geode-cq:integrationTest
:geode-json:assemble
:geode-json:compileTestJava UP-TO-DATE
:geode-json:processTestResources UP-TO-DATE
:geode-json:testClasses UP-TO-DATE
:geode-json:checkMissedTests UP-TO-DATE
:geode-json:test UP-TO-DATE
:geode-json:check
:geode-json:build
:geode-json:distributedTest UP-TO-DATE
:geode-json:flakyTest UP-TO-DATE
:geode-json:integrationTest UP-TO-DATE
:geode-junit:javadoc
:geode-junit:javadocJar
:geode-junit:sourcesJar
:geode-junit:signArchives SKIPPED
:geode-junit:assemble
:geode-junit:compileTestJava
:geode-junit:processTestResources UP-TO-DATE
:geode-junit:testClasses
:geode-junit:checkMissedTests
:geode-junit:test
:geode-junit:check
:geode-junit:build
:geode-junit:distributedTest
:geode-junit:flakyTest
:geode-junit:integrationTest
:geode-lucene:assemble
:geode-lucene:compileTestJavaNote: Some input files use or override a deprecated API.
Note: Recompile with -Xlint:deprecation for details.
Note: Some input files use unchecked or unsafe operations.
Note: Recompile with -Xlint:unchecked for details.

:geode-lucene:processTestResources
:geode-lucene:testClasses
:geode-lucene:checkMissedTests
:geode-lucene:test
:geode-lucene:check
:geode-lucene:build
:geode-lucene:distributedTest
:geode-lucene:flakyTest
:geode-lucene:integrationTest
:geode-pulse:assemble
:geode-pulse:compileTestJavaNote: <https://builds.apache.org/job/Geode-nightly/ws/geode-pulse/src/test/java/com/vmware/gemfire/tools/pulse/tests/PulseAbstractTest.java> uses or overrides a deprecated API.
Note: Recompile with -Xlint:deprecation for details.
Note: Some input files use unchecked or unsafe operations.
Note: Recompile with -Xlint:unchecked for details.

:geode-pulse:processTestResources
:geode-pulse:testClasses
:geode-pulse:checkMissedTests
:geode-pulse:test
:geode-pulse:check
:geode-pulse:build
:geode-pulse:distributedTest
:geode-pulse:flakyTest
:geode-pulse:integrationTest
:geode-rebalancer:jar
:geode-rebalancer:javadoc
:geode-rebalancer:javadocJar
:geode-rebalancer:sourcesJar
:geode-rebalancer:signArchives SKIPPED
:geode-rebalancer:assemble
:geode-rebalancer:compileTestJava
:geode-rebalancer:processTestResources UP-TO-DATE
:geode-rebalancer:testClasses
:geode-rebalancer:checkMissedTests
:geode-rebalancer:test
:geode-rebalancer:check
:geode-rebalancer:build
:geode-rebalancer:distributedTest
:geode-rebalancer:flakyTest
:geode-rebalancer:integrationTest
:geode-wan:assemble
:geode-wan:compileTestJavaNote: Some input files use or override a deprecated API.
Note: Recompile with -Xlint:deprecation for details.
Note: Some input files use unchecked or unsafe operations.
Note: Recompile with -Xlint:unchecked for details.

:geode-wan:processTestResources
:geode-wan:testClasses
:geode-wan:checkMissedTests
:geode-wan:test
:geode-wan:check
:geode-wan:build
:geode-wan:distributedTest
:geode-wan:flakyTest
:geode-wan:integrationTest
:geode-web:assemble
:geode-web:compileTestJavaNote: <https://builds.apache.org/job/Geode-nightly/ws/geode-web/src/test/java/com/gemstone/gemfire/management/internal/web/AbstractWebTestCase.java> uses unchecked or unsafe operations.
Note: Recompile with -Xlint:unchecked for details.

:geode-web:processTestResources UP-TO-DATE
:geode-web:testClasses
:geode-web:checkMissedTests
:geode-web:test
:geode-web:check
:geode-web:build
:geode-web:distributedTest
:geode-web:flakyTest
:geode-web:integrationTest
:geode-web-api:assemble
:geode-web-api:compileTestJava UP-TO-DATE
:geode-web-api:processTestResources UP-TO-DATE
:geode-web-api:testClasses UP-TO-DATE
:geode-web-api:checkMissedTests UP-TO-DATE
:geode-web-api:test UP-TO-DATE
:geode-web-api:check
:geode-web-api:build
:geode-web-api:distributedTest UP-TO-DATE
:geode-web-api:flakyTest UP-TO-DATE
:geode-web-api:integrationTest UP-TO-DATE
:combineReports
All test reports at <https://builds.apache.org/job/Geode-nightly/ws/build/reports/combined>
:extensions/geode-modules:precheckin
:extensions/geode-modules-assembly:precheckin
:extensions/geode-modules-hibernate:precheckin
:extensions/geode-modules-session:precheckin
:extensions/geode-modules-session-internal:precheckin
:extensions/geode-modules-tomcat7:precheckin
:geode-assembly:precheckin
:geode-common:precheckin
:geode-cq:precheckin
:geode-json:precheckin
:geode-junit:precheckin
:geode-lucene:precheckin
:geode-pulse:precheckin
:geode-rebalancer:precheckin
:geode-wan:precheckin
:geode-web:precheckin
:geode-web-api:precheckin
:extensions/geode-modules:uploadArchives
:extensions/geode-modules-assembly:uploadArchives SKIPPED
:extensions/geode-modules-hibernate:uploadArchives
:extensions/geode-modules-session:uploadArchives
:extensions/geode-modules-session-internal:uploadArchives
:extensions/geode-modules-tomcat7:uploadArchives
:geode-assembly:uploadArchives SKIPPED
:geode-common:uploadArchives
:geode-core:uploadArchives
:geode-cq:uploadArchives
:geode-json:uploadArchives
:geode-junit:uploadArchives
:geode-lucene:uploadArchives
:geode-pulse:uploadArchivesCould not transfer artifact org.apache.geode:geode-pulse:war:1.0.0-incubating.M3-20160618.141718-57 from/to remote (https://repository.apache.org/content/repositories/snapshots): Connection reset
 FAILED
:geode-rebalancer:uploadArchives
:geode-wan:uploadArchives
:geode-web:uploadArchives
:geode-web-api:uploadArchives

FAILURE: Build completed with 4 failures.

1: Task failed with an exception.
-----------
* What went wrong:
Execution failed for task ':geode-core:distributedTest'.
> There were failing tests. See the report at: file://<https://builds.apache.org/job/Geode-nightly/ws/geode-core/build/reports/distributedTest/index.html>

* Try:
Run with --stacktrace option to get the stack trace. Run with --info or --debug option to get more log output.
==============================================================================

2: Task failed with an exception.
-----------
* What went wrong:
Execution failed for task ':geode-core:flakyTest'.
> There were failing tests. See the report at: file://<https://builds.apache.org/job/Geode-nightly/ws/geode-core/build/reports/flakyTest/index.html>

* Try:
Run with --stacktrace option to get the stack trace. Run with --info or --debug option to get more log output.
==============================================================================

3: Task failed with an exception.
-----------
* What went wrong:
Execution failed for task ':geode-core:integrationTest'.
> There were failing tests. See the report at: file://<https://builds.apache.org/job/Geode-nightly/ws/geode-core/build/reports/integrationTest/index.html>

* Try:
Run with --stacktrace option to get the stack trace. Run with --info or --debug option to get more log output.
==============================================================================

4: Task failed with an exception.
-----------
* What went wrong:
Execution failed for task ':geode-pulse:uploadArchives'.
> Could not publish configuration 'archives'
   > Failed to deploy artifacts: Could not transfer artifact org.apache.geode:geode-pulse:war:1.0.0-incubating.M3-20160618.141718-57 from/to remote (https://repository.apache.org/content/repositories/snapshots): Connection reset

* Try:
Run with --stacktrace option to get the stack trace. Run with --info or --debug option to get more log output.
==============================================================================

BUILD FAILED

Total time: 10 hrs 35 mins 57.206 secs
Build step 'Invoke Gradle script' changed build result to FAILURE
Build step 'Invoke Gradle script' marked build as failure
Archiving artifacts
Compressed 251.38 MB of artifacts by 36.2% relative to #501
Recording test results

Build failed in Jenkins: Geode-nightly #505

Posted by Apache Jenkins Server <je...@builds.apache.org>.
See <https://builds.apache.org/job/Geode-nightly/505/>

------------------------------------------
[...truncated 794 lines...]
            Required: false
            Default (if the parameter is specified without value): __DEFAULT__]
        async-event-que...> but was:<...ied without value): [INVALIDATE
        entry-time-to-live-expiration
            How long the region's entries can remain in the cache without being accessed or updated.
            The default is no expiration of this type.
            Required: false
            Default (if the parameter is specified without value): -1
        entry-time-to-live-expiration-action
            Action to be taken on an entry that has exceeded the TTL expiration.
            Required: false
            Default (if the parameter is specified without value): INVALIDATE
        region-idle-time-expiration
            How long the region can remain in the cache without being accessed. The default is no
            expiration of this type.
            Required: false
            Default (if the parameter is specified without value): -1
        region-idle-time-expiration-action
            Action to be taken on a region that has exceeded the idle expiration.
            Required: false
            Default (if the parameter is specified without value): INVALIDATE
        region-time-to-live-expiration
            How long the region can remain in the cache without being accessed or updated. The default
            is no expiration of this type.
            Required: false
            Default (if the parameter is specified without value): -1
        region-time-to-live-expiration-action
            Action to be taken on a region that has exceeded the TTL expiration.
            Required: false
            Default (if the parameter is specified without value): INVALIDATE
        cache-listener
            Fully qualified class name of a plug-in to be instantiated for receiving after-event
            notification of changes to the region and its entries. Any number of cache listeners can be
            configured.
            Required: false
        cache-loader
            Fully qualified class name of a plug-in to be instantiated for receiving notification of
            cache misses in the region. At most, one cache loader can be defined in each member for the
            region. For distributed regions, a cache loader may be invoked remotely from other members
            that have the region defined.
            Required: false
            Default (if the parameter is specified without value): help
        cache-writer
            Fully qualified class name of a plug-in to be instantiated for receiving before-event
            notification of changes to the region and its entries. The plug-in may cancel the event. At
            most, one cache writer can be defined in each member for the region.
            Required: false
            Default (if the parameter is specified without value): null]
        async-event-que...>
        at org.junit.Assert.assertEquals(Assert.java:115)
        at org.junit.Assert.assertEquals(Assert.java:144)
        at com.gemstone.gemfire.management.internal.cli.commands.HelpCommandsIntegrationTest.testOfflineHelp(HelpCommandsIntegrationTest.java:96)

3181 tests completed, 1 failed, 148 skipped
:geode-core:integrationTest FAILED
:geode-cq:assemble
:geode-cq:compileTestJavaNote: Some input files use or override a deprecated API.
Note: Recompile with -Xlint:deprecation for details.
Note: Some input files use unchecked or unsafe operations.
Note: Recompile with -Xlint:unchecked for details.

:geode-cq:processTestResources
:geode-cq:testClasses
:geode-cq:checkMissedTests
:geode-cq:test
:geode-cq:check
:geode-cq:build
:geode-cq:distributedTest
:geode-cq:flakyTest
:geode-cq:integrationTest
:geode-json:assemble
:geode-json:compileTestJava UP-TO-DATE
:geode-json:processTestResources UP-TO-DATE
:geode-json:testClasses UP-TO-DATE
:geode-json:checkMissedTests UP-TO-DATE
:geode-json:test UP-TO-DATE
:geode-json:check
:geode-json:build
:geode-json:distributedTest UP-TO-DATE
:geode-json:flakyTest UP-TO-DATE
:geode-json:integrationTest UP-TO-DATE
:geode-junit:javadoc
:geode-junit:javadocJar
:geode-junit:sourcesJar
:geode-junit:signArchives SKIPPED
:geode-junit:assemble
:geode-junit:compileTestJava
:geode-junit:processTestResources UP-TO-DATE
:geode-junit:testClasses
:geode-junit:checkMissedTests
:geode-junit:test
:geode-junit:check
:geode-junit:build
:geode-junit:distributedTest
:geode-junit:flakyTest
:geode-junit:integrationTest
:geode-lucene:assemble
:geode-lucene:compileTestJavaNote: Some input files use or override a deprecated API.
Note: Recompile with -Xlint:deprecation for details.
Note: Some input files use unchecked or unsafe operations.
Note: Recompile with -Xlint:unchecked for details.

:geode-lucene:processTestResources
:geode-lucene:testClasses
:geode-lucene:checkMissedTests
:geode-lucene:test
:geode-lucene:check
:geode-lucene:build
:geode-lucene:distributedTest
:geode-lucene:flakyTest
:geode-lucene:integrationTest
:geode-pulse:assemble
:geode-pulse:compileTestJavaNote: <https://builds.apache.org/job/Geode-nightly/ws/geode-pulse/src/test/java/com/vmware/gemfire/tools/pulse/tests/PulseAbstractTest.java> uses or overrides a deprecated API.
Note: Recompile with -Xlint:deprecation for details.
Note: Some input files use unchecked or unsafe operations.
Note: Recompile with -Xlint:unchecked for details.

:geode-pulse:processTestResources
:geode-pulse:testClasses
:geode-pulse:checkMissedTests
:geode-pulse:test
:geode-pulse:check
:geode-pulse:build
:geode-pulse:distributedTest
:geode-pulse:flakyTest
:geode-pulse:integrationTest
:geode-rebalancer:jar
:geode-rebalancer:javadoc
:geode-rebalancer:javadocJar
:geode-rebalancer:sourcesJar
:geode-rebalancer:signArchives SKIPPED
:geode-rebalancer:assemble
:geode-rebalancer:compileTestJava
:geode-rebalancer:processTestResources UP-TO-DATE
:geode-rebalancer:testClasses
:geode-rebalancer:checkMissedTests
:geode-rebalancer:test
:geode-rebalancer:check
:geode-rebalancer:build
:geode-rebalancer:distributedTest
:geode-rebalancer:flakyTest
:geode-rebalancer:integrationTest
:geode-wan:assemble
:geode-wan:compileTestJavaNote: Some input files use or override a deprecated API.
Note: Recompile with -Xlint:deprecation for details.
Note: Some input files use unchecked or unsafe operations.
Note: Recompile with -Xlint:unchecked for details.

:geode-wan:processTestResources
:geode-wan:testClasses
:geode-wan:checkMissedTests
:geode-wan:test
:geode-wan:check
:geode-wan:build
:geode-wan:distributedTest
:geode-wan:flakyTest
:geode-wan:integrationTest
:geode-web:assemble
:geode-web:compileTestJavaNote: <https://builds.apache.org/job/Geode-nightly/ws/geode-web/src/test/java/com/gemstone/gemfire/management/internal/web/AbstractWebTestCase.java> uses unchecked or unsafe operations.
Note: Recompile with -Xlint:unchecked for details.

:geode-web:processTestResources UP-TO-DATE
:geode-web:testClasses
:geode-web:checkMissedTests
:geode-web:test
:geode-web:check
:geode-web:build
:geode-web:distributedTest
:geode-web:flakyTest
:geode-web:integrationTest
:geode-web-api:assemble
:geode-web-api:compileTestJava UP-TO-DATE
:geode-web-api:processTestResources UP-TO-DATE
:geode-web-api:testClasses UP-TO-DATE
:geode-web-api:checkMissedTests UP-TO-DATE
:geode-web-api:test UP-TO-DATE
:geode-web-api:check
:geode-web-api:build
:geode-web-api:distributedTest UP-TO-DATE
:geode-web-api:flakyTest UP-TO-DATE
:geode-web-api:integrationTest UP-TO-DATE
:combineReports
All test reports at <https://builds.apache.org/job/Geode-nightly/ws/build/reports/combined>
:extensions/geode-modules:precheckin
:extensions/geode-modules-assembly:precheckin
:extensions/geode-modules-hibernate:precheckin
:extensions/geode-modules-session:precheckin
:extensions/geode-modules-session-internal:precheckin
:extensions/geode-modules-tomcat7:precheckin
:geode-assembly:precheckin
:geode-common:precheckin
:geode-cq:precheckin
:geode-json:precheckin
:geode-junit:precheckin
:geode-lucene:precheckin
:geode-pulse:precheckin
:geode-rebalancer:precheckin
:geode-wan:precheckin
:geode-web:precheckin
:geode-web-api:precheckin
:extensions/geode-modules:uploadArchives
:extensions/geode-modules-assembly:uploadArchives SKIPPED
:extensions/geode-modules-hibernate:uploadArchives
:extensions/geode-modules-session:uploadArchives
:extensions/geode-modules-session-internal:uploadArchives
:extensions/geode-modules-tomcat7:uploadArchives
:geode-assembly:uploadArchives SKIPPED
:geode-common:uploadArchives
:geode-core:uploadArchives
:geode-cq:uploadArchives
:geode-json:uploadArchives
:geode-junit:uploadArchives
:geode-lucene:uploadArchives
:geode-pulse:uploadArchives
:geode-rebalancer:uploadArchives
:geode-wan:uploadArchives
:geode-web:uploadArchives
:geode-web-api:uploadArchives

FAILURE: Build completed with 2 failures.

1: Task failed with an exception.
-----------
* What went wrong:
Execution failed for task ':geode-core:flakyTest'.
> There were failing tests. See the report at: file://<https://builds.apache.org/job/Geode-nightly/ws/geode-core/build/reports/flakyTest/index.html>

* Try:
Run with --stacktrace option to get the stack trace. Run with --info or --debug option to get more log output.
==============================================================================

2: Task failed with an exception.
-----------
* What went wrong:
Execution failed for task ':geode-core:integrationTest'.
> There were failing tests. See the report at: file://<https://builds.apache.org/job/Geode-nightly/ws/geode-core/build/reports/integrationTest/index.html>

* Try:
Run with --stacktrace option to get the stack trace. Run with --info or --debug option to get more log output.
==============================================================================

BUILD FAILED

Total time: 10 hrs 40 mins 32.463 secs
Build step 'Invoke Gradle script' changed build result to FAILURE
Build step 'Invoke Gradle script' marked build as failure
Archiving artifacts
Compressed 251.37 MB of artifacts by 22.4% relative to #501
Recording test results

Re: Build failed in Jenkins: Geode-nightly #504

Posted by Kirk Lund <kl...@pivotal.io>.
The one failure in this build is GEODE-1567 which is fixed on
feature/GEODE-1567 and is awaiting review(s). We should be able to get that
merged in tomorrow.

-Kirk

On Sunday, June 19, 2016, Apache Jenkins Server <je...@builds.apache.org>
wrote:

> See <https://builds.apache.org/job/Geode-nightly/504/changes>
>
> Changes:
>
> [klund] GEODE-1565: exclude GemfireDataCommandsDUnitTest over HTTP
>
> [klund] GEODE-1568: disable PreloadedRegionTestCase with @Ignore
>
> ------------------------------------------
> [...truncated 794 lines...]
>             Required: false
>             Default (if the parameter is specified without value):
> __DEFAULT__]
>         async-event-que...> but was:<...ied without value): [INVALIDATE
>         entry-time-to-live-expiration
>             How long the region's entries can remain in the cache without
> being accessed or updated.
>             The default is no expiration of this type.
>             Required: false
>             Default (if the parameter is specified without value): -1
>         entry-time-to-live-expiration-action
>             Action to be taken on an entry that has exceeded the TTL
> expiration.
>             Required: false
>             Default (if the parameter is specified without value):
> INVALIDATE
>         region-idle-time-expiration
>             How long the region can remain in the cache without being
> accessed. The default is no
>             expiration of this type.
>             Required: false
>             Default (if the parameter is specified without value): -1
>         region-idle-time-expiration-action
>             Action to be taken on a region that has exceeded the idle
> expiration.
>             Required: false
>             Default (if the parameter is specified without value):
> INVALIDATE
>         region-time-to-live-expiration
>             How long the region can remain in the cache without being
> accessed or updated. The default
>             is no expiration of this type.
>             Required: false
>             Default (if the parameter is specified without value): -1
>         region-time-to-live-expiration-action
>             Action to be taken on a region that has exceeded the TTL
> expiration.
>             Required: false
>             Default (if the parameter is specified without value):
> INVALIDATE
>         cache-listener
>             Fully qualified class name of a plug-in to be instantiated for
> receiving after-event
>             notification of changes to the region and its entries. Any
> number of cache listeners can be
>             configured.
>             Required: false
>         cache-loader
>             Fully qualified class name of a plug-in to be instantiated for
> receiving notification of
>             cache misses in the region. At most, one cache loader can be
> defined in each member for the
>             region. For distributed regions, a cache loader may be invoked
> remotely from other members
>             that have the region defined.
>             Required: false
>             Default (if the parameter is specified without value): help
>         cache-writer
>             Fully qualified class name of a plug-in to be instantiated for
> receiving before-event
>             notification of changes to the region and its entries. The
> plug-in may cancel the event. At
>             most, one cache writer can be defined in each member for the
> region.
>             Required: false
>             Default (if the parameter is specified without value): null]
>         async-event-que...>
>         at org.junit.Assert.assertEquals(Assert.java:115)
>         at org.junit.Assert.assertEquals(Assert.java:144)
>         at
> com.gemstone.gemfire.management.internal.cli.commands.HelpCommandsIntegrationTest.testOfflineHelp(HelpCommandsIntegrationTest.java:96)
>
> 3181 tests completed, 1 failed, 148 skipped
> :geode-core:integrationTest FAILED
> :geode-cq:assemble
> :geode-cq:compileTestJavaNote: Some input files use or override a
> deprecated API.
> Note: Recompile with -Xlint:deprecation for details.
> Note: Some input files use unchecked or unsafe operations.
> Note: Recompile with -Xlint:unchecked for details.
>
> :geode-cq:processTestResources
> :geode-cq:testClasses
> :geode-cq:checkMissedTests
> :geode-cq:test
> :geode-cq:check
> :geode-cq:build
> :geode-cq:distributedTest
> :geode-cq:flakyTest
> :geode-cq:integrationTest
> :geode-json:assemble
> :geode-json:compileTestJava UP-TO-DATE
> :geode-json:processTestResources UP-TO-DATE
> :geode-json:testClasses UP-TO-DATE
> :geode-json:checkMissedTests UP-TO-DATE
> :geode-json:test UP-TO-DATE
> :geode-json:check
> :geode-json:build
> :geode-json:distributedTest UP-TO-DATE
> :geode-json:flakyTest UP-TO-DATE
> :geode-json:integrationTest UP-TO-DATE
> :geode-junit:javadoc
> :geode-junit:javadocJar
> :geode-junit:sourcesJar
> :geode-junit:signArchives SKIPPED
> :geode-junit:assemble
> :geode-junit:compileTestJava
> :geode-junit:processTestResources UP-TO-DATE
> :geode-junit:testClasses
> :geode-junit:checkMissedTests
> :geode-junit:test
> :geode-junit:check
> :geode-junit:build
> :geode-junit:distributedTest
> :geode-junit:flakyTest
> :geode-junit:integrationTest
> :geode-lucene:assemble
> :geode-lucene:compileTestJavaNote: Some input files use or override a
> deprecated API.
> Note: Recompile with -Xlint:deprecation for details.
> Note: Some input files use unchecked or unsafe operations.
> Note: Recompile with -Xlint:unchecked for details.
>
> :geode-lucene:processTestResources
> :geode-lucene:testClasses
> :geode-lucene:checkMissedTests
> :geode-lucene:test
> :geode-lucene:check
> :geode-lucene:build
> :geode-lucene:distributedTest
> :geode-lucene:flakyTest
> :geode-lucene:integrationTest
> :geode-pulse:assemble
> :geode-pulse:compileTestJavaNote: <
> https://builds.apache.org/job/Geode-nightly/ws/geode-pulse/src/test/java/com/vmware/gemfire/tools/pulse/tests/PulseAbstractTest.java>
> uses or overrides a deprecated API.
> Note: Recompile with -Xlint:deprecation for details.
> Note: Some input files use unchecked or unsafe operations.
> Note: Recompile with -Xlint:unchecked for details.
>
> :geode-pulse:processTestResources
> :geode-pulse:testClasses
> :geode-pulse:checkMissedTests
> :geode-pulse:test
> :geode-pulse:check
> :geode-pulse:build
> :geode-pulse:distributedTest
> :geode-pulse:flakyTest
> :geode-pulse:integrationTest
> :geode-rebalancer:jar
> :geode-rebalancer:javadoc
> :geode-rebalancer:javadocJar
> :geode-rebalancer:sourcesJar
> :geode-rebalancer:signArchives SKIPPED
> :geode-rebalancer:assemble
> :geode-rebalancer:compileTestJava
> :geode-rebalancer:processTestResources UP-TO-DATE
> :geode-rebalancer:testClasses
> :geode-rebalancer:checkMissedTests
> :geode-rebalancer:test
> :geode-rebalancer:check
> :geode-rebalancer:build
> :geode-rebalancer:distributedTest
> :geode-rebalancer:flakyTest
> :geode-rebalancer:integrationTest
> :geode-wan:assemble
> :geode-wan:compileTestJavaNote: Some input files use or override a
> deprecated API.
> Note: Recompile with -Xlint:deprecation for details.
> Note: Some input files use unchecked or unsafe operations.
> Note: Recompile with -Xlint:unchecked for details.
>
> :geode-wan:processTestResources
> :geode-wan:testClasses
> :geode-wan:checkMissedTests
> :geode-wan:test
> :geode-wan:check
> :geode-wan:build
> :geode-wan:distributedTest
> :geode-wan:flakyTest
> :geode-wan:integrationTest
> :geode-web:assemble
> :geode-web:compileTestJavaNote: <
> https://builds.apache.org/job/Geode-nightly/ws/geode-web/src/test/java/com/gemstone/gemfire/management/internal/web/AbstractWebTestCase.java>
> uses unchecked or unsafe operations.
> Note: Recompile with -Xlint:unchecked for details.
>
> :geode-web:processTestResources UP-TO-DATE
> :geode-web:testClasses
> :geode-web:checkMissedTests
> :geode-web:test
> :geode-web:check
> :geode-web:build
> :geode-web:distributedTest
> :geode-web:flakyTest
> :geode-web:integrationTest
> :geode-web-api:assemble
> :geode-web-api:compileTestJava UP-TO-DATE
> :geode-web-api:processTestResources UP-TO-DATE
> :geode-web-api:testClasses UP-TO-DATE
> :geode-web-api:checkMissedTests UP-TO-DATE
> :geode-web-api:test UP-TO-DATE
> :geode-web-api:check
> :geode-web-api:build
> :geode-web-api:distributedTest UP-TO-DATE
> :geode-web-api:flakyTest UP-TO-DATE
> :geode-web-api:integrationTest UP-TO-DATE
> :combineReports
> All test reports at <
> https://builds.apache.org/job/Geode-nightly/ws/build/reports/combined>
> :extensions/geode-modules:precheckin
> :extensions/geode-modules-assembly:precheckin
> :extensions/geode-modules-hibernate:precheckin
> :extensions/geode-modules-session:precheckin
> :extensions/geode-modules-session-internal:precheckin
> :extensions/geode-modules-tomcat7:precheckin
> :geode-assembly:precheckin
> :geode-common:precheckin
> :geode-cq:precheckin
> :geode-json:precheckin
> :geode-junit:precheckin
> :geode-lucene:precheckin
> :geode-pulse:precheckin
> :geode-rebalancer:precheckin
> :geode-wan:precheckin
> :geode-web:precheckin
> :geode-web-api:precheckin
> :extensions/geode-modules:uploadArchives
> :extensions/geode-modules-assembly:uploadArchives SKIPPED
> :extensions/geode-modules-hibernate:uploadArchives
> :extensions/geode-modules-session:uploadArchives
> :extensions/geode-modules-session-internal:uploadArchives
> :extensions/geode-modules-tomcat7:uploadArchives
> :geode-assembly:uploadArchives SKIPPED
> :geode-common:uploadArchives
> :geode-core:uploadArchives
> :geode-cq:uploadArchives
> :geode-json:uploadArchives
> :geode-junit:uploadArchives
> :geode-lucene:uploadArchives
> :geode-pulse:uploadArchives
> :geode-rebalancer:uploadArchives
> :geode-wan:uploadArchives
> :geode-web:uploadArchives
> :geode-web-api:uploadArchives
>
> FAILURE: Build completed with 2 failures.
>
> 1: Task failed with an exception.
> -----------
> * What went wrong:
> Execution failed for task ':geode-core:flakyTest'.
> > There were failing tests. See the report at: file://<
> https://builds.apache.org/job/Geode-nightly/ws/geode-core/build/reports/flakyTest/index.html
> >
>
> * Try:
> Run with --stacktrace option to get the stack trace. Run with --info or
> --debug option to get more log output.
>
> ==============================================================================
>
> 2: Task failed with an exception.
> -----------
> * What went wrong:
> Execution failed for task ':geode-core:integrationTest'.
> > There were failing tests. See the report at: file://<
> https://builds.apache.org/job/Geode-nightly/ws/geode-core/build/reports/integrationTest/index.html
> >
>
> * Try:
> Run with --stacktrace option to get the stack trace. Run with --info or
> --debug option to get more log output.
>
> ==============================================================================
>
> BUILD FAILED
>
> Total time: 10 hrs 33 mins 20.147 secs
> Build step 'Invoke Gradle script' changed build result to FAILURE
> Build step 'Invoke Gradle script' marked build as failure
> Archiving artifacts
> Compressed 251.37 MB of artifacts by 22.3% relative to #501
> Recording test results
>

Build failed in Jenkins: Geode-nightly #504

Posted by Apache Jenkins Server <je...@builds.apache.org>.
See <https://builds.apache.org/job/Geode-nightly/504/changes>

Changes:

[klund] GEODE-1565: exclude GemfireDataCommandsDUnitTest over HTTP

[klund] GEODE-1568: disable PreloadedRegionTestCase with @Ignore

------------------------------------------
[...truncated 794 lines...]
            Required: false
            Default (if the parameter is specified without value): __DEFAULT__]
        async-event-que...> but was:<...ied without value): [INVALIDATE
        entry-time-to-live-expiration
            How long the region's entries can remain in the cache without being accessed or updated.
            The default is no expiration of this type.
            Required: false
            Default (if the parameter is specified without value): -1
        entry-time-to-live-expiration-action
            Action to be taken on an entry that has exceeded the TTL expiration.
            Required: false
            Default (if the parameter is specified without value): INVALIDATE
        region-idle-time-expiration
            How long the region can remain in the cache without being accessed. The default is no
            expiration of this type.
            Required: false
            Default (if the parameter is specified without value): -1
        region-idle-time-expiration-action
            Action to be taken on a region that has exceeded the idle expiration.
            Required: false
            Default (if the parameter is specified without value): INVALIDATE
        region-time-to-live-expiration
            How long the region can remain in the cache without being accessed or updated. The default
            is no expiration of this type.
            Required: false
            Default (if the parameter is specified without value): -1
        region-time-to-live-expiration-action
            Action to be taken on a region that has exceeded the TTL expiration.
            Required: false
            Default (if the parameter is specified without value): INVALIDATE
        cache-listener
            Fully qualified class name of a plug-in to be instantiated for receiving after-event
            notification of changes to the region and its entries. Any number of cache listeners can be
            configured.
            Required: false
        cache-loader
            Fully qualified class name of a plug-in to be instantiated for receiving notification of
            cache misses in the region. At most, one cache loader can be defined in each member for the
            region. For distributed regions, a cache loader may be invoked remotely from other members
            that have the region defined.
            Required: false
            Default (if the parameter is specified without value): help
        cache-writer
            Fully qualified class name of a plug-in to be instantiated for receiving before-event
            notification of changes to the region and its entries. The plug-in may cancel the event. At
            most, one cache writer can be defined in each member for the region.
            Required: false
            Default (if the parameter is specified without value): null]
        async-event-que...>
        at org.junit.Assert.assertEquals(Assert.java:115)
        at org.junit.Assert.assertEquals(Assert.java:144)
        at com.gemstone.gemfire.management.internal.cli.commands.HelpCommandsIntegrationTest.testOfflineHelp(HelpCommandsIntegrationTest.java:96)

3181 tests completed, 1 failed, 148 skipped
:geode-core:integrationTest FAILED
:geode-cq:assemble
:geode-cq:compileTestJavaNote: Some input files use or override a deprecated API.
Note: Recompile with -Xlint:deprecation for details.
Note: Some input files use unchecked or unsafe operations.
Note: Recompile with -Xlint:unchecked for details.

:geode-cq:processTestResources
:geode-cq:testClasses
:geode-cq:checkMissedTests
:geode-cq:test
:geode-cq:check
:geode-cq:build
:geode-cq:distributedTest
:geode-cq:flakyTest
:geode-cq:integrationTest
:geode-json:assemble
:geode-json:compileTestJava UP-TO-DATE
:geode-json:processTestResources UP-TO-DATE
:geode-json:testClasses UP-TO-DATE
:geode-json:checkMissedTests UP-TO-DATE
:geode-json:test UP-TO-DATE
:geode-json:check
:geode-json:build
:geode-json:distributedTest UP-TO-DATE
:geode-json:flakyTest UP-TO-DATE
:geode-json:integrationTest UP-TO-DATE
:geode-junit:javadoc
:geode-junit:javadocJar
:geode-junit:sourcesJar
:geode-junit:signArchives SKIPPED
:geode-junit:assemble
:geode-junit:compileTestJava
:geode-junit:processTestResources UP-TO-DATE
:geode-junit:testClasses
:geode-junit:checkMissedTests
:geode-junit:test
:geode-junit:check
:geode-junit:build
:geode-junit:distributedTest
:geode-junit:flakyTest
:geode-junit:integrationTest
:geode-lucene:assemble
:geode-lucene:compileTestJavaNote: Some input files use or override a deprecated API.
Note: Recompile with -Xlint:deprecation for details.
Note: Some input files use unchecked or unsafe operations.
Note: Recompile with -Xlint:unchecked for details.

:geode-lucene:processTestResources
:geode-lucene:testClasses
:geode-lucene:checkMissedTests
:geode-lucene:test
:geode-lucene:check
:geode-lucene:build
:geode-lucene:distributedTest
:geode-lucene:flakyTest
:geode-lucene:integrationTest
:geode-pulse:assemble
:geode-pulse:compileTestJavaNote: <https://builds.apache.org/job/Geode-nightly/ws/geode-pulse/src/test/java/com/vmware/gemfire/tools/pulse/tests/PulseAbstractTest.java> uses or overrides a deprecated API.
Note: Recompile with -Xlint:deprecation for details.
Note: Some input files use unchecked or unsafe operations.
Note: Recompile with -Xlint:unchecked for details.

:geode-pulse:processTestResources
:geode-pulse:testClasses
:geode-pulse:checkMissedTests
:geode-pulse:test
:geode-pulse:check
:geode-pulse:build
:geode-pulse:distributedTest
:geode-pulse:flakyTest
:geode-pulse:integrationTest
:geode-rebalancer:jar
:geode-rebalancer:javadoc
:geode-rebalancer:javadocJar
:geode-rebalancer:sourcesJar
:geode-rebalancer:signArchives SKIPPED
:geode-rebalancer:assemble
:geode-rebalancer:compileTestJava
:geode-rebalancer:processTestResources UP-TO-DATE
:geode-rebalancer:testClasses
:geode-rebalancer:checkMissedTests
:geode-rebalancer:test
:geode-rebalancer:check
:geode-rebalancer:build
:geode-rebalancer:distributedTest
:geode-rebalancer:flakyTest
:geode-rebalancer:integrationTest
:geode-wan:assemble
:geode-wan:compileTestJavaNote: Some input files use or override a deprecated API.
Note: Recompile with -Xlint:deprecation for details.
Note: Some input files use unchecked or unsafe operations.
Note: Recompile with -Xlint:unchecked for details.

:geode-wan:processTestResources
:geode-wan:testClasses
:geode-wan:checkMissedTests
:geode-wan:test
:geode-wan:check
:geode-wan:build
:geode-wan:distributedTest
:geode-wan:flakyTest
:geode-wan:integrationTest
:geode-web:assemble
:geode-web:compileTestJavaNote: <https://builds.apache.org/job/Geode-nightly/ws/geode-web/src/test/java/com/gemstone/gemfire/management/internal/web/AbstractWebTestCase.java> uses unchecked or unsafe operations.
Note: Recompile with -Xlint:unchecked for details.

:geode-web:processTestResources UP-TO-DATE
:geode-web:testClasses
:geode-web:checkMissedTests
:geode-web:test
:geode-web:check
:geode-web:build
:geode-web:distributedTest
:geode-web:flakyTest
:geode-web:integrationTest
:geode-web-api:assemble
:geode-web-api:compileTestJava UP-TO-DATE
:geode-web-api:processTestResources UP-TO-DATE
:geode-web-api:testClasses UP-TO-DATE
:geode-web-api:checkMissedTests UP-TO-DATE
:geode-web-api:test UP-TO-DATE
:geode-web-api:check
:geode-web-api:build
:geode-web-api:distributedTest UP-TO-DATE
:geode-web-api:flakyTest UP-TO-DATE
:geode-web-api:integrationTest UP-TO-DATE
:combineReports
All test reports at <https://builds.apache.org/job/Geode-nightly/ws/build/reports/combined>
:extensions/geode-modules:precheckin
:extensions/geode-modules-assembly:precheckin
:extensions/geode-modules-hibernate:precheckin
:extensions/geode-modules-session:precheckin
:extensions/geode-modules-session-internal:precheckin
:extensions/geode-modules-tomcat7:precheckin
:geode-assembly:precheckin
:geode-common:precheckin
:geode-cq:precheckin
:geode-json:precheckin
:geode-junit:precheckin
:geode-lucene:precheckin
:geode-pulse:precheckin
:geode-rebalancer:precheckin
:geode-wan:precheckin
:geode-web:precheckin
:geode-web-api:precheckin
:extensions/geode-modules:uploadArchives
:extensions/geode-modules-assembly:uploadArchives SKIPPED
:extensions/geode-modules-hibernate:uploadArchives
:extensions/geode-modules-session:uploadArchives
:extensions/geode-modules-session-internal:uploadArchives
:extensions/geode-modules-tomcat7:uploadArchives
:geode-assembly:uploadArchives SKIPPED
:geode-common:uploadArchives
:geode-core:uploadArchives
:geode-cq:uploadArchives
:geode-json:uploadArchives
:geode-junit:uploadArchives
:geode-lucene:uploadArchives
:geode-pulse:uploadArchives
:geode-rebalancer:uploadArchives
:geode-wan:uploadArchives
:geode-web:uploadArchives
:geode-web-api:uploadArchives

FAILURE: Build completed with 2 failures.

1: Task failed with an exception.
-----------
* What went wrong:
Execution failed for task ':geode-core:flakyTest'.
> There were failing tests. See the report at: file://<https://builds.apache.org/job/Geode-nightly/ws/geode-core/build/reports/flakyTest/index.html>

* Try:
Run with --stacktrace option to get the stack trace. Run with --info or --debug option to get more log output.
==============================================================================

2: Task failed with an exception.
-----------
* What went wrong:
Execution failed for task ':geode-core:integrationTest'.
> There were failing tests. See the report at: file://<https://builds.apache.org/job/Geode-nightly/ws/geode-core/build/reports/integrationTest/index.html>

* Try:
Run with --stacktrace option to get the stack trace. Run with --info or --debug option to get more log output.
==============================================================================

BUILD FAILED

Total time: 10 hrs 33 mins 20.147 secs
Build step 'Invoke Gradle script' changed build result to FAILURE
Build step 'Invoke Gradle script' marked build as failure
Archiving artifacts
Compressed 251.37 MB of artifacts by 22.3% relative to #501
Recording test results