You are viewing a plain text version of this content. The canonical link for it is here.
Posted to dev@geode.apache.org by Apache Jenkins Server <je...@builds.apache.org> on 2017/10/23 11:48:43 UTC
Build failed in Jenkins: Geode-nightly #993
See <https://builds.apache.org/job/Geode-nightly/993/display/redirect?page=changes>
Changes:
[github] GEODE-3245: Flattening LuceneSerializer should support PDX values (#965)
------------------------------------------
[...truncated 23.00 MB...]
at io.netty.channel.AbstractChannelHandlerContext.fireChannelRead(AbstractChannelHandlerContext.java:350)
at io.netty.handler.logging.LoggingHandler.channelRead(LoggingHandler.java:233)
at io.netty.channel.AbstractChannelHandlerContext.invokeChannelRead(AbstractChannelHandlerContext.java:372)
at io.netty.channel.AbstractChannelHandlerContext.invokeChannelRead(AbstractChannelHandlerContext.java:358)
at io.netty.channel.AbstractChannelHandlerContext.fireChannelRead(AbstractChannelHandlerContext.java:350)
at io.netty.channel.CombinedChannelDuplexHandler$DelegatingChannelHandlerContext.fireChannelRead(CombinedChannelDuplexHandler.java:435)
at io.netty.handler.codec.ByteToMessageDecoder.fireChannelRead(ByteToMessageDecoder.java:293)
at io.netty.handler.codec.ByteToMessageDecoder.channelRead(ByteToMessageDecoder.java:267)
at io.netty.channel.CombinedChannelDuplexHandler.channelRead(CombinedChannelDuplexHandler.java:250)
at io.netty.channel.AbstractChannelHandlerContext.invokeChannelRead(AbstractChannelHandlerContext.java:372)
at io.netty.channel.AbstractChannelHandlerContext.invokeChannelRead(AbstractChannelHandlerContext.java:358)
at io.netty.channel.AbstractChannelHandlerContext.fireChannelRead(AbstractChannelHandlerContext.java:350)
at io.netty.channel.DefaultChannelPipeline$HeadContext.channelRead(DefaultChannelPipeline.java:1334)
at io.netty.channel.AbstractChannelHandlerContext.invokeChannelRead(AbstractChannelHandlerContext.java:372)
at io.netty.channel.AbstractChannelHandlerContext.invokeChannelRead(AbstractChannelHandlerContext.java:358)
at io.netty.channel.DefaultChannelPipeline.fireChannelRead(DefaultChannelPipeline.java:926)
at io.netty.channel.epoll.AbstractEpollStreamChannel$EpollStreamUnsafe.epollInReady(AbstractEpollStreamChannel.java:961)
at io.netty.channel.epoll.EpollDomainSocketChannel$EpollDomainUnsafe.epollInReady(EpollDomainSocketChannel.java:140)
at io.netty.channel.epoll.EpollEventLoop.processReady(EpollEventLoop.java:386)
at io.netty.channel.epoll.EpollEventLoop.run(EpollEventLoop.java:302)
at io.netty.util.concurrent.SingleThreadEventExecutor$5.run(SingleThreadEventExecutor.java:877)
at io.netty.util.concurrent.DefaultThreadFactory$DefaultRunnableDecorator.run(DefaultThreadFactory.java:144)
at java.lang.Thread.run(Thread.java:748)
at io.netty.channel.DefaultChannelPipeline.fireChannelRead(DefaultChannelPipeline.java:926)
at io.netty.channel.epoll.AbstractEpollStreamChannel$EpollStreamUnsafe.epollInReady(AbstractEpollStreamChannel.java:961)
at io.netty.channel.epoll.EpollDomainSocketChannel$EpollDomainUnsafe.epollInReady(EpollDomainSocketChannel.java:140)
at io.netty.channel.epoll.EpollEventLoop.processReady(EpollEventLoop.java:386)
at io.netty.channel.epoll.EpollEventLoop.run(EpollEventLoop.java:302)
at io.netty.util.concurrent.SingleThreadEventExecutor$5.run(SingleThreadEventExecutor.java:877)
at io.netty.util.concurrent.DefaultThreadFactory$DefaultRunnableDecorator.run(DefaultThreadFactory.java:144)
at java.lang.Thread.run(Thread.java:748)
com.github.dockerjava.api.exception.NotFoundException: {"message":"No such image: apachegeode/geode-build:latest"}
at com.github.dockerjava.netty.handler.HttpResponseHandler.channelRead0(HttpResponseHandler.java:103)
at com.github.dockerjava.netty.handler.HttpResponseHandler.channelRead0(HttpResponseHandler.java:33)
at io.netty.channel.SimpleChannelInboundHandler.channelRead(SimpleChannelInboundHandler.java:105)
at io.netty.channel.AbstractChannelHandlerContext.invokeChannelRead(AbstractChannelHandlerContext.java:372)
at io.netty.channel.AbstractChannelHandlerContext.invokeChannelRead(AbstractChannelHandlerContext.java:358)
at io.netty.channel.AbstractChannelHandlerContext.fireChannelRead(AbstractChannelHandlerContext.java:350)
at io.netty.handler.logging.LoggingHandler.channelRead(LoggingHandler.java:233)
at io.netty.channel.AbstractChannelHandlerContext.invokeChannelRead(AbstractChannelHandlerContext.java:372)
at io.netty.channel.AbstractChannelHandlerContext.invokeChannelRead(AbstractChannelHandlerContext.java:358)
at io.netty.channel.AbstractChannelHandlerContext.fireChannelRead(AbstractChannelHandlerContext.java:350)
at io.netty.channel.CombinedChannelDuplexHandler$DelegatingChannelHandlerContext.fireChannelRead(CombinedChannelDuplexHandler.java:435)
at io.netty.handler.codec.ByteToMessageDecoder.fireChannelRead(ByteToMessageDecoder.java:293)
at io.netty.handler.codec.ByteToMessageDecoder.channelRead(ByteToMessageDecoder.java:267)
at io.netty.channel.CombinedChannelDuplexHandler.channelRead(CombinedChannelDuplexHandler.java:250)
at io.netty.channel.AbstractChannelHandlerContext.invokeChannelRead(AbstractChannelHandlerContext.java:372)
at io.netty.channel.AbstractChannelHandlerContext.invokeChannelRead(AbstractChannelHandlerContext.java:358)
at io.netty.channel.AbstractChannelHandlerContext.fireChannelRead(AbstractChannelHandlerContext.java:350)
at io.netty.channel.DefaultChannelPipeline$HeadContext.channelRead(DefaultChannelPipeline.java:1334)
at io.netty.channel.AbstractChannelHandlerContext.invokeChannelRead(AbstractChannelHandlerContext.java:372)
at io.netty.channel.AbstractChannelHandlerContext.invokeChannelRead(AbstractChannelHandlerContext.java:358)
at io.netty.channel.DefaultChannelPipeline.fireChannelRead(DefaultChannelPipeline.java:926)
at io.netty.channel.epoll.AbstractEpollStreamChannel$EpollStreamUnsafe.epollInReady(AbstractEpollStreamChannel.java:961)
at io.netty.channel.epoll.EpollDomainSocketChannel$EpollDomainUnsafe.epollInReady(EpollDomainSocketChannel.java:140)
at io.netty.channel.epoll.EpollEventLoop.processReady(EpollEventLoop.java:386)
at io.netty.channel.epoll.EpollEventLoop.run(EpollEventLoop.java:302)
at io.netty.util.concurrent.SingleThreadEventExecutor$5.run(SingleThreadEventExecutor.java:877)
at io.netty.util.concurrent.DefaultThreadFactory$DefaultRunnableDecorator.run(DefaultThreadFactory.java:144)
at java.lang.Thread.run(Thread.java:748)
Could not stop org.gradle.internal.actor.internal.DefaultActorFactory$NonBlockingActor@538a34b7.
org.gradle.internal.dispatch.DispatchException: Could not dispatch message [MethodInvocation method: processTestClass(org.gradle.api.internal.tasks.testing.DefaultTestClassRunInfo@67f619d3)].
at org.gradle.internal.dispatch.ExceptionTrackingFailureHandler.dispatchFailed(ExceptionTrackingFailureHandler.java:34)
at org.gradle.internal.dispatch.FailureHandlingDispatch.dispatch(FailureHandlingDispatch.java:31)
at org.gradle.internal.dispatch.AsyncDispatch.dispatchMessages(AsyncDispatch.java:132)
at org.gradle.internal.dispatch.AsyncDispatch.access$000(AsyncDispatch.java:33)
at org.gradle.internal.dispatch.AsyncDispatch$1.run(AsyncDispatch.java:72)
at org.gradle.internal.concurrent.ExecutorPolicy$CatchAndRecordFailures.onExecute(ExecutorPolicy.java:63)
at org.gradle.internal.concurrent.StoppableExecutorImpl$1.run(StoppableExecutorImpl.java:46)
at java.util.concurrent.ThreadPoolExecutor.runWorker(ThreadPoolExecutor.java:1149)
at java.util.concurrent.ThreadPoolExecutor$Worker.run(ThreadPoolExecutor.java:624)
at java.lang.Thread.run(Thread.java:748)
Caused by: java.lang.IllegalStateException: Cannot abort process 'Gradle Test Executor 5946' because it is not in started or detached state
at com.pedjak.gradle.plugins.dockerizedtest.DockerizedExecHandle.abort(DockerizedExecHandle.java:334)
at org.gradle.process.internal.ExecHandle$abort$4.call(Unknown Source)
at com.pedjak.gradle.plugins.dockerizedtest.ExitCodeTolerantExecHandle.abort(ExitCodeTolerantExecHandle.groovy:33)
at org.gradle.process.internal.worker.DefaultWorkerProcess.cleanup(DefaultWorkerProcess.java:198)
at org.gradle.process.internal.worker.DefaultWorkerProcess.start(DefaultWorkerProcess.java:145)
at org.gradle.process.internal.worker.DefaultWorkerProcessBuilder$MemoryRequestingWorkerProcess.start(DefaultWorkerProcessBuilder.java:218)
at com.pedjak.gradle.plugins.dockerizedtest.ForkingTestClassProcessor.forkProcess(ForkingTestClassProcessor.java:80)
at com.pedjak.gradle.plugins.dockerizedtest.ForkingTestClassProcessor.processTestClass(ForkingTestClassProcessor.java:56)
at org.gradle.api.internal.tasks.testing.processors.RestartEveryNTestClassProcessor.processTestClass(RestartEveryNTestClassProcessor.java:47)
at sun.reflect.GeneratedMethodAccessor585.invoke(Unknown Source)
at sun.reflect.DelegatingMethodAccessorImpl.invoke(DelegatingMethodAccessorImpl.java:43)
at java.lang.reflect.Method.invoke(Method.java:498)
at org.gradle.internal.dispatch.ReflectionDispatch.dispatch(ReflectionDispatch.java:35)
at org.gradle.internal.dispatch.ReflectionDispatch.dispatch(ReflectionDispatch.java:24)
at org.gradle.internal.dispatch.FailureHandlingDispatch.dispatch(FailureHandlingDispatch.java:29)
... 8 more
FAILED
:geode-web-api:integrationTest
:combineReports
All test reports at <https://builds.apache.org/job/Geode-nightly/ws/build/reports/combined>
:extensions/geode-modules:precheckin
:extensions/geode-modules-assembly:precheckin
:extensions/geode-modules-session:precheckin
:extensions/geode-modules-session-internal:precheckin
:extensions/geode-modules-tomcat7:precheckin
:extensions/geode-modules-tomcat8:precheckin
:extensions/session-testing-war:precheckin
:geode-assembly:precheckin
:geode-benchmarks:precheckin
:geode-common:precheckin
:geode-concurrency-test:precheckin
:geode-core:precheckin
:geode-json:precheckin
:geode-old-versions:precheckin
:compileJava NO-SOURCE
:processResources NO-SOURCE
:classes UP-TO-DATE
:jar
:uploadArchives
:extensions/geode-modules:uploadArchives SKIPPED
:extensions/geode-modules-assembly:uploadArchives
:extensions/geode-modules-session:uploadArchives SKIPPED
:extensions/geode-modules-session-internal:uploadArchives SKIPPED
:extensions/geode-modules-tomcat7:uploadArchives SKIPPED
:extensions/geode-modules-tomcat8:uploadArchives SKIPPED
:extensions/session-testing-war:uploadArchives SKIPPED
:geode-assembly:uploadArchives
:geode-benchmarks:uploadArchives SKIPPED
:geode-common:uploadArchives
:geode-concurrency-test:uploadArchives
:geode-core:uploadArchives
:geode-cq:uploadArchives
:geode-json:uploadArchives
:geode-junit:uploadArchives
:geode-lucene:uploadArchives
:geode-old-client-support:uploadArchives
:geode-old-versions:uploadArchives SKIPPED
:geode-protobuf:uploadArchives
:geode-pulse:uploadArchives
:geode-rebalancer:uploadArchives
:geode-wan:uploadArchives
:geode-web:uploadArchives
:geode-web-api:uploadArchives
FAILURE: Build completed with 10 failures.
1: Task failed with an exception.
-----------
* What went wrong:
Execution failed for task ':geode-cq:distributedTest'.
> Cannot abort process 'Gradle Test Executor 1749' because it is not in started or detached state
* Try:
Run with --stacktrace option to get the stack trace. Run with --info or --debug option to get more log output.
==============================================================================
2: Task failed with an exception.
-----------
* What went wrong:
Execution failed for task ':geode-junit:distributedTest'.
> Cannot abort process 'Gradle Test Executor 2465' because it is not in started or detached state
* Try:
Run with --stacktrace option to get the stack trace. Run with --info or --debug option to get more log output.
==============================================================================
3: Task failed with an exception.
-----------
* What went wrong:
Execution failed for task ':geode-lucene:distributedTest'.
> Cannot abort process 'Gradle Test Executor 3522' because it is not in started or detached state
* Try:
Run with --stacktrace option to get the stack trace. Run with --info or --debug option to get more log output.
==============================================================================
4: Task failed with an exception.
-----------
* What went wrong:
Execution failed for task ':geode-old-client-support:distributedTest'.
> Cannot abort process 'Gradle Test Executor 4307' because it is not in started or detached state
* Try:
Run with --stacktrace option to get the stack trace. Run with --info or --debug option to get more log output.
==============================================================================
5: Task failed with an exception.
-----------
* What went wrong:
Execution failed for task ':geode-protobuf:distributedTest'.
> Cannot abort process 'Gradle Test Executor 4330' because it is not in started or detached state
* Try:
Run with --stacktrace option to get the stack trace. Run with --info or --debug option to get more log output.
==============================================================================
6: Task failed with an exception.
-----------
* What went wrong:
Execution failed for task ':geode-pulse:distributedTest'.
> Cannot abort process 'Gradle Test Executor 4597' because it is not in started or detached state
* Try:
Run with --stacktrace option to get the stack trace. Run with --info or --debug option to get more log output.
==============================================================================
7: Task failed with an exception.
-----------
* What went wrong:
Execution failed for task ':geode-rebalancer:distributedTest'.
> Cannot abort process 'Gradle Test Executor 4707' because it is not in started or detached state
* Try:
Run with --stacktrace option to get the stack trace. Run with --info or --debug option to get more log output.
==============================================================================
8: Task failed with an exception.
-----------
* What went wrong:
Execution failed for task ':geode-wan:distributedTest'.
> Cannot abort process 'Gradle Test Executor 4732' because it is not in started or detached state
* Try:
Run with --stacktrace option to get the stack trace. Run with --info or --debug option to get more log output.
==============================================================================
9: Task failed with an exception.
-----------
* What went wrong:
Execution failed for task ':geode-web:distributedTest'.
> Cannot abort process 'Gradle Test Executor 5670' because it is not in started or detached state
* Try:
Run with --stacktrace option to get the stack trace. Run with --info or --debug option to get more log output.
==============================================================================
10: Task failed with an exception.
-----------
* What went wrong:
Execution failed for task ':geode-web-api:distributedTest'.
> Cannot abort process 'Gradle Test Executor 5947' because it is not in started or detached state
* Try:
Run with --stacktrace option to get the stack trace. Run with --info or --debug option to get more log output.
==============================================================================
BUILD FAILED
Total time: 8 hrs 1 mins 19.855 secs
Build step 'Invoke Gradle script' changed build result to FAILURE
Build step 'Invoke Gradle script' marked build as failure
Archiving artifacts
[Fast Archiver] Compressed 335.65 MB of artifacts by 45.0% relative to #992
Recording test results
Not sending mail to unregistered user github@nakomis.com
Jenkins build is back to normal : Geode-nightly #996
Posted by Apache Jenkins Server <je...@builds.apache.org>.
See <https://builds.apache.org/job/Geode-nightly/996/display/redirect?page=changes>
Build failed in Jenkins: Geode-nightly #995
Posted by Apache Jenkins Server <je...@builds.apache.org>.
See <https://builds.apache.org/job/Geode-nightly/995/display/redirect?page=changes>
Changes:
[github] GEODE-1897: Initial refactor of CreateRegionCommand (#956)
[github] GEODE-3801: Use hardlinks for backup oplog files (#963)
[github] GEODE-3815: Changed to remove the conflation index only if its for the
[kohlmu-pivotal] GEODE-3705: Refactor code to process authentication message as per
[github] Feature/geode 3897 (#968)
[jdeppe] GEODE-3880: Fix typo in Javadoc (#960)
[kohlmu-pivotal] GEODE-3705: Reverting changes made to AcceptorImpl.java
------------------------------------------
[...truncated 197.26 KB...]
:geode-old-versions:distributedTest NO-SOURCE
:geode-old-versions:integrationTest NO-SOURCE
:geode-protobuf:assemble
:geode-protobuf:extractIncludeTestProto
Download https://repo1.maven.org/maven2/org/powermock/powermock-api-mockito/1.7.1/powermock-api-mockito-1.7.1.pom
Download https://repo1.maven.org/maven2/org/powermock/powermock-api-mockito/1.7.1/powermock-api-mockito-1.7.1.jar
:geode-protobuf:extractTestProto
:geode-protobuf:generateTestProto NO-SOURCE
:geode-protobuf:compileTestJavaNote: Some input files use or override a deprecated API.
Note: Recompile with -Xlint:deprecation for details.
Note: Some input files use unchecked or unsafe operations.
Note: Recompile with -Xlint:unchecked for details.
:geode-protobuf:processTestResources
:geode-protobuf:testClasses
:geode-protobuf:checkMissedTests
:geode-protobuf:spotlessJavaCheck
:geode-protobuf:spotlessCheck
:geode-protobuf:test
:geode-protobuf:check
:geode-protobuf:build
:geode-protobuf:distributedTest
:geode-protobuf:integrationTest
:geode-pulse:assemble
:geode-pulse:compileTestJava
Download https://repo1.maven.org/maven2/com/codeborne/phantomjsdriver/1.3.0/phantomjsdriver-1.3.0.pom
Download https://repo1.maven.org/maven2/com/codeborne/phantomjsdriver/1.3.0/phantomjsdriver-1.3.0.jar
Download https://repo1.maven.org/maven2/org/seleniumhq/selenium/selenium-api/3.0.1/selenium-api-3.0.1.jar
Download https://repo1.maven.org/maven2/org/seleniumhq/selenium/selenium-remote-driver/3.0.1/selenium-remote-driver-3.0.1.jar
Download https://repo1.maven.org/maven2/org/seleniumhq/selenium/selenium-support/3.0.1/selenium-support-3.0.1.jar
Note: Some input files use or override a deprecated API.
Note: Recompile with -Xlint:deprecation for details.
Note: <https://builds.apache.org/job/Geode-nightly/ws/geode-pulse/src/test/java/org/apache/geode/tools/pulse/controllers/PulseControllerJUnitTest.java> uses unchecked or unsafe operations.
Note: Recompile with -Xlint:unchecked for details.
:geode-pulse:processTestResources
:geode-pulse:testClasses
:geode-pulse:checkMissedTests
:geode-pulse:spotlessJavaCheck
:geode-pulse:spotlessCheck
:geode-pulse:test
:geode-pulse:check
:geode-pulse:build
:geode-pulse:distributedTest
:geode-pulse:integrationTest
:geode-rebalancer:assemble
:geode-rebalancer:compileTestJava
:geode-rebalancer:processTestResources NO-SOURCE
:geode-rebalancer:testClasses
:geode-rebalancer:checkMissedTests
:geode-rebalancer:spotlessJavaCheck
:geode-rebalancer:spotlessCheck
:geode-rebalancer:test
:geode-rebalancer:check
:geode-rebalancer:build
:geode-rebalancer:distributedTest
:geode-rebalancer:integrationTest
:geode-wan:assemble
:geode-wan:compileTestJavaNote: Some input files use or override a deprecated API.
Note: Recompile with -Xlint:deprecation for details.
Note: Some input files use unchecked or unsafe operations.
Note: Recompile with -Xlint:unchecked for details.
:geode-wan:processTestResources
:geode-wan:testClasses
:geode-wan:checkMissedTests
:geode-wan:spotlessJavaCheck
:geode-wan:spotlessCheck
:geode-wan:test
:geode-wan:check
:geode-wan:build
:geode-wan:distributedTest
org.apache.geode.internal.cache.wan.misc.NewWanAuthenticationDUnitTest > testWanAuthValidCredentials FAILED
org.apache.geode.test.dunit.RMIException: While invoking org.apache.geode.internal.cache.wan.misc.NewWanAuthenticationDUnitTest$$Lambda$73/735044920.run in VM 2 running on Host 7c4d06bbbc13 with 8 VMs
at org.apache.geode.test.dunit.VM.invoke(VM.java:393)
at org.apache.geode.test.dunit.VM.invoke(VM.java:363)
at org.apache.geode.test.dunit.VM.invoke(VM.java:308)
at org.apache.geode.internal.cache.wan.misc.NewWanAuthenticationDUnitTest.testWanAuthValidCredentials(NewWanAuthenticationDUnitTest.java:113)
Caused by:
org.apache.geode.internal.cache.wan.GatewaySenderException: Could not start a gateway sender ln because of exception org.apache.geode.security.AuthenticationFailedException: DummyAuthenticator: Invalid user name [invalid1], password supplied., caused by org.apache.geode.security.AuthenticationFailedException: DummyAuthenticator: Invalid user name [invalid1], password supplied.
at org.apache.geode.internal.cache.wan.AbstractGatewaySender.waitForRunningStatus(AbstractGatewaySender.java:752)
at org.apache.geode.internal.cache.wan.serial.SerialGatewaySenderImpl.start(SerialGatewaySenderImpl.java:90)
at org.apache.geode.internal.cache.wan.WANTestBase.startSender(WANTestBase.java:1118)
at org.apache.geode.internal.cache.wan.misc.NewWanAuthenticationDUnitTest.lambda$testWanAuthValidCredentials$bb17a952$4(NewWanAuthenticationDUnitTest.java:113)
Caused by:
org.apache.geode.security.AuthenticationFailedException: DummyAuthenticator: Invalid user name [invalid1], password supplied.
org.apache.geode.internal.cache.wan.misc.NewWanAuthenticationDUnitTest > testWanAuthValidCredentialsWithServer FAILED
org.apache.geode.test.dunit.RMIException: While invoking org.apache.geode.internal.cache.wan.misc.NewWanAuthenticationDUnitTest$$Lambda$98/282340316.run in VM 2 running on Host 7c4d06bbbc13 with 8 VMs
at org.apache.geode.test.dunit.VM.invoke(VM.java:393)
at org.apache.geode.test.dunit.VM.invoke(VM.java:363)
at org.apache.geode.test.dunit.VM.invoke(VM.java:308)
at org.apache.geode.internal.cache.wan.misc.NewWanAuthenticationDUnitTest.testWanAuthValidCredentialsWithServer(NewWanAuthenticationDUnitTest.java:411)
Caused by:
org.apache.geode.internal.cache.wan.GatewaySenderException: Could not start a gateway sender ln because of exception org.apache.geode.security.AuthenticationFailedException: DummyAuthenticator: Invalid user name [invalid2], password supplied., caused by org.apache.geode.security.AuthenticationFailedException: DummyAuthenticator: Invalid user name [invalid2], password supplied.
at org.apache.geode.internal.cache.wan.AbstractGatewaySender.waitForRunningStatus(AbstractGatewaySender.java:752)
at org.apache.geode.internal.cache.wan.serial.SerialGatewaySenderImpl.start(SerialGatewaySenderImpl.java:90)
at org.apache.geode.internal.cache.wan.WANTestBase.startSender(WANTestBase.java:1118)
at org.apache.geode.internal.cache.wan.misc.NewWanAuthenticationDUnitTest.lambda$testWanAuthValidCredentialsWithServer$bb17a952$2(NewWanAuthenticationDUnitTest.java:411)
Caused by:
org.apache.geode.security.AuthenticationFailedException: DummyAuthenticator: Invalid user name [invalid2], password supplied.
java.lang.AssertionError: Suspicious strings were written to the log during this run.
Fix the strings or use IgnoredException.addIgnoredException to ignore.
-----------------------------------------------------------------------
Found suspect string in log4j at line 1401
[fatal 2017/10/25 13:42:50.829 UTC <Event Processor for GatewaySender_ln> tid=557] Message dispatch failed due to unexpected exception..
org.apache.geode.internal.cache.wan.GatewaySenderException: org.apache.geode.security.AuthenticationFailedException: DummyAuthenticator: Invalid user name [invalid2], password supplied., caused by org.apache.geode.security.AuthenticationFailedException: DummyAuthenticator: Invalid user name [invalid2], password supplied.
at org.apache.geode.internal.cache.wan.GatewaySenderEventRemoteDispatcher.initializeConnection(GatewaySenderEventRemoteDispatcher.java:432)
at org.apache.geode.internal.cache.wan.GatewaySenderEventRemoteDispatcher.<init>(GatewaySenderEventRemoteDispatcher.java:75)
at org.apache.geode.internal.cache.wan.serial.RemoteSerialGatewaySenderEventProcessor.initializeEventDispatcher(RemoteSerialGatewaySenderEventProcessor.java:41)
at org.apache.geode.internal.cache.wan.AbstractGatewaySenderEventProcessor.setRunningStatus(AbstractGatewaySenderEventProcessor.java:1078)
at org.apache.geode.internal.cache.wan.serial.SerialGatewaySenderEventProcessor.run(SerialGatewaySenderEventProcessor.java:196)
Caused by: org.apache.geode.security.AuthenticationFailedException: DummyAuthenticator: Invalid user name [invalid2], password supplied.
at org.apache.geode.security.templates.DummyAuthenticator.authenticate(DummyAuthenticator.java:65)
at org.apache.geode.internal.cache.tier.sockets.HandShake.verifyCredentials(HandShake.java:1691)
at org.apache.geode.internal.cache.tier.sockets.HandShake.checkIfAuthenticWanSite(HandShake.java:1738)
at org.apache.geode.internal.cache.tier.sockets.HandShake.readMessage(HandShake.java:1401)
at org.apache.geode.internal.cache.tier.sockets.HandShake.handshakeWithServer(HandShake.java:1253)
at org.apache.geode.cache.client.internal.ConnectionImpl.connect(ConnectionImpl.java:118)
at org.apache.geode.cache.client.internal.ConnectionFactoryImpl.createClientToServerConnection(ConnectionFactoryImpl.java:136)
at org.apache.geode.cache.client.internal.ConnectionFactoryImpl.createClientToServerConnection(ConnectionFactoryImpl.java:259)
at org.apache.geode.cache.client.internal.pooling.ConnectionManagerImpl.borrowConnection(ConnectionManagerImpl.java:206)
at org.apache.geode.cache.client.internal.PoolImpl.acquireConnection(PoolImpl.java:902)
at org.apache.geode.internal.cache.wan.GatewaySenderEventRemoteDispatcher.initializeConnection(GatewaySenderEventRemoteDispatcher.java:405)
... 4 more
625 tests completed, 2 failed, 59 skipped
:geode-wan:distributedTest FAILED
:geode-wan:integrationTest
:geode-web:assemble
:geode-web:compileTestJavaNote: Some input files use or override a deprecated API.
Note: Recompile with -Xlint:deprecation for details.
:geode-web:processTestResources NO-SOURCE
:geode-web:testClasses
:geode-web:checkMissedTests
:geode-web:spotlessJavaCheck
:geode-web:spotlessCheck
:geode-web:test
:geode-web:check
:geode-web:build
:geode-web:distributedTest
:geode-web:integrationTest
:geode-web-api:assemble
:geode-web-api:compileTestJava
:geode-web-api:processTestResources NO-SOURCE
:geode-web-api:testClasses
:geode-web-api:checkMissedTests
:geode-web-api:spotlessJavaCheck
:geode-web-api:spotlessCheck
:geode-web-api:test
:geode-web-api:check
:geode-web-api:build
:geode-web-api:distributedTest
:geode-web-api:integrationTest
:combineReports
All test reports at <https://builds.apache.org/job/Geode-nightly/ws/build/reports/combined>
:extensions/geode-modules:precheckin
:extensions/geode-modules-assembly:precheckin
:extensions/geode-modules-session:precheckin
:extensions/geode-modules-session-internal:precheckin
:extensions/geode-modules-tomcat7:precheckin
:extensions/geode-modules-tomcat8:precheckin
:extensions/session-testing-war:precheckin
:geode-assembly:precheckin
:geode-benchmarks:precheckin
:geode-common:precheckin
:geode-concurrency-test:precheckin
:geode-cq:precheckin
:geode-json:precheckin
:geode-junit:precheckin
:geode-lucene:precheckin
:geode-old-client-support:precheckin
:geode-old-versions:precheckin
:geode-protobuf:precheckin
:geode-pulse:precheckin
:geode-rebalancer:precheckin
:geode-web:precheckin
:geode-web-api:precheckin
:compileJava NO-SOURCE
:processResources NO-SOURCE
:classes UP-TO-DATE
:jar
:uploadArchives
:extensions/geode-modules:uploadArchives SKIPPED
:extensions/geode-modules-assembly:uploadArchives
:extensions/geode-modules-session:uploadArchives SKIPPED
:extensions/geode-modules-session-internal:uploadArchives SKIPPED
:extensions/geode-modules-tomcat7:uploadArchives SKIPPED
:extensions/geode-modules-tomcat8:uploadArchives SKIPPED
:extensions/session-testing-war:uploadArchives SKIPPED
:geode-assembly:uploadArchives
:geode-benchmarks:uploadArchives SKIPPED
:geode-common:uploadArchives
:geode-concurrency-test:uploadArchives
:geode-core:uploadArchives
:geode-cq:uploadArchives
:geode-json:uploadArchives
:geode-junit:uploadArchives
:geode-lucene:uploadArchives
:geode-old-client-support:uploadArchives
:geode-old-versions:uploadArchives SKIPPED
:geode-protobuf:uploadArchives
:geode-pulse:uploadArchives
:geode-rebalancer:uploadArchives
:geode-wan:uploadArchives
:geode-web:uploadArchives
:geode-web-api:uploadArchives
FAILURE: Build completed with 2 failures.
1: Task failed with an exception.
-----------
* What went wrong:
Execution failed for task ':geode-core:distributedTest'.
> There were failing tests. See the report at: file://<https://builds.apache.org/job/Geode-nightly/ws/geode-core/build/reports/distributedTest/index.html>
* Try:
Run with --stacktrace option to get the stack trace. Run with --info or --debug option to get more log output.
==============================================================================
2: Task failed with an exception.
-----------
* What went wrong:
Execution failed for task ':geode-wan:distributedTest'.
> There were failing tests. See the report at: file://<https://builds.apache.org/job/Geode-nightly/ws/geode-wan/build/reports/distributedTest/index.html>
* Try:
Run with --stacktrace option to get the stack trace. Run with --info or --debug option to get more log output.
==============================================================================
BUILD FAILED
Total time: 11 hrs 5 mins 40.723 secs
Build step 'Invoke Gradle script' changed build result to FAILURE
Build step 'Invoke Gradle script' marked build as failure
Archiving artifacts
[Fast Archiver] Compressed 336.26 MB of artifacts by 36.7% relative to #992
Recording test results
Not sending mail to unregistered user github@nakomis.com
Not sending mail to unregistered user nabarunnag@users.noreply.github.com
Not sending mail to unregistered user kohlmu-pivotal@users.noreply.github.com
Not sending mail to unregistered user jdeppe@gopivotal.com
Build failed in Jenkins: Geode-nightly #994
Posted by Apache Jenkins Server <je...@builds.apache.org>.
See <https://builds.apache.org/job/Geode-nightly/994/display/redirect?page=changes>
Changes:
[github] GEODE-1897: refactor GfshParseResult for easy access of converted opt…
[github] GEODE-3885: Fix backup from AdminDistributedSystem (#964)
[nabarunnag] GEODE-1319: Awaitility clause added.
[nabarunnag] GEODE-1036: Refactored InitializeIndexEntryDestroyQueryDUnitTest
[nabarunnag] GEODE-3520: Additional tests for corrupt index
[dbarnes] User Guide: Data Storage corrections
[github] GEODE-3764: prevent early idle expiration (#940)
[kohlmu-pivotal] GEODE-3861: Marking test as Flaky
------------------------------------------
[...truncated 23.00 MB...]
at com.github.dockerjava.netty.handler.HttpResponseHandler.channelRead0(HttpResponseHandler.java:103)
at com.github.dockerjava.netty.handler.HttpResponseHandler.channelRead0(HttpResponseHandler.java:33)
at io.netty.channel.SimpleChannelInboundHandler.channelRead(SimpleChannelInboundHandler.java:105)
at io.netty.channel.AbstractChannelHandlerContext.invokeChannelRead(AbstractChannelHandlerContext.java:372)
at io.netty.channel.AbstractChannelHandlerContext.invokeChannelRead(AbstractChannelHandlerContext.java:358)
at io.netty.channel.AbstractChannelHandlerContext.fireChannelRead(AbstractChannelHandlerContext.java:350)
at io.netty.handler.logging.LoggingHandler.channelRead(LoggingHandler.java:233)
at io.netty.channel.AbstractChannelHandlerContext.invokeChannelRead(AbstractChannelHandlerContext.java:372)
at io.netty.channel.AbstractChannelHandlerContext.invokeChannelRead(AbstractChannelHandlerContext.java:358)
at io.netty.channel.AbstractChannelHandlerContext.fireChannelRead(AbstractChannelHandlerContext.java:350)
at io.netty.channel.CombinedChannelDuplexHandler$DelegatingChannelHandlerContext.fireChannelRead(CombinedChannelDuplexHandler.java:435)
at io.netty.handler.codec.ByteToMessageDecoder.fireChannelRead(ByteToMessageDecoder.java:293)
at io.netty.handler.codec.ByteToMessageDecoder.channelRead(ByteToMessageDecoder.java:267)
at io.netty.channel.CombinedChannelDuplexHandler.channelRead(CombinedChannelDuplexHandler.java:250)
at io.netty.channel.AbstractChannelHandlerContext.invokeChannelRead(AbstractChannelHandlerContext.java:372)
at io.netty.channel.AbstractChannelHandlerContext.invokeChannelRead(AbstractChannelHandlerContext.java:358)
at io.netty.channel.AbstractChannelHandlerContext.fireChannelRead(AbstractChannelHandlerContext.java:350)
at io.netty.channel.DefaultChannelPipeline$HeadContext.channelRead(DefaultChannelPipeline.java:1334)
at io.netty.channel.AbstractChannelHandlerContext.invokeChannelRead(AbstractChannelHandlerContext.java:372)
at io.netty.channel.AbstractChannelHandlerContext.invokeChannelRead(AbstractChannelHandlerContext.java:358)
at io.netty.channel.DefaultChannelPipeline.fireChannelRead(DefaultChannelPipeline.java:926)
at io.netty.channel.epoll.AbstractEpollStreamChannel$EpollStreamUnsafe.epollInReady(AbstractEpollStreamChannel.java:961)
at io.netty.channel.epoll.EpollDomainSocketChannel$EpollDomainUnsafe.epollInReady(EpollDomainSocketChannel.java:140)
at io.netty.channel.epoll.EpollEventLoop.processReady(EpollEventLoop.java:386)
at io.netty.channel.epoll.EpollEventLoop.run(EpollEventLoop.java:302)
at io.netty.util.concurrent.SingleThreadEventExecutor$5.run(SingleThreadEventExecutor.java:877)
at io.netty.util.concurrent.DefaultThreadFactory$DefaultRunnableDecorator.run(DefaultThreadFactory.java:144)
at java.lang.Thread.run(Thread.java:748)
com.github.dockerjava.api.exception.NotFoundException: {"message":"No such image: apachegeode/geode-build:latest"}
at com.github.dockerjava.netty.handler.HttpResponseHandler.channelRead0(HttpResponseHandler.java:103)
at com.github.dockerjava.netty.handler.HttpResponseHandler.channelRead0(HttpResponseHandler.java:33)
at io.netty.channel.SimpleChannelInboundHandler.channelRead(SimpleChannelInboundHandler.java:105)
at io.netty.channel.AbstractChannelHandlerContext.invokeChannelRead(AbstractChannelHandlerContext.java:372)
at io.netty.channel.AbstractChannelHandlerContext.invokeChannelRead(AbstractChannelHandlerContext.java:358)
at io.netty.channel.AbstractChannelHandlerContext.fireChannelRead(AbstractChannelHandlerContext.java:350)
at io.netty.handler.logging.LoggingHandler.channelRead(LoggingHandler.java:233)
at io.netty.channel.AbstractChannelHandlerContext.invokeChannelRead(AbstractChannelHandlerContext.java:372)
at io.netty.channel.AbstractChannelHandlerContext.invokeChannelRead(AbstractChannelHandlerContext.java:358)
at io.netty.channel.AbstractChannelHandlerContext.fireChannelRead(AbstractChannelHandlerContext.java:350)
at io.netty.channel.CombinedChannelDuplexHandler$DelegatingChannelHandlerContext.fireChannelRead(CombinedChannelDuplexHandler.java:435)
at io.netty.handler.codec.ByteToMessageDecoder.fireChannelRead(ByteToMessageDecoder.java:293)
at io.netty.handler.codec.ByteToMessageDecoder.channelRead(ByteToMessageDecoder.java:267)
at io.netty.channel.CombinedChannelDuplexHandler.channelRead(CombinedChannelDuplexHandler.java:250)
at io.netty.channel.AbstractChannelHandlerContext.invokeChannelRead(AbstractChannelHandlerContext.java:372)
at io.netty.channel.AbstractChannelHandlerContext.invokeChannelRead(AbstractChannelHandlerContext.java:358)
at io.netty.channel.AbstractChannelHandlerContext.fireChannelRead(AbstractChannelHandlerContext.java:350)
at io.netty.channel.DefaultChannelPipeline$HeadContext.channelRead(DefaultChannelPipeline.java:1334)
at io.netty.channel.AbstractChannelHandlerContext.invokeChannelRead(AbstractChannelHandlerContext.java:372)
at io.netty.channel.AbstractChannelHandlerContext.invokeChannelRead(AbstractChannelHandlerContext.java:358)
at io.netty.channel.DefaultChannelPipeline.fireChannelRead(DefaultChannelPipeline.java:926)
at io.netty.channel.epoll.AbstractEpollStreamChannel$EpollStreamUnsafe.epollInReady(AbstractEpollStreamChannel.java:961)
at io.netty.channel.epoll.EpollDomainSocketChannel$EpollDomainUnsafe.epollInReady(EpollDomainSocketChannel.java:140)
at io.netty.channel.epoll.EpollEventLoop.processReady(EpollEventLoop.java:386)
at io.netty.channel.epoll.EpollEventLoop.run(EpollEventLoop.java:302)
at io.netty.util.concurrent.SingleThreadEventExecutor$5.run(SingleThreadEventExecutor.java:877)
at io.netty.util.concurrent.DefaultThreadFactory$DefaultRunnableDecorator.run(DefaultThreadFactory.java:144)
at java.lang.Thread.run(Thread.java:748)
Could not stop org.gradle.internal.actor.internal.DefaultActorFactory$NonBlockingActor@3eac666a.
org.gradle.internal.dispatch.DispatchException: Could not dispatch message [MethodInvocation method: processTestClass(org.gradle.api.internal.tasks.testing.DefaultTestClassRunInfo@5603958c)].
at org.gradle.internal.dispatch.ExceptionTrackingFailureHandler.dispatchFailed(ExceptionTrackingFailureHandler.java:34)
at org.gradle.internal.dispatch.FailureHandlingDispatch.dispatch(FailureHandlingDispatch.java:31)
at org.gradle.internal.dispatch.AsyncDispatch.dispatchMessages(AsyncDispatch.java:132)
at org.gradle.internal.dispatch.AsyncDispatch.access$000(AsyncDispatch.java:33)
at org.gradle.internal.dispatch.AsyncDispatch$1.run(AsyncDispatch.java:72)
at org.gradle.internal.concurrent.ExecutorPolicy$CatchAndRecordFailures.onExecute(ExecutorPolicy.java:63)
at org.gradle.internal.concurrent.StoppableExecutorImpl$1.run(StoppableExecutorImpl.java:46)
at java.util.concurrent.ThreadPoolExecutor.runWorker(ThreadPoolExecutor.java:1149)
at java.util.concurrent.ThreadPoolExecutor$Worker.run(ThreadPoolExecutor.java:624)
at java.lang.Thread.run(Thread.java:748)
Caused by: java.lang.IllegalStateException: Cannot abort process 'Gradle Test Executor 5949' because it is not in started or detached state
at com.pedjak.gradle.plugins.dockerizedtest.DockerizedExecHandle.abort(DockerizedExecHandle.java:334)
at org.gradle.process.internal.ExecHandle$abort$4.call(Unknown Source)
at com.pedjak.gradle.plugins.dockerizedtest.ExitCodeTolerantExecHandle.abort(ExitCodeTolerantExecHandle.groovy:33)
at org.gradle.process.internal.worker.DefaultWorkerProcess.cleanup(DefaultWorkerProcess.java:198)
at org.gradle.process.internal.worker.DefaultWorkerProcess.start(DefaultWorkerProcess.java:145)
at org.gradle.process.internal.worker.DefaultWorkerProcessBuilder$MemoryRequestingWorkerProcess.start(DefaultWorkerProcessBuilder.java:218)
at com.pedjak.gradle.plugins.dockerizedtest.ForkingTestClassProcessor.forkProcess(ForkingTestClassProcessor.java:80)
at com.pedjak.gradle.plugins.dockerizedtest.ForkingTestClassProcessor.processTestClass(ForkingTestClassProcessor.java:56)
at org.gradle.api.internal.tasks.testing.processors.RestartEveryNTestClassProcessor.processTestClass(RestartEveryNTestClassProcessor.java:47)
at sun.reflect.GeneratedMethodAccessor582.invoke(Unknown Source)
at sun.reflect.DelegatingMethodAccessorImpl.invoke(DelegatingMethodAccessorImpl.java:43)
at java.lang.reflect.Method.invoke(Method.java:498)
at org.gradle.internal.dispatch.ReflectionDispatch.dispatch(ReflectionDispatch.java:35)
at org.gradle.internal.dispatch.ReflectionDispatch.dispatch(ReflectionDispatch.java:24)
at org.gradle.internal.dispatch.FailureHandlingDispatch.dispatch(FailureHandlingDispatch.java:29)
... 8 more
FAILED
:geode-web-api:integrationTest
:combineReports
All test reports at <https://builds.apache.org/job/Geode-nightly/ws/build/reports/combined>
:extensions/geode-modules:precheckin
:extensions/geode-modules-assembly:precheckin
:extensions/geode-modules-session:precheckin
:extensions/geode-modules-session-internal:precheckin
:extensions/geode-modules-tomcat7:precheckin
:extensions/geode-modules-tomcat8:precheckin
:extensions/session-testing-war:precheckin
:geode-assembly:precheckin
:geode-benchmarks:precheckin
:geode-common:precheckin
:geode-concurrency-test:precheckin
:geode-core:precheckin
:geode-json:precheckin
:geode-old-versions:precheckin
:compileJava NO-SOURCE
:processResources NO-SOURCE
:classes UP-TO-DATE
:jar
:uploadArchives
:extensions/geode-modules:uploadArchives SKIPPED
:extensions/geode-modules-assembly:uploadArchives
:extensions/geode-modules-session:uploadArchives SKIPPED
:extensions/geode-modules-session-internal:uploadArchives SKIPPED
:extensions/geode-modules-tomcat7:uploadArchives SKIPPED
:extensions/geode-modules-tomcat8:uploadArchives SKIPPED
:extensions/session-testing-war:uploadArchives SKIPPED
:geode-assembly:uploadArchives
:geode-benchmarks:uploadArchives SKIPPED
:geode-common:uploadArchives
:geode-concurrency-test:uploadArchives
:geode-core:uploadArchives
:geode-cq:uploadArchives
:geode-json:uploadArchives
:geode-junit:uploadArchives
:geode-lucene:uploadArchives
:geode-old-client-support:uploadArchives
:geode-old-versions:uploadArchives SKIPPED
:geode-protobuf:uploadArchives
:geode-pulse:uploadArchives
:geode-rebalancer:uploadArchives
:geode-wan:uploadArchives
:geode-web:uploadArchives
:geode-web-api:uploadArchives
FAILURE: Build completed with 10 failures.
1: Task failed with an exception.
-----------
* What went wrong:
Execution failed for task ':geode-cq:distributedTest'.
> Cannot abort process 'Gradle Test Executor 1741' because it is not in started or detached state
* Try:
Run with --stacktrace option to get the stack trace. Run with --info or --debug option to get more log output.
==============================================================================
2: Task failed with an exception.
-----------
* What went wrong:
Execution failed for task ':geode-junit:distributedTest'.
> Cannot abort process 'Gradle Test Executor 2467' because it is not in started or detached state
* Try:
Run with --stacktrace option to get the stack trace. Run with --info or --debug option to get more log output.
==============================================================================
3: Task failed with an exception.
-----------
* What went wrong:
Execution failed for task ':geode-lucene:distributedTest'.
> Cannot abort process 'Gradle Test Executor 3526' because it is not in started or detached state
* Try:
Run with --stacktrace option to get the stack trace. Run with --info or --debug option to get more log output.
==============================================================================
4: Task failed with an exception.
-----------
* What went wrong:
Execution failed for task ':geode-old-client-support:distributedTest'.
> Cannot abort process 'Gradle Test Executor 4307' because it is not in started or detached state
* Try:
Run with --stacktrace option to get the stack trace. Run with --info or --debug option to get more log output.
==============================================================================
5: Task failed with an exception.
-----------
* What went wrong:
Execution failed for task ':geode-protobuf:distributedTest'.
> Cannot abort process 'Gradle Test Executor 4332' because it is not in started or detached state
* Try:
Run with --stacktrace option to get the stack trace. Run with --info or --debug option to get more log output.
==============================================================================
6: Task failed with an exception.
-----------
* What went wrong:
Execution failed for task ':geode-pulse:distributedTest'.
> Cannot abort process 'Gradle Test Executor 4598' because it is not in started or detached state
* Try:
Run with --stacktrace option to get the stack trace. Run with --info or --debug option to get more log output.
==============================================================================
7: Task failed with an exception.
-----------
* What went wrong:
Execution failed for task ':geode-rebalancer:distributedTest'.
> Cannot abort process 'Gradle Test Executor 4711' because it is not in started or detached state
* Try:
Run with --stacktrace option to get the stack trace. Run with --info or --debug option to get more log output.
==============================================================================
8: Task failed with an exception.
-----------
* What went wrong:
Execution failed for task ':geode-wan:distributedTest'.
> Cannot abort process 'Gradle Test Executor 4734' because it is not in started or detached state
* Try:
Run with --stacktrace option to get the stack trace. Run with --info or --debug option to get more log output.
==============================================================================
9: Task failed with an exception.
-----------
* What went wrong:
Execution failed for task ':geode-web:distributedTest'.
> Cannot abort process 'Gradle Test Executor 5672' because it is not in started or detached state
* Try:
Run with --stacktrace option to get the stack trace. Run with --info or --debug option to get more log output.
==============================================================================
10: Task failed with an exception.
-----------
* What went wrong:
Execution failed for task ':geode-web-api:distributedTest'.
> Cannot abort process 'Gradle Test Executor 5948' because it is not in started or detached state
* Try:
Run with --stacktrace option to get the stack trace. Run with --info or --debug option to get more log output.
==============================================================================
BUILD FAILED
Total time: 8 hrs 29 mins 13.871 secs
Build step 'Invoke Gradle script' changed build result to FAILURE
Build step 'Invoke Gradle script' marked build as failure
Archiving artifacts
[Fast Archiver] Compressed 335.66 MB of artifacts by 37.9% relative to #992
Recording test results
Not sending mail to unregistered user github@nakomis.com
Not sending mail to unregistered user nabarunnag@users.noreply.github.com
Not sending mail to unregistered user kohlmu-pivotal@users.noreply.github.com