You are viewing a plain text version of this content. The canonical link for it is here.
Posted to builds@hbase.apache.org by Apache Jenkins Server <je...@builds.apache.org> on 2017/09/26 20:09:32 UTC
Build failed in Jenkins: HBase-1.4 » JDK_1_7,Hadoop&&!H13 #934
See <https://builds.apache.org/job/HBase-1.4/jdk=JDK_1_7,label=Hadoop&&!H13/934/display/redirect?page=changes>
Changes:
[apurtell] Amend HBASE-18830 TestCanaryTool does not check Canary monitor's error
------------------------------------------
[...truncated 2.36 MB...]
Tests run: 3, Failures: 0, Errors: 0, Skipped: 0, Time elapsed: 4.965 sec - in org.apache.hadoop.hbase.TestInfoServers
Running org.apache.hadoop.hbase.quotas.TestQuotaAdmin
Tests run: 3, Failures: 0, Errors: 0, Skipped: 0, Time elapsed: 5.047 sec - in org.apache.hadoop.hbase.quotas.TestQuotaAdmin
Running org.apache.hadoop.hbase.quotas.TestQuotaThrottle
Running org.apache.hadoop.hbase.quotas.TestQuotaTableUtil
Tests run: 3, Failures: 0, Errors: 0, Skipped: 0, Time elapsed: 2.616 sec - in org.apache.hadoop.hbase.quotas.TestQuotaTableUtil
Running org.apache.hadoop.hbase.procedure.TestZKProcedureControllers
Tests run: 4, Failures: 0, Errors: 0, Skipped: 0, Time elapsed: 3.562 sec - in org.apache.hadoop.hbase.procedure.TestZKProcedureControllers
Running org.apache.hadoop.hbase.procedure.TestZKProcedure
Tests run: 4, Failures: 0, Errors: 0, Skipped: 0, Time elapsed: 4.715 sec - in org.apache.hadoop.hbase.procedure.TestZKProcedure
Tests run: 12, Failures: 0, Errors: 0, Skipped: 0, Time elapsed: 33.836 sec - in org.apache.hadoop.hbase.quotas.TestQuotaThrottle
Running org.apache.hadoop.hbase.io.hfile.TestCacheOnWrite
Running org.apache.hadoop.hbase.io.hfile.TestForceCacheImportantBlocks
Tests run: 5, Failures: 0, Errors: 0, Skipped: 0, Time elapsed: 104.122 sec - in org.apache.hadoop.hbase.snapshot.TestRestoreFlushSnapshotFromClient
Running org.apache.hadoop.hbase.io.hfile.TestHFileBlock
Tests run: 4, Failures: 0, Errors: 0, Skipped: 0, Time elapsed: 48.548 sec - in org.apache.hadoop.hbase.io.hfile.TestForceCacheImportantBlocks
Running org.apache.hadoop.hbase.io.hfile.TestHFileBlockIndex
Tests run: 16, Failures: 0, Errors: 0, Skipped: 0, Time elapsed: 9.43 sec - in org.apache.hadoop.hbase.io.hfile.TestHFileBlockIndex
Running org.apache.hadoop.hbase.io.hfile.TestSeekBeforeWithInlineBlocks
Tests run: 1, Failures: 0, Errors: 0, Skipped: 0, Time elapsed: 17.842 sec - in org.apache.hadoop.hbase.io.hfile.TestSeekBeforeWithInlineBlocks
Running org.apache.hadoop.hbase.io.hfile.TestHFileSeek
Tests run: 1, Failures: 0, Errors: 0, Skipped: 0, Time elapsed: 3.331 sec - in org.apache.hadoop.hbase.io.hfile.TestHFileSeek
Running org.apache.hadoop.hbase.io.hfile.TestScannerSelectionUsingTTL
Tests run: 28, Failures: 0, Errors: 0, Skipped: 0, Time elapsed: 101.259 sec - in org.apache.hadoop.hbase.io.hfile.TestHFileBlock
Running org.apache.hadoop.hbase.io.hfile.TestCacheConfig
Tests run: 7, Failures: 0, Errors: 0, Skipped: 0, Time elapsed: 1.947 sec - in org.apache.hadoop.hbase.io.hfile.TestCacheConfig
Running org.apache.hadoop.hbase.io.encoding.TestDataBlockEncoders
Tests run: 28, Failures: 0, Errors: 0, Skipped: 0, Time elapsed: 28.466 sec - in org.apache.hadoop.hbase.io.encoding.TestDataBlockEncoders
Running org.apache.hadoop.hbase.io.encoding.TestEncodedSeekers
Tests run: 6, Failures: 0, Errors: 0, Skipped: 0, Time elapsed: 66.412 sec - in org.apache.hadoop.hbase.io.hfile.TestScannerSelectionUsingTTL
Running org.apache.hadoop.hbase.io.encoding.TestBufferedDataBlockEncoder
Tests run: 72, Failures: 0, Errors: 0, Skipped: 0, Time elapsed: 169.936 sec - in org.apache.hadoop.hbase.io.hfile.TestCacheOnWrite
Tests run: 1, Failures: 0, Errors: 0, Skipped: 0, Time elapsed: 16.054 sec - in org.apache.hadoop.hbase.io.encoding.TestBufferedDataBlockEncoder
Running org.apache.hadoop.hbase.io.encoding.TestLoadAndSwitchEncodeOnDisk
Running org.apache.hadoop.hbase.io.encoding.TestChangingEncoding
Tests run: 9, Failures: 0, Errors: 0, Skipped: 0, Time elapsed: 451.71 sec - in org.apache.hadoop.hbase.snapshot.TestSecureExportSnapshot
Running org.apache.hadoop.hbase.io.TestFileLink
Tests run: 1, Failures: 0, Errors: 0, Skipped: 0, Time elapsed: 45.534 sec - in org.apache.hadoop.hbase.io.encoding.TestLoadAndSwitchEncodeOnDisk
Tests run: 6, Failures: 0, Errors: 0, Skipped: 0, Time elapsed: 22.696 sec - in org.apache.hadoop.hbase.io.TestFileLink
Tests run: 24, Failures: 0, Errors: 0, Skipped: 0, Time elapsed: 105 sec - in org.apache.hadoop.hbase.io.encoding.TestEncodedSeekers
Running org.apache.hadoop.hbase.wal.TestWALFiltering
Running org.apache.hadoop.hbase.wal.TestWALFactory
Running org.apache.hadoop.hbase.wal.TestWALOpenAfterDNRollingStart
Tests run: 9, Failures: 0, Errors: 0, Skipped: 0, Time elapsed: 458.317 sec - in org.apache.hadoop.hbase.snapshot.TestExportSnapshot
Running org.apache.hadoop.hbase.wal.TestWALReaderOnSecureWAL
Tests run: 9, Failures: 0, Errors: 0, Skipped: 0, Time elapsed: 18.124 sec - in org.apache.hadoop.hbase.wal.TestWALFactory
Tests run: 2, Failures: 0, Errors: 0, Skipped: 0, Time elapsed: 2.09 sec - in org.apache.hadoop.hbase.wal.TestWALReaderOnSecureWAL
Running org.apache.hadoop.hbase.wal.TestDefaultWALProvider
Running org.apache.hadoop.hbase.wal.TestWALSplit
Tests run: 1, Failures: 0, Errors: 0, Skipped: 0, Time elapsed: 41.271 sec - in org.apache.hadoop.hbase.wal.TestWALFiltering
Tests run: 5, Failures: 0, Errors: 0, Skipped: 0, Time elapsed: 12.336 sec - in org.apache.hadoop.hbase.wal.TestDefaultWALProvider
Running org.apache.hadoop.hbase.wal.TestSecureWAL
Tests run: 1, Failures: 0, Errors: 0, Skipped: 0, Time elapsed: 1.424 sec - in org.apache.hadoop.hbase.wal.TestSecureWAL
Running org.apache.hadoop.hbase.wal.TestBoundedRegionGroupingStrategy
Tests run: 1, Failures: 0, Errors: 0, Skipped: 0, Time elapsed: 46.033 sec - in org.apache.hadoop.hbase.wal.TestWALOpenAfterDNRollingStart
Running org.apache.hadoop.hbase.wal.TestDefaultWALProviderWithHLogKey
Running org.apache.hadoop.hbase.wal.TestWALSplitCompressed
Tests run: 5, Failures: 0, Errors: 0, Skipped: 0, Time elapsed: 13.935 sec - in org.apache.hadoop.hbase.wal.TestDefaultWALProviderWithHLogKey
Running org.apache.hadoop.hbase.wal.TestWALRootDir
Tests run: 1, Failures: 0, Errors: 0, Skipped: 0, Time elapsed: 1.505 sec - in org.apache.hadoop.hbase.wal.TestWALRootDir
Tests run: 5, Failures: 0, Errors: 0, Skipped: 0, Time elapsed: 39.492 sec - in org.apache.hadoop.hbase.wal.TestBoundedRegionGroupingStrategy
Running org.apache.hadoop.hbase.zookeeper.TestZKLeaderManager
Tests run: 1, Failures: 0, Errors: 0, Skipped: 0, Time elapsed: 0.685 sec - in org.apache.hadoop.hbase.zookeeper.TestZKLeaderManager
Running org.apache.hadoop.hbase.zookeeper.TestZooKeeperNodeTracker
Tests run: 3, Failures: 0, Errors: 0, Skipped: 0, Time elapsed: 1.643 sec - in org.apache.hadoop.hbase.zookeeper.TestZooKeeperNodeTracker
Running org.apache.hadoop.hbase.zookeeper.TestRecoverableZooKeeper
Tests run: 1, Failures: 0, Errors: 0, Skipped: 0, Time elapsed: 2.051 sec - in org.apache.hadoop.hbase.zookeeper.TestRecoverableZooKeeper
Running org.apache.hadoop.hbase.zookeeper.TestZooKeeperACL
Tests run: 7, Failures: 0, Errors: 0, Skipped: 0, Time elapsed: 0.384 sec - in org.apache.hadoop.hbase.zookeeper.TestZooKeeperACL
Running org.apache.hadoop.hbase.zookeeper.TestZKTableStateManager
Tests run: 1, Failures: 0, Errors: 0, Skipped: 0, Time elapsed: 1.619 sec - in org.apache.hadoop.hbase.zookeeper.TestZKTableStateManager
Running org.apache.hadoop.hbase.zookeeper.TestZKMulti
Running org.apache.hadoop.hbase.zookeeper.lock.TestZKInterProcessReadWriteLock
Tests run: 12, Failures: 0, Errors: 0, Skipped: 0, Time elapsed: 5.648 sec - in org.apache.hadoop.hbase.zookeeper.TestZKMulti
Running org.apache.hadoop.hbase.zookeeper.TestHQuorumPeer
Tests run: 4, Failures: 0, Errors: 0, Skipped: 0, Time elapsed: 1.066 sec - in org.apache.hadoop.hbase.zookeeper.TestHQuorumPeer
Running org.apache.hadoop.hbase.TestIOFencing
Tests run: 6, Failures: 0, Errors: 0, Skipped: 0, Time elapsed: 25.59 sec - in org.apache.hadoop.hbase.zookeeper.lock.TestZKInterProcessReadWriteLock
Tests run: 33, Failures: 0, Errors: 0, Skipped: 0, Time elapsed: 109.615 sec - in org.apache.hadoop.hbase.wal.TestWALSplit
Running org.apache.hadoop.hbase.TestMovedRegionsCleaner
Running org.apache.hadoop.hbase.constraint.TestConstraint
Tests run: 1, Failures: 0, Errors: 0, Skipped: 0, Time elapsed: 18.258 sec - in org.apache.hadoop.hbase.TestMovedRegionsCleaner
Tests run: 33, Failures: 0, Errors: 0, Skipped: 0, Time elapsed: 109.017 sec - in org.apache.hadoop.hbase.wal.TestWALSplitCompressed
Running org.apache.hadoop.hbase.backup.example.TestZooKeeperTableArchiveClient
Running org.apache.hadoop.hbase.backup.TestHFileArchiving
Tests run: 3, Failures: 0, Errors: 0, Skipped: 0, Time elapsed: 5.463 sec - in org.apache.hadoop.hbase.backup.example.TestZooKeeperTableArchiveClient
Tests run: 5, Failures: 0, Errors: 0, Skipped: 0, Time elapsed: 40.339 sec - in org.apache.hadoop.hbase.constraint.TestConstraint
Running org.apache.hadoop.hbase.tool.TestCanaryTool
Running org.apache.hadoop.hbase.TestHColumnDescriptorDefaultVersions
Tests run: 3, Failures: 0, Errors: 0, Skipped: 0, Time elapsed: 282.449 sec - in org.apache.hadoop.hbase.io.encoding.TestChangingEncoding
Running org.apache.hadoop.hbase.ipc.TestProtoBufRpc
Tests run: 1, Failures: 0, Errors: 0, Skipped: 0, Time elapsed: 2.506 sec - in org.apache.hadoop.hbase.ipc.TestProtoBufRpc
Tests run: 2, Failures: 0, Errors: 0, Skipped: 0, Time elapsed: 119.72 sec - in org.apache.hadoop.hbase.TestIOFencing
Running org.apache.hadoop.hbase.ipc.TestRpcServerSlowConnectionSetup
Tests run: 1, Failures: 0, Errors: 0, Skipped: 0, Time elapsed: 7.223 sec - in org.apache.hadoop.hbase.ipc.TestRpcServerSlowConnectionSetup
Running org.apache.hadoop.hbase.ipc.TestRpcClientLeaks
Running org.apache.hadoop.hbase.ipc.TestHBaseClient
Tests run: 1, Failures: 0, Errors: 0, Skipped: 0, Time elapsed: 0.585 sec - in org.apache.hadoop.hbase.ipc.TestHBaseClient
Tests run: 1, Failures: 0, Errors: 0, Skipped: 0, Time elapsed: 4.698 sec - in org.apache.hadoop.hbase.ipc.TestRpcClientLeaks
Tests run: 4, Failures: 0, Errors: 0, Skipped: 0, Time elapsed: 49.716 sec - in org.apache.hadoop.hbase.TestHColumnDescriptorDefaultVersions
Tests run: 5, Failures: 0, Errors: 0, Skipped: 0, Time elapsed: 79.161 sec - in org.apache.hadoop.hbase.backup.TestHFileArchiving
Running org.apache.hadoop.hbase.TestNamespace
Tests run: 7, Failures: 0, Errors: 0, Skipped: 2, Time elapsed: 98.412 sec - in org.apache.hadoop.hbase.tool.TestCanaryTool
Tests run: 9, Failures: 0, Errors: 0, Skipped: 0, Time elapsed: 66.908 sec - in org.apache.hadoop.hbase.TestNamespace
Results :
Flaked tests:
org.apache.hadoop.hbase.replication.TestMasterReplication.testCyclicReplication2(org.apache.hadoop.hbase.replication.TestMasterReplication)
Run 1: TestMasterReplication.testCyclicReplication2:316->wait:703 Waited too much time for replication. Row:row4. IsDeleteReplication:true
Run 2: PASS
Tests run: 2824, Failures: 0, Errors: 0, Skipped: 58, Flakes: 1
[INFO] ------------------------------------------------------------------------
[INFO] Reactor Summary:
[INFO]
[INFO] Apache HBase ...................................... SUCCESS [1:46.997s]
[INFO] Apache HBase - Checkstyle ......................... SUCCESS [16.160s]
[INFO] Apache HBase - Resource Bundle .................... SUCCESS [0.310s]
[INFO] Apache HBase - Annotations ........................ SUCCESS [1.961s]
[INFO] Apache HBase - Protocol ........................... SUCCESS [18.607s]
[INFO] Apache HBase - Common ............................. SUCCESS [2:49.954s]
[INFO] Apache HBase - Procedure .......................... SUCCESS [3:36.071s]
[INFO] Apache HBase - Metrics API ........................ SUCCESS [1.454s]
[INFO] Apache HBase - Hadoop Compatibility ............... SUCCESS [12.011s]
[INFO] Apache HBase - Metrics Implementation ............. SUCCESS [6.439s]
[INFO] Apache HBase - Hadoop Two Compatibility ........... SUCCESS [21.733s]
[INFO] Apache HBase - Client ............................. SUCCESS [1:52.316s]
[INFO] Apache HBase - Prefix Tree ........................ SUCCESS [10.235s]
[INFO] Apache HBase - Server ............................. FAILURE [2:05:31.242s]
[INFO] Apache HBase - Testing Util ....................... SKIPPED
[INFO] Apache HBase - Thrift ............................. SKIPPED
[INFO] Apache HBase - Rest ............................... SKIPPED
[INFO] Apache HBase - Shell .............................. SKIPPED
[INFO] Apache HBase - Integration Tests .................. SKIPPED
[INFO] Apache HBase - Examples ........................... SKIPPED
[INFO] Apache HBase - External Block Cache ............... SKIPPED
[INFO] Apache HBase - Assembly ........................... SKIPPED
[INFO] Apache HBase - Shaded ............................. SKIPPED
[INFO] Apache HBase - Shaded - Client .................... SKIPPED
[INFO] Apache HBase - Shaded - Server .................... SKIPPED
[INFO] Apache HBase Shaded Packaging Invariants .......... SKIPPED
[INFO] Apache HBase - Archetypes ......................... SKIPPED
[INFO] Apache HBase - Exemplar for hbase-client archetype SKIPPED
[INFO] Apache HBase - Exemplar for hbase-shaded-client archetype SKIPPED
[INFO] Apache HBase - Archetype builder .................. SKIPPED
[INFO] ------------------------------------------------------------------------
[INFO] BUILD FAILURE
[INFO] ------------------------------------------------------------------------
[INFO] Total time: 2:17:39.767s
[INFO] Finished at: Tue Sep 26 20:00:02 UTC 2017
[INFO] Final Memory: 103M/1399M
[INFO] ------------------------------------------------------------------------
[ERROR] Failed to execute goal org.apache.maven.plugins:maven-surefire-plugin:2.18.1:test (secondPartTestsExecution) on project hbase-server: There was a timeout or other error in the fork -> [Help 1]
[ERROR]
[ERROR] To see the full stack trace of the errors, re-run Maven with the -e switch.
[ERROR] Re-run Maven using the -X switch to enable full debug logging.
[ERROR]
[ERROR] For more information about the errors and possible solutions, please read the following articles:
[ERROR] [Help 1] http://cwiki.apache.org/confluence/display/MAVEN/MojoFailureException
[ERROR]
[ERROR] After correcting the problems, you can resume the build with the command
[ERROR] mvn <goals> -rf :hbase-server
Build step 'Invoke top-level Maven targets' marked build as failure
Performing Post build task...
Match found for :.* : True
Logical operation result is TRUE
Running script : # Post-build task script. TODO: Check this in and have all builds reference check-in.
pwd && ls
# NOTE!!!! The below code has been copied and pasted from ./dev-tools/run-test.sh
# Do not change here without syncing there and vice-versa.
ZOMBIE_TESTS_COUNT=`jps -v | grep surefirebooter | grep -e '-Dhbase.test' | wc -l`
if [[ $ZOMBIE_TESTS_COUNT != 0 ]] ; then
echo "Suspicious java process found - waiting 30s to see if there are just slow to stop"
sleep 30
ZOMBIE_TESTS_COUNT=`jps -v | grep surefirebooter | grep -e '-Dhbase.test' | wc -l`
if [[ $ZOMBIE_TESTS_COUNT != 0 ]] ; then
echo " {color:red}There appear to be $ZOMBIE_TESTS_COUNT zombie tests{color}, they should have been killed by surefire but survived"
jps -v | grep surefirebooter | grep -e '-Dhbase.test'
jps -v | grep surefirebooter | grep -e '-Dhbase.test' | cut -d ' ' -f 1 | xargs -n 1 jstack
# Exit with error
exit 1
else
echo "We're ok: there is no zombie test, but some tests took some time to stop"
fi
else
echo "We're ok: there is no zombie test"
fi
Setting JDK_1_7_LATEST__HOME=/home/jenkins/tools/java/latest1.7
Setting JDK_1_8_LATEST__HOME=/home/jenkins/tools/java/latest1.8
[19ccb43d] $ /bin/bash -xe /tmp/jenkins1975688801712266866.sh
+ pwd
<https://builds.apache.org/job/HBase-1.4/jdk=JDK_1_7,label=Hadoop&&!H13/ws/>
+ ls
bin
CHANGES.txt
conf
dev-support
extra_env_var
hbase-annotations
hbase-archetypes
hbase-assembly
hbase-checkstyle
hbase-client
hbase-common
hbase-examples
hbase-external-blockcache
hbase-hadoop2-compat
hbase-hadoop-compat
hbase-it
hbase-metrics
hbase-metrics-api
hbase-native-client
hbase-prefix-tree
hbase-procedure
hbase-protocol
hbase-resource-bundle
hbase-rest
hbase-server
hbase-shaded
hbase-shell
hbase-testing-util
hbase-thrift
LICENSE.txt
NOTICE.txt
pom.xml
README.txt
src
target
++ jps -v
++ grep surefirebooter
++ wc -l
++ grep -e -Dhbase.test
+ ZOMBIE_TESTS_COUNT=0
+ [[ 0 != 0 ]]
+ echo 'We'\''re ok: there is no zombie test'
We're ok: there is no zombie test
POST BUILD TASK : SUCCESS
END OF POST BUILD TASK : 0
Archiving artifacts
Setting JDK_1_7_LATEST__HOME=/home/jenkins/tools/java/latest1.7
Setting JDK_1_8_LATEST__HOME=/home/jenkins/tools/java/latest1.8
Recording test results
Setting JDK_1_7_LATEST__HOME=/home/jenkins/tools/java/latest1.7
Setting JDK_1_8_LATEST__HOME=/home/jenkins/tools/java/latest1.8
Setting JDK_1_7_LATEST__HOME=/home/jenkins/tools/java/latest1.7
Setting JDK_1_8_LATEST__HOME=/home/jenkins/tools/java/latest1.8
Jenkins build is back to normal : HBase-1.4 » JDK_1_7,Hadoop&&!H13 #938
Posted by Apache Jenkins Server <je...@builds.apache.org>.
See <https://builds.apache.org/job/HBase-1.4/jdk=JDK_1_7,label=Hadoop&&!H13/938/display/redirect?page=changes>
Build failed in Jenkins: HBase-1.4 » JDK_1_7,Hadoop&&!H13 #937
Posted by Apache Jenkins Server <je...@builds.apache.org>.
See <https://builds.apache.org/job/HBase-1.4/jdk=JDK_1_7,label=Hadoop&&!H13/937/display/redirect?page=changes>
Changes:
[tedyu] HBASE-18890, Backport HBASE-14499 (Master coprocessors shutdown will not
[apurtell] HBASE-18559 Add histogram to MetricsConnection to track concurrent calls
------------------------------------------
[...truncated 2.34 MB...]
Tests run: 1, Failures: 0, Errors: 0, Skipped: 0, Time elapsed: 12.548 sec - in org.apache.hadoop.hbase.regionserver.TestRecoveredEdits
Running org.apache.hadoop.hbase.regionserver.TestSplitLogWorker
Tests run: 2, Failures: 0, Errors: 0, Skipped: 0, Time elapsed: 42.972 sec - in org.apache.hadoop.hbase.regionserver.TestRegionServerAbort
Tests run: 7, Failures: 0, Errors: 0, Skipped: 0, Time elapsed: 25.226 sec - in org.apache.hadoop.hbase.regionserver.TestSplitLogWorker
Tests run: 3, Failures: 0, Errors: 0, Skipped: 0, Time elapsed: 107.442 sec - in org.apache.hadoop.hbase.regionserver.throttle.TestCompactionWithThroughputController
Running org.apache.hadoop.hbase.regionserver.TestServerCustomProtocol
Running org.apache.hadoop.hbase.regionserver.TestCompactionFileNotFound
Running org.apache.hadoop.hbase.regionserver.TestCompactSplitThread
Tests run: 2, Failures: 0, Errors: 0, Skipped: 0, Time elapsed: 23.312 sec - in org.apache.hadoop.hbase.regionserver.TestCompactionFileNotFound
Running org.apache.hadoop.hbase.regionserver.TestSplitWalDataLoss
Tests run: 3, Failures: 0, Errors: 0, Skipped: 0, Time elapsed: 145.605 sec - in org.apache.hadoop.hbase.regionserver.throttle.TestFlushWithThroughputController
Running org.apache.hadoop.hbase.regionserver.TestCompaction
Tests run: 2, Failures: 0, Errors: 0, Skipped: 0, Time elapsed: 26.126 sec - in org.apache.hadoop.hbase.regionserver.TestCompactSplitThread
Tests run: 7, Failures: 0, Errors: 0, Skipped: 0, Time elapsed: 26.328 sec - in org.apache.hadoop.hbase.regionserver.TestCompaction
Running org.apache.hadoop.hbase.TestServerSideScanMetricsFromClientSide
Tests run: 2, Failures: 0, Errors: 0, Skipped: 0, Time elapsed: 3.341 sec - in org.apache.hadoop.hbase.TestServerSideScanMetricsFromClientSide
Tests run: 7, Failures: 0, Errors: 0, Skipped: 0, Time elapsed: 70.441 sec - in org.apache.hadoop.hbase.regionserver.TestServerCustomProtocol
Running org.apache.hadoop.hbase.TestMetaTableAccessor
Tests run: 1, Failures: 0, Errors: 0, Skipped: 0, Time elapsed: 64.445 sec - in org.apache.hadoop.hbase.regionserver.TestSplitWalDataLoss
Running org.apache.hadoop.hbase.coprocessor.TestRegionObserverInterface
Running org.apache.hadoop.hbase.coprocessor.TestWALObserver
Tests run: 7, Failures: 0, Errors: 0, Skipped: 0, Time elapsed: 11.708 sec - in org.apache.hadoop.hbase.coprocessor.TestWALObserver
Running org.apache.hadoop.hbase.coprocessor.TestRegionServerCoprocessorExceptionWithRemove
Tests run: 15, Failures: 0, Errors: 0, Skipped: 0, Time elapsed: 47.961 sec - in org.apache.hadoop.hbase.TestMetaTableAccessor
Running org.apache.hadoop.hbase.coprocessor.TestClassLoading
Tests run: 1, Failures: 0, Errors: 0, Skipped: 0, Time elapsed: 19.99 sec - in org.apache.hadoop.hbase.coprocessor.TestRegionServerCoprocessorExceptionWithRemove
Running org.apache.hadoop.hbase.coprocessor.TestDoubleColumnInterpreter
Tests run: 38, Failures: 0, Errors: 0, Skipped: 0, Time elapsed: 6.32 sec - in org.apache.hadoop.hbase.coprocessor.TestDoubleColumnInterpreter
Running org.apache.hadoop.hbase.coprocessor.TestCoprocessorEndpoint
Tests run: 6, Failures: 0, Errors: 0, Skipped: 0, Time elapsed: 2.849 sec - in org.apache.hadoop.hbase.coprocessor.TestCoprocessorEndpoint
Tests run: 9, Failures: 0, Errors: 0, Skipped: 0, Time elapsed: 43.845 sec - in org.apache.hadoop.hbase.coprocessor.TestClassLoading
Tests run: 5, Failures: 0, Errors: 0, Skipped: 0, Time elapsed: 356.905 sec - in org.apache.hadoop.hbase.regionserver.wal.TestLogRolling
Running org.apache.hadoop.hbase.coprocessor.TestRegionServerCoprocessorExceptionWithAbort
Running org.apache.hadoop.hbase.coprocessor.TestOpenTableInCoprocessor
Running org.apache.hadoop.hbase.coprocessor.TestBigDecimalColumnInterpreter
Running org.apache.hadoop.hbase.coprocessor.TestNegativeMemstoreSizeWithSlowCoprocessor
Tests run: 1, Failures: 0, Errors: 0, Skipped: 0, Time elapsed: 2.162 sec - in org.apache.hadoop.hbase.coprocessor.TestNegativeMemstoreSizeWithSlowCoprocessor
Tests run: 38, Failures: 0, Errors: 0, Skipped: 0, Time elapsed: 7.468 sec - in org.apache.hadoop.hbase.coprocessor.TestBigDecimalColumnInterpreter
Tests run: 14, Failures: 0, Errors: 0, Skipped: 2, Time elapsed: 115.659 sec - in org.apache.hadoop.hbase.coprocessor.TestRegionObserverInterface
Tests run: 2, Failures: 0, Errors: 0, Skipped: 0, Time elapsed: 35.982 sec - in org.apache.hadoop.hbase.coprocessor.TestOpenTableInCoprocessor
Tests run: 2, Failures: 0, Errors: 0, Skipped: 0, Time elapsed: 40.58 sec - in org.apache.hadoop.hbase.coprocessor.TestRegionServerCoprocessorExceptionWithAbort
Running org.apache.hadoop.hbase.coprocessor.TestRegionObserverForAddingMutationsFromCoprocessors
Running org.apache.hadoop.hbase.coprocessor.TestHTableWrapper
Running org.apache.hadoop.hbase.coprocessor.TestMasterObserver
Tests run: 1, Failures: 0, Errors: 0, Skipped: 0, Time elapsed: 11.314 sec - in org.apache.hadoop.hbase.coprocessor.TestHTableWrapper
Tests run: 5, Failures: 0, Errors: 0, Skipped: 0, Time elapsed: 17.404 sec - in org.apache.hadoop.hbase.coprocessor.TestRegionObserverForAddingMutationsFromCoprocessors
Running org.apache.hadoop.hbase.coprocessor.TestRegionObserverScannerOpenHook
Running org.apache.hadoop.hbase.coprocessor.TestCoprocessorTableEndpoint
Running org.apache.hadoop.hbase.coprocessor.TestAggregateProtocol
Tests run: 44, Failures: 0, Errors: 0, Skipped: 0, Time elapsed: 7.79 sec - in org.apache.hadoop.hbase.coprocessor.TestAggregateProtocol
Running org.apache.hadoop.hbase.coprocessor.TestRegionServerObserver
Running org.apache.hadoop.hbase.coprocessor.TestCoprocessorMetrics
Tests run: 2, Failures: 0, Errors: 0, Skipped: 0, Time elapsed: 19.386 sec - in org.apache.hadoop.hbase.coprocessor.TestCoprocessorTableEndpoint
Tests run: 3, Failures: 0, Errors: 0, Skipped: 0, Time elapsed: 24.466 sec - in org.apache.hadoop.hbase.coprocessor.TestRegionObserverScannerOpenHook
Running org.apache.hadoop.hbase.coprocessor.TestRowProcessorEndpoint
Running org.apache.hadoop.hbase.coprocessor.TestBatchCoprocessorEndpoint
Tests run: 1, Failures: 0, Errors: 0, Skipped: 0, Time elapsed: 32.179 sec - in org.apache.hadoop.hbase.coprocessor.TestRegionServerObserver
Tests run: 4, Failures: 0, Errors: 0, Skipped: 0, Time elapsed: 2.282 sec - in org.apache.hadoop.hbase.coprocessor.TestBatchCoprocessorEndpoint
Running org.apache.hadoop.hbase.coprocessor.TestIncrementTimeRange
Running org.apache.hadoop.hbase.coprocessor.TestRegionObserverBypass
Tests run: 4, Failures: 0, Errors: 0, Skipped: 0, Time elapsed: 32.4 sec - in org.apache.hadoop.hbase.coprocessor.TestRowProcessorEndpoint
Tests run: 1, Failures: 0, Errors: 0, Skipped: 0, Time elapsed: 9.685 sec - in org.apache.hadoop.hbase.coprocessor.TestIncrementTimeRange
Tests run: 9, Failures: 0, Errors: 0, Skipped: 0, Time elapsed: 59.219 sec - in org.apache.hadoop.hbase.coprocessor.TestCoprocessorMetrics
Tests run: 9, Failures: 0, Errors: 0, Skipped: 0, Time elapsed: 86.523 sec - in org.apache.hadoop.hbase.coprocessor.TestMasterObserver
Tests run: 2, Failures: 0, Errors: 0, Skipped: 0, Time elapsed: 14.15 sec - in org.apache.hadoop.hbase.coprocessor.TestRegionObserverBypass
Running org.apache.hadoop.hbase.coprocessor.TestCoprocessorStop
Tests run: 1, Failures: 0, Errors: 0, Skipped: 0, Time elapsed: 1.941 sec - in org.apache.hadoop.hbase.coprocessor.TestCoprocessorStop
Running org.apache.hadoop.hbase.coprocessor.TestMasterCoprocessorExceptionWithAbort
Running org.apache.hadoop.hbase.coprocessor.TestMasterCoprocessorExceptionWithRemove
Running org.apache.hadoop.hbase.coprocessor.TestRegionServerCoprocessorEndpoint
Tests run: 1, Failures: 0, Errors: 0, Skipped: 0, Time elapsed: 3.565 sec - in org.apache.hadoop.hbase.coprocessor.TestMasterCoprocessorExceptionWithAbort
Tests run: 2, Failures: 0, Errors: 0, Skipped: 0, Time elapsed: 1.442 sec - in org.apache.hadoop.hbase.coprocessor.TestRegionServerCoprocessorEndpoint
Tests run: 1, Failures: 0, Errors: 0, Skipped: 0, Time elapsed: 7.673 sec - in org.apache.hadoop.hbase.coprocessor.TestMasterCoprocessorExceptionWithRemove
Running org.apache.hadoop.hbase.replication.TestReplicationChangingPeerRegionservers
Tests run: 1, Failures: 0, Errors: 0, Skipped: 0, Time elapsed: 6.842 sec - in org.apache.hadoop.hbase.replication.TestReplicationChangingPeerRegionservers
Running org.apache.hadoop.hbase.replication.TestReplicationSyncUpToolWithBulkLoadedData
Running org.apache.hadoop.hbase.replication.TestPerTableCFReplication
Running org.apache.hadoop.hbase.replication.TestReplicationDisableInactivePeer
Running org.apache.hadoop.hbase.replication.TestReplicationStatus
Tests run: 1, Failures: 0, Errors: 0, Skipped: 0, Time elapsed: 24.047 sec - in org.apache.hadoop.hbase.replication.TestReplicationStatus
Tests run: 1, Failures: 0, Errors: 0, Skipped: 0, Time elapsed: 26.182 sec - in org.apache.hadoop.hbase.replication.TestReplicationDisableInactivePeer
Running org.apache.hadoop.hbase.replication.regionserver.TestReplicationSourceManager
Running org.apache.hadoop.hbase.replication.TestReplicationSyncUpTool
Tests run: 1, Failures: 0, Errors: 0, Skipped: 0, Time elapsed: 52.077 sec - in org.apache.hadoop.hbase.replication.TestReplicationSyncUpToolWithBulkLoadedData
Running org.apache.hadoop.hbase.replication.regionserver.TestRegionReplicaReplicationEndpoint
Tests run: 3, Failures: 0, Errors: 0, Skipped: 0, Time elapsed: 49.959 sec - in org.apache.hadoop.hbase.replication.TestPerTableCFReplication
Running org.apache.hadoop.hbase.replication.regionserver.TestRegionReplicaReplicationEndpointNoMaster
Results :
Tests in error:
TestAdmin2.testCreateTableRPCTimeOut:209 » TimeoutIO java.util.concurrent.Time...
TestMasterBalanceThrottling.testThrottlingByBalanceInterval:81->Object.wait:503->Object.wait:-2 » TestTimedOut
TestMasterBalanceThrottling.testThrottlingByMaxRitPercent:105 » TestTimedOut t...
Flaked tests:
org.apache.hadoop.hbase.regionserver.TestCompactionInDeadRegionServer.test(org.apache.hadoop.hbase.regionserver.TestCompactionInDeadRegionServer)
Run 1: TestCompactionInDeadRegionServer.test:132 Should fail as our wal file has already been closed, and walDir has also been renamed
Run 2: PASS
org.apache.hadoop.hbase.util.TestHBaseFsck.testHbckReportReplicaLingeringSplitParent(org.apache.hadoop.hbase.util.TestHBaseFsck)
Run 1: TestHBaseFsck.testHbckReportReplicaLingeringSplitParent:230 expected:<[]> but was:<[NOT_DEPLOYED]>
Run 2: PASS
Tests run: 2047, Failures: 0, Errors: 3, Skipped: 58, Flakes: 2
[INFO] ------------------------------------------------------------------------
[INFO] Reactor Summary:
[INFO]
[INFO] Apache HBase ...................................... SUCCESS [1:45.976s]
[INFO] Apache HBase - Checkstyle ......................... SUCCESS [15.940s]
[INFO] Apache HBase - Resource Bundle .................... SUCCESS [0.258s]
[INFO] Apache HBase - Annotations ........................ SUCCESS [1.352s]
[INFO] Apache HBase - Protocol ........................... SUCCESS [17.201s]
[INFO] Apache HBase - Common ............................. SUCCESS [2:42.540s]
[INFO] Apache HBase - Procedure .......................... SUCCESS [3:42.564s]
[INFO] Apache HBase - Metrics API ........................ SUCCESS [1.372s]
[INFO] Apache HBase - Hadoop Compatibility ............... SUCCESS [12.154s]
[INFO] Apache HBase - Metrics Implementation ............. SUCCESS [5.986s]
[INFO] Apache HBase - Hadoop Two Compatibility ........... SUCCESS [22.888s]
[INFO] Apache HBase - Client ............................. SUCCESS [1:54.530s]
[INFO] Apache HBase - Prefix Tree ........................ SUCCESS [11.503s]
[INFO] Apache HBase - Server ............................. FAILURE [1:45:47.176s]
[INFO] Apache HBase - Testing Util ....................... SKIPPED
[INFO] Apache HBase - Thrift ............................. SKIPPED
[INFO] Apache HBase - Rest ............................... SKIPPED
[INFO] Apache HBase - Shell .............................. SKIPPED
[INFO] Apache HBase - Integration Tests .................. SKIPPED
[INFO] Apache HBase - Examples ........................... SKIPPED
[INFO] Apache HBase - External Block Cache ............... SKIPPED
[INFO] Apache HBase - Assembly ........................... SKIPPED
[INFO] Apache HBase - Shaded ............................. SKIPPED
[INFO] Apache HBase - Shaded - Client .................... SKIPPED
[INFO] Apache HBase - Shaded - Server .................... SKIPPED
[INFO] Apache HBase Shaded Packaging Invariants .......... SKIPPED
[INFO] Apache HBase - Archetypes ......................... SKIPPED
[INFO] Apache HBase - Exemplar for hbase-client archetype SKIPPED
[INFO] Apache HBase - Exemplar for hbase-shaded-client archetype SKIPPED
[INFO] Apache HBase - Archetype builder .................. SKIPPED
[INFO] ------------------------------------------------------------------------
[INFO] BUILD FAILURE
[INFO] ------------------------------------------------------------------------
[INFO] Total time: 1:57:54.320s
[INFO] Finished at: Sat Sep 30 03:21:59 UTC 2017
[INFO] Final Memory: 453M/698M
[INFO] ------------------------------------------------------------------------
[ERROR] Failed to execute goal org.apache.maven.plugins:maven-surefire-plugin:2.18.1:test (secondPartTestsExecution) on project hbase-server: ExecutionException: java.lang.RuntimeException: java.lang.RuntimeException: org.apache.maven.surefire.report.ReporterException: When writing xml report stdout/stderr: /tmp/stderr6152352905800028656deferred (No such file or directory) -> [Help 1]
[ERROR]
[ERROR] To see the full stack trace of the errors, re-run Maven with the -e switch.
[ERROR] Re-run Maven using the -X switch to enable full debug logging.
[ERROR]
[ERROR] For more information about the errors and possible solutions, please read the following articles:
[ERROR] [Help 1] http://cwiki.apache.org/confluence/display/MAVEN/MojoFailureException
[ERROR]
[ERROR] After correcting the problems, you can resume the build with the command
[ERROR] mvn <goals> -rf :hbase-server
Build step 'Invoke top-level Maven targets' marked build as failure
Performing Post build task...
Match found for :.* : True
Logical operation result is TRUE
Running script : # Post-build task script. TODO: Check this in and have all builds reference check-in.
pwd && ls
# NOTE!!!! The below code has been copied and pasted from ./dev-tools/run-test.sh
# Do not change here without syncing there and vice-versa.
ZOMBIE_TESTS_COUNT=`jps -v | grep surefirebooter | grep -e '-Dhbase.test' | wc -l`
if [[ $ZOMBIE_TESTS_COUNT != 0 ]] ; then
echo "Suspicious java process found - waiting 30s to see if there are just slow to stop"
sleep 30
ZOMBIE_TESTS_COUNT=`jps -v | grep surefirebooter | grep -e '-Dhbase.test' | wc -l`
if [[ $ZOMBIE_TESTS_COUNT != 0 ]] ; then
echo " {color:red}There appear to be $ZOMBIE_TESTS_COUNT zombie tests{color}, they should have been killed by surefire but survived"
jps -v | grep surefirebooter | grep -e '-Dhbase.test'
jps -v | grep surefirebooter | grep -e '-Dhbase.test' | cut -d ' ' -f 1 | xargs -n 1 jstack
# Exit with error
exit 1
else
echo "We're ok: there is no zombie test, but some tests took some time to stop"
fi
else
echo "We're ok: there is no zombie test"
fi
Setting JDK_1_7_LATEST__HOME=/home/jenkins/tools/java/latest1.7
Setting JDK_1_8_LATEST__HOME=/home/jenkins/tools/java/latest1.8
[19ccb43d] $ /bin/bash -xe /tmp/jenkins3458866299686776505.sh
+ pwd
<https://builds.apache.org/job/HBase-1.4/jdk=JDK_1_7,label=Hadoop&&!H13/ws/>
+ ls
bin
CHANGES.txt
conf
dev-support
extra_env_var
hbase-annotations
hbase-archetypes
hbase-assembly
hbase-checkstyle
hbase-client
hbase-common
hbase-examples
hbase-external-blockcache
hbase-hadoop2-compat
hbase-hadoop-compat
hbase-it
hbase-metrics
hbase-metrics-api
hbase-native-client
hbase-prefix-tree
hbase-procedure
hbase-protocol
hbase-resource-bundle
hbase-rest
hbase-server
hbase-shaded
hbase-shell
hbase-testing-util
hbase-thrift
LICENSE.txt
NOTICE.txt
pom.xml
README.txt
src
target
++ jps -v
++ grep surefirebooter
++ grep -e -Dhbase.test
++ wc -l
+ ZOMBIE_TESTS_COUNT=2
+ [[ 2 != 0 ]]
+ echo 'Suspicious java process found - waiting 30s to see if there are just slow to stop'
Suspicious java process found - waiting 30s to see if there are just slow to stop
+ sleep 30
++ jps -v
++ grep surefirebooter
++ grep -e -Dhbase.test
++ wc -l
+ ZOMBIE_TESTS_COUNT=0
+ [[ 0 != 0 ]]
+ echo 'We'\''re ok: there is no zombie test, but some tests took some time to stop'
We're ok: there is no zombie test, but some tests took some time to stop
POST BUILD TASK : SUCCESS
END OF POST BUILD TASK : 0
Archiving artifacts
Setting JDK_1_7_LATEST__HOME=/home/jenkins/tools/java/latest1.7
Setting JDK_1_8_LATEST__HOME=/home/jenkins/tools/java/latest1.8
Recording test results
Setting JDK_1_7_LATEST__HOME=/home/jenkins/tools/java/latest1.7
Setting JDK_1_8_LATEST__HOME=/home/jenkins/tools/java/latest1.8
Setting JDK_1_7_LATEST__HOME=/home/jenkins/tools/java/latest1.7
Setting JDK_1_8_LATEST__HOME=/home/jenkins/tools/java/latest1.8
Build failed in Jenkins: HBase-1.4 » JDK_1_7,Hadoop&&!H13 #936
Posted by Apache Jenkins Server <je...@builds.apache.org>.
See <https://builds.apache.org/job/HBase-1.4/jdk=JDK_1_7,label=Hadoop&&!H13/936/display/redirect?page=changes>
Changes:
[tedyu] HBASE-18885 HFileOutputFormat2 hardcodes default FileOutputCommitter
[apurtell] HBASE-18436 Add client-side hedged read metrics (Yun Zhao)
------------------------------------------
[...truncated 2.44 MB...]
Running org.apache.hadoop.hbase.security.access.TestAccessController2
Tests run: 26, Failures: 0, Errors: 0, Skipped: 0, Time elapsed: 65.956 sec - in org.apache.hadoop.hbase.security.visibility.TestVisibilityLabelsWithDefaultVisLabelService
Running org.apache.hadoop.hbase.security.access.TestAccessController
Tests run: 46, Failures: 0, Errors: 0, Skipped: 0, Time elapsed: 191.004 sec - in org.apache.hadoop.hbase.security.visibility.TestVisibilityLabelsWithDeletes
Tests run: 21, Failures: 0, Errors: 0, Skipped: 0, Time elapsed: 53.217 sec - in org.apache.hadoop.hbase.security.visibility.TestVisibilityLabelsWithCustomVisLabService
Running org.apache.hadoop.hbase.security.access.TestTablePermissions
Running org.apache.hadoop.hbase.security.access.TestAccessControlFilter
Tests run: 1, Failures: 0, Errors: 0, Skipped: 0, Time elapsed: 4.372 sec - in org.apache.hadoop.hbase.security.access.TestAccessControlFilter
Tests run: 7, Failures: 0, Errors: 0, Skipped: 0, Time elapsed: 21.869 sec - in org.apache.hadoop.hbase.security.access.TestTablePermissions
Tests run: 6, Failures: 0, Errors: 0, Skipped: 0, Time elapsed: 85.141 sec - in org.apache.hadoop.hbase.security.access.TestAccessController2
Running org.apache.hadoop.hbase.security.access.TestCellACLs
Running org.apache.hadoop.hbase.security.access.TestWithDisabledAuthorization
Running org.apache.hadoop.hbase.security.access.TestNamespaceCommands
Tests run: 2, Failures: 0, Errors: 0, Skipped: 0, Time elapsed: 23.503 sec - in org.apache.hadoop.hbase.security.access.TestCellACLs
Tests run: 8, Failures: 1, Errors: 0, Skipped: 0, Time elapsed: 443.907 sec <<< FAILURE! - in org.apache.hadoop.hbase.replication.TestMasterReplication
testCyclicReplication2(org.apache.hadoop.hbase.replication.TestMasterReplication) Time elapsed: 167.023 sec <<< FAILURE!
java.lang.AssertionError: Waited too much time for replication. Row:row4. IsDeleteReplication:true
at org.junit.Assert.fail(Assert.java:88)
at org.apache.hadoop.hbase.replication.TestMasterReplication.wait(TestMasterReplication.java:703)
at org.apache.hadoop.hbase.replication.TestMasterReplication.testCyclicReplication2(TestMasterReplication.java:316)
Tests run: 7, Failures: 0, Errors: 0, Skipped: 0, Time elapsed: 13.441 sec - in org.apache.hadoop.hbase.security.access.TestNamespaceCommands
Running org.apache.hadoop.hbase.security.access.TestZKPermissionsWatcher
Tests run: 1, Failures: 0, Errors: 0, Skipped: 0, Time elapsed: 3.705 sec - in org.apache.hadoop.hbase.security.access.TestZKPermissionsWatcher
Running org.apache.hadoop.hbase.security.access.TestScanEarlyTermination
Tests run: 1, Failures: 0, Errors: 0, Skipped: 0, Time elapsed: 10.978 sec - in org.apache.hadoop.hbase.security.access.TestScanEarlyTermination
Running org.apache.hadoop.hbase.security.access.TestAccessController3
Tests run: 63, Failures: 0, Errors: 0, Skipped: 0, Time elapsed: 120.712 sec - in org.apache.hadoop.hbase.security.access.TestAccessController
Tests run: 6, Failures: 0, Errors: 0, Skipped: 0, Time elapsed: 60.558 sec - in org.apache.hadoop.hbase.security.access.TestWithDisabledAuthorization
Tests run: 1, Failures: 0, Errors: 0, Skipped: 0, Time elapsed: 6.006 sec - in org.apache.hadoop.hbase.security.access.TestAccessController3
Running org.apache.hadoop.hbase.security.token.TestZKSecretWatcher
Running org.apache.hadoop.hbase.security.access.TestCellACLWithMultipleVersions
Tests run: 1, Failures: 0, Errors: 0, Skipped: 0, Time elapsed: 493.781 sec - in org.apache.hadoop.hbase.replication.TestMasterReplication
Running org.apache.hadoop.hbase.security.token.TestTokenAuthentication
Tests run: 3, Failures: 0, Errors: 0, Skipped: 0, Time elapsed: 0.547 sec - in org.apache.hadoop.hbase.security.token.TestTokenAuthentication
Running org.apache.hadoop.hbase.TestMetaTableAccessorNoCluster
Tests run: 1, Failures: 0, Errors: 0, Skipped: 0, Time elapsed: 13.499 sec - in org.apache.hadoop.hbase.security.token.TestZKSecretWatcher
Tests run: 2, Failures: 0, Errors: 0, Skipped: 0, Time elapsed: 3.111 sec - in org.apache.hadoop.hbase.TestMetaTableAccessorNoCluster
Running org.apache.hadoop.hbase.TestMetaTableLocator
Running org.apache.hadoop.hbase.TestZooKeeper
Tests run: 7, Failures: 0, Errors: 0, Skipped: 0, Time elapsed: 5.598 sec - in org.apache.hadoop.hbase.TestMetaTableLocator
Running org.apache.hadoop.hbase.TestHBaseTestingUtility
Running org.apache.hadoop.hbase.security.token.TestGenerateDelegationToken
Running org.apache.hadoop.hbase.security.token.TestDelegationTokenWithEncryption
Tests run: 2, Failures: 0, Errors: 0, Skipped: 0, Time elapsed: 9.194 sec - in org.apache.hadoop.hbase.security.token.TestGenerateDelegationToken
Running org.apache.hadoop.hbase.snapshot.TestSnapshotDescriptionUtils
Tests run: 2, Failures: 0, Errors: 0, Skipped: 0, Time elapsed: 0.208 sec - in org.apache.hadoop.hbase.snapshot.TestSnapshotDescriptionUtils
Tests run: 2, Failures: 0, Errors: 0, Skipped: 0, Time elapsed: 14.202 sec - in org.apache.hadoop.hbase.security.token.TestDelegationTokenWithEncryption
Running org.apache.hadoop.hbase.snapshot.TestRegionSnapshotTask
Tests run: 8, Failures: 0, Errors: 0, Skipped: 0, Time elapsed: 73.533 sec - in org.apache.hadoop.hbase.security.access.TestCellACLWithMultipleVersions
Tests run: 1, Failures: 0, Errors: 0, Skipped: 0, Time elapsed: 11.235 sec - in org.apache.hadoop.hbase.snapshot.TestRegionSnapshotTask
Running org.apache.hadoop.hbase.snapshot.TestSecureExportSnapshot
Running org.apache.hadoop.hbase.snapshot.TestFlushSnapshotFromClient
Running org.apache.hadoop.hbase.snapshot.TestExportSnapshot
Tests run: 12, Failures: 0, Errors: 0, Skipped: 0, Time elapsed: 111.114 sec - in org.apache.hadoop.hbase.TestHBaseTestingUtility
Running org.apache.hadoop.hbase.snapshot.TestSnapshotClientRetries
Tests run: 2, Failures: 0, Errors: 0, Skipped: 0, Time elapsed: 27.874 sec - in org.apache.hadoop.hbase.snapshot.TestSnapshotClientRetries
Running org.apache.hadoop.hbase.snapshot.TestRestoreFlushSnapshotFromClient
Tests run: 10, Failures: 0, Errors: 0, Skipped: 0, Time elapsed: 182.912 sec - in org.apache.hadoop.hbase.TestZooKeeper
Running org.apache.hadoop.hbase.TestInfoServers
Tests run: 9, Failures: 0, Errors: 0, Skipped: 0, Time elapsed: 129.839 sec - in org.apache.hadoop.hbase.snapshot.TestFlushSnapshotFromClient
Tests run: 3, Failures: 0, Errors: 0, Skipped: 0, Time elapsed: 4.218 sec - in org.apache.hadoop.hbase.TestInfoServers
Running org.apache.hadoop.hbase.quotas.TestQuotaAdmin
Tests run: 3, Failures: 0, Errors: 0, Skipped: 0, Time elapsed: 4.481 sec - in org.apache.hadoop.hbase.quotas.TestQuotaAdmin
Running org.apache.hadoop.hbase.quotas.TestQuotaThrottle
Running org.apache.hadoop.hbase.quotas.TestQuotaTableUtil
Tests run: 3, Failures: 0, Errors: 0, Skipped: 0, Time elapsed: 1.904 sec - in org.apache.hadoop.hbase.quotas.TestQuotaTableUtil
Tests run: 5, Failures: 0, Errors: 0, Skipped: 0, Time elapsed: 84.207 sec - in org.apache.hadoop.hbase.snapshot.TestRestoreFlushSnapshotFromClient
Running org.apache.hadoop.hbase.procedure.TestZKProcedure
Running org.apache.hadoop.hbase.procedure.TestZKProcedureControllers
Tests run: 4, Failures: 0, Errors: 0, Skipped: 0, Time elapsed: 3.704 sec - in org.apache.hadoop.hbase.procedure.TestZKProcedureControllers
Tests run: 4, Failures: 0, Errors: 0, Skipped: 0, Time elapsed: 4.132 sec - in org.apache.hadoop.hbase.procedure.TestZKProcedure
Running org.apache.hadoop.hbase.io.hfile.TestForceCacheImportantBlocks
Running org.apache.hadoop.hbase.io.hfile.TestCacheOnWrite
Tests run: 12, Failures: 0, Errors: 0, Skipped: 0, Time elapsed: 30.458 sec - in org.apache.hadoop.hbase.quotas.TestQuotaThrottle
Running org.apache.hadoop.hbase.io.hfile.TestHFileBlock
Tests run: 4, Failures: 0, Errors: 0, Skipped: 0, Time elapsed: 33.989 sec - in org.apache.hadoop.hbase.io.hfile.TestForceCacheImportantBlocks
Results :
Failed tests:
org.apache.hadoop.hbase.regionserver.TestCompactionInDeadRegionServer.test(org.apache.hadoop.hbase.regionserver.TestCompactionInDeadRegionServer)
Run 1: TestCompactionInDeadRegionServer.test:132 Should fail as our wal file has already been closed, and walDir has also been renamed
Run 2: TestCompactionInDeadRegionServer.test:132 Should fail as our wal file has already been closed, and walDir has also been renamed
Run 3: TestCompactionInDeadRegionServer.test:132 Should fail as our wal file has already been closed, and walDir has also been renamed
TestHBaseFsck.testCheckReplication:2456 expected:<[]> but was:<[SHOULD_NOT_BE_DEPLOYED, SHOULD_NOT_BE_DEPLOYED]>
TestHBaseFsck.testFixAssignmentsAndNoHdfsChecking:2135 expected:<[NOT_DEPLOYED, HOLE_IN_REGION_CHAIN]> but was:<[NOT_DEPLOYED, SHOULD_NOT_BE_DEPLOYED, SHOULD_NOT_BE_DEPLOYED, HOLE_IN_REGION_CHAIN]>
TestHBaseFsck.testFixAssignmentsWhenMETAinTransition:315 expected:<[]> but was:<[SHOULD_NOT_BE_DEPLOYED, SHOULD_NOT_BE_DEPLOYED]>
TestHBaseFsck.testFixByTable:1808 expected:<[NOT_IN_HDFS, NOT_IN_HDFS]> but was:<[NOT_IN_HDFS, NOT_IN_HDFS, SHOULD_NOT_BE_DEPLOYED, SHOULD_NOT_BE_DEPLOYED]>
TestHBaseFsck.testHbckAfterRegionMerge:3053 expected:<[]> but was:<[SHOULD_NOT_BE_DEPLOYED, SHOULD_NOT_BE_DEPLOYED]>
TestHBaseFsck.testLingeringReferenceFile:2552 expected:<[LINGERING_REFERENCE_HFILE]> but was:<[SHOULD_NOT_BE_DEPLOYED, SHOULD_NOT_BE_DEPLOYED, LINGERING_REFERENCE_HFILE]>
TestHBaseFsck.testMetaOffline:2933 expected:<[]> but was:<[SHOULD_NOT_BE_DEPLOYED, SHOULD_NOT_BE_DEPLOYED]>
TestHBaseFsck.testSidelineOverlapRegion:1206 expected:<[DUPE_STARTKEYS, DUPE_STARTKEYS, OVERLAP_IN_REGION_CHAIN]> but was:<[SHOULD_NOT_BE_DEPLOYED, SHOULD_NOT_BE_DEPLOYED, DUPE_STARTKEYS, DUPE_STARTKEYS, OVERLAP_IN_REGION_CHAIN]>
Tests in error:
TestMasterBalanceThrottling.testThrottlingByBalanceInterval:81 » TestTimedOut ...
TestHBaseFsck.testSplitAndDupeRegion:453->cleanupTable:654->deleteTable:3206 » TestTimedOut
Flaked tests:
org.apache.hadoop.hbase.replication.TestMasterReplication.testCyclicReplication2(org.apache.hadoop.hbase.replication.TestMasterReplication)
Run 1: TestMasterReplication.testCyclicReplication2:316->wait:703 Waited too much time for replication. Row:row4. IsDeleteReplication:true
Run 2: PASS
Tests run: 2474, Failures: 9, Errors: 2, Skipped: 58, Flakes: 1
[WARNING] Could not delete temp direcotry <https://builds.apache.org/job/HBase-1.4/jdk=JDK_1_7,label=Hadoop&&!H13/ws/hbase-server/target/surefire> because Directory <https://builds.apache.org/job/HBase-1.4/jdk=JDK_1_7,label=Hadoop&&!H13/ws/hbase-server/target/surefire> unable to be deleted.
[INFO] ------------------------------------------------------------------------
[INFO] Reactor Summary:
[INFO]
[INFO] Apache HBase ...................................... SUCCESS [1:54.735s]
[INFO] Apache HBase - Checkstyle ......................... SUCCESS [16.687s]
[INFO] Apache HBase - Resource Bundle .................... SUCCESS [0.394s]
[INFO] Apache HBase - Annotations ........................ SUCCESS [4.472s]
[INFO] Apache HBase - Protocol ........................... SUCCESS [20.306s]
[INFO] Apache HBase - Common ............................. SUCCESS [3:07.551s]
[INFO] Apache HBase - Procedure .......................... SUCCESS [3:54.241s]
[INFO] Apache HBase - Metrics API ........................ SUCCESS [1.608s]
[INFO] Apache HBase - Hadoop Compatibility ............... SUCCESS [12.388s]
[INFO] Apache HBase - Metrics Implementation ............. SUCCESS [6.293s]
[INFO] Apache HBase - Hadoop Two Compatibility ........... SUCCESS [23.050s]
[INFO] Apache HBase - Client ............................. SUCCESS [1:56.970s]
[INFO] Apache HBase - Prefix Tree ........................ SUCCESS [12.774s]
[INFO] Apache HBase - Server ............................. FAILURE [1:57:10.724s]
[INFO] Apache HBase - Testing Util ....................... SKIPPED
[INFO] Apache HBase - Thrift ............................. SKIPPED
[INFO] Apache HBase - Rest ............................... SKIPPED
[INFO] Apache HBase - Shell .............................. SKIPPED
[INFO] Apache HBase - Integration Tests .................. SKIPPED
[INFO] Apache HBase - Examples ........................... SKIPPED
[INFO] Apache HBase - External Block Cache ............... SKIPPED
[INFO] Apache HBase - Assembly ........................... SKIPPED
[INFO] Apache HBase - Shaded ............................. SKIPPED
[INFO] Apache HBase - Shaded - Client .................... SKIPPED
[INFO] Apache HBase - Shaded - Server .................... SKIPPED
[INFO] Apache HBase Shaded Packaging Invariants .......... SKIPPED
[INFO] Apache HBase - Archetypes ......................... SKIPPED
[INFO] Apache HBase - Exemplar for hbase-client archetype SKIPPED
[INFO] Apache HBase - Exemplar for hbase-shaded-client archetype SKIPPED
[INFO] Apache HBase - Archetype builder .................. SKIPPED
[INFO] ------------------------------------------------------------------------
[INFO] BUILD FAILURE
[INFO] ------------------------------------------------------------------------
[INFO] Total time: 2:10:20.192s
[INFO] Finished at: Sat Sep 30 01:16:09 UTC 2017
[INFO] Final Memory: 548M/745M
[INFO] ------------------------------------------------------------------------
[ERROR] Failed to execute goal org.apache.maven.plugins:maven-surefire-plugin:2.18.1:test (secondPartTestsExecution) on project hbase-server: ExecutionException: java.lang.RuntimeException: java.lang.RuntimeException: org.apache.maven.surefire.report.ReporterException: When writing xml report stdout/stderr: /tmp/stderr3353596880951597312deferred (No such file or directory) -> [Help 1]
[ERROR]
[ERROR] To see the full stack trace of the errors, re-run Maven with the -e switch.
[ERROR] Re-run Maven using the -X switch to enable full debug logging.
[ERROR]
[ERROR] For more information about the errors and possible solutions, please read the following articles:
[ERROR] [Help 1] http://cwiki.apache.org/confluence/display/MAVEN/MojoFailureException
[ERROR]
[ERROR] After correcting the problems, you can resume the build with the command
[ERROR] mvn <goals> -rf :hbase-server
Build step 'Invoke top-level Maven targets' marked build as failure
Performing Post build task...
Match found for :.* : True
Logical operation result is TRUE
Running script : # Post-build task script. TODO: Check this in and have all builds reference check-in.
pwd && ls
# NOTE!!!! The below code has been copied and pasted from ./dev-tools/run-test.sh
# Do not change here without syncing there and vice-versa.
ZOMBIE_TESTS_COUNT=`jps -v | grep surefirebooter | grep -e '-Dhbase.test' | wc -l`
if [[ $ZOMBIE_TESTS_COUNT != 0 ]] ; then
echo "Suspicious java process found - waiting 30s to see if there are just slow to stop"
sleep 30
ZOMBIE_TESTS_COUNT=`jps -v | grep surefirebooter | grep -e '-Dhbase.test' | wc -l`
if [[ $ZOMBIE_TESTS_COUNT != 0 ]] ; then
echo " {color:red}There appear to be $ZOMBIE_TESTS_COUNT zombie tests{color}, they should have been killed by surefire but survived"
jps -v | grep surefirebooter | grep -e '-Dhbase.test'
jps -v | grep surefirebooter | grep -e '-Dhbase.test' | cut -d ' ' -f 1 | xargs -n 1 jstack
# Exit with error
exit 1
else
echo "We're ok: there is no zombie test, but some tests took some time to stop"
fi
else
echo "We're ok: there is no zombie test"
fi
Setting JDK_1_7_LATEST__HOME=/home/jenkins/tools/java/latest1.7
Setting JDK_1_8_LATEST__HOME=/home/jenkins/tools/java/latest1.8
[19ccb43d] $ /bin/bash -xe /tmp/jenkins7236439419496614124.sh
+ pwd
<https://builds.apache.org/job/HBase-1.4/jdk=JDK_1_7,label=Hadoop&&!H13/ws/>
+ ls
bin
CHANGES.txt
conf
dev-support
extra_env_var
hbase-annotations
hbase-archetypes
hbase-assembly
hbase-checkstyle
hbase-client
hbase-common
hbase-examples
hbase-external-blockcache
hbase-hadoop2-compat
hbase-hadoop-compat
hbase-it
hbase-metrics
hbase-metrics-api
hbase-native-client
hbase-prefix-tree
hbase-procedure
hbase-protocol
hbase-resource-bundle
hbase-rest
hbase-server
hbase-shaded
hbase-shell
hbase-testing-util
hbase-thrift
LICENSE.txt
NOTICE.txt
pom.xml
README.txt
src
target
++ jps -v
++ grep surefirebooter
++ grep -e -Dhbase.test
++ wc -l
+ ZOMBIE_TESTS_COUNT=2
+ [[ 2 != 0 ]]
+ echo 'Suspicious java process found - waiting 30s to see if there are just slow to stop'
Suspicious java process found - waiting 30s to see if there are just slow to stop
+ sleep 30
++ jps -v
++ grep surefirebooter
++ grep -e -Dhbase.test
++ wc -l
+ ZOMBIE_TESTS_COUNT=0
+ [[ 0 != 0 ]]
+ echo 'We'\''re ok: there is no zombie test, but some tests took some time to stop'
We're ok: there is no zombie test, but some tests took some time to stop
POST BUILD TASK : SUCCESS
END OF POST BUILD TASK : 0
Archiving artifacts
Setting JDK_1_7_LATEST__HOME=/home/jenkins/tools/java/latest1.7
Setting JDK_1_8_LATEST__HOME=/home/jenkins/tools/java/latest1.8
Recording test results
Setting JDK_1_7_LATEST__HOME=/home/jenkins/tools/java/latest1.7
Setting JDK_1_8_LATEST__HOME=/home/jenkins/tools/java/latest1.8
Setting JDK_1_7_LATEST__HOME=/home/jenkins/tools/java/latest1.7
Setting JDK_1_8_LATEST__HOME=/home/jenkins/tools/java/latest1.8