You are viewing a plain text version of this content. The canonical link for it is here.
Posted to dev@lucene.apache.org by Policeman Jenkins Server <je...@thetaphi.de> on 2015/11/12 11:47:44 UTC
[JENKINS] Lucene-Solr-5.x-Solaris (64bit/jdk1.8.0) - Build # 183 -
Still Failing!
Build: http://jenkins.thetaphi.de/job/Lucene-Solr-5.x-Solaris/183/
Java: 64bit/jdk1.8.0 -XX:+UseCompressedOops -XX:+UseSerialGC
1 tests failed.
FAILED: org.apache.solr.security.PKIAuthenticationIntegrationTest.testPkiAuth
Error Message:
There are still nodes recoverying - waited for 10 seconds
Stack Trace:
java.lang.AssertionError: There are still nodes recoverying - waited for 10 seconds
at __randomizedtesting.SeedInfo.seed([CA4757D498DE9F88:FAF9CE8578681829]:0)
at org.junit.Assert.fail(Assert.java:93)
at org.apache.solr.cloud.AbstractDistribZkTestBase.waitForRecoveriesToFinish(AbstractDistribZkTestBase.java:170)
at org.apache.solr.cloud.AbstractFullDistribZkTestBase.waitForRecoveriesToFinish(AbstractFullDistribZkTestBase.java:836)
at org.apache.solr.cloud.AbstractFullDistribZkTestBase.waitForThingsToLevelOut(AbstractFullDistribZkTestBase.java:1392)
at org.apache.solr.security.PKIAuthenticationIntegrationTest.testPkiAuth(PKIAuthenticationIntegrationTest.java:51)
at sun.reflect.NativeMethodAccessorImpl.invoke0(Native Method)
at sun.reflect.NativeMethodAccessorImpl.invoke(NativeMethodAccessorImpl.java:62)
at sun.reflect.DelegatingMethodAccessorImpl.invoke(DelegatingMethodAccessorImpl.java:43)
at java.lang.reflect.Method.invoke(Method.java:497)
at com.carrotsearch.randomizedtesting.RandomizedRunner.invoke(RandomizedRunner.java:1660)
at com.carrotsearch.randomizedtesting.RandomizedRunner$8.evaluate(RandomizedRunner.java:866)
at com.carrotsearch.randomizedtesting.RandomizedRunner$9.evaluate(RandomizedRunner.java:902)
at com.carrotsearch.randomizedtesting.RandomizedRunner$10.evaluate(RandomizedRunner.java:916)
at org.apache.solr.BaseDistributedSearchTestCase$ShardsRepeatRule$ShardsFixedStatement.callStatement(BaseDistributedSearchTestCase.java:963)
at org.apache.solr.BaseDistributedSearchTestCase$ShardsRepeatRule$ShardsStatement.evaluate(BaseDistributedSearchTestCase.java:938)
at com.carrotsearch.randomizedtesting.rules.SystemPropertiesRestoreRule$1.evaluate(SystemPropertiesRestoreRule.java:57)
at org.apache.lucene.util.TestRuleSetupTeardownChained$1.evaluate(TestRuleSetupTeardownChained.java:50)
at org.apache.lucene.util.AbstractBeforeAfterRule$1.evaluate(AbstractBeforeAfterRule.java:46)
at org.apache.lucene.util.TestRuleThreadAndTestName$1.evaluate(TestRuleThreadAndTestName.java:49)
at org.apache.lucene.util.TestRuleIgnoreAfterMaxFailures$1.evaluate(TestRuleIgnoreAfterMaxFailures.java:65)
at org.apache.lucene.util.TestRuleMarkFailure$1.evaluate(TestRuleMarkFailure.java:48)
at com.carrotsearch.randomizedtesting.rules.StatementAdapter.evaluate(StatementAdapter.java:36)
at com.carrotsearch.randomizedtesting.ThreadLeakControl$StatementRunner.run(ThreadLeakControl.java:367)
at com.carrotsearch.randomizedtesting.ThreadLeakControl.forkTimeoutingTask(ThreadLeakControl.java:809)
at com.carrotsearch.randomizedtesting.ThreadLeakControl$3.evaluate(ThreadLeakControl.java:460)
at com.carrotsearch.randomizedtesting.RandomizedRunner.runSingleTest(RandomizedRunner.java:875)
at com.carrotsearch.randomizedtesting.RandomizedRunner$5.evaluate(RandomizedRunner.java:777)
at com.carrotsearch.randomizedtesting.RandomizedRunner$6.evaluate(RandomizedRunner.java:811)
at com.carrotsearch.randomizedtesting.RandomizedRunner$7.evaluate(RandomizedRunner.java:822)
at com.carrotsearch.randomizedtesting.rules.StatementAdapter.evaluate(StatementAdapter.java:36)
at com.carrotsearch.randomizedtesting.rules.SystemPropertiesRestoreRule$1.evaluate(SystemPropertiesRestoreRule.java:57)
at org.apache.lucene.util.AbstractBeforeAfterRule$1.evaluate(AbstractBeforeAfterRule.java:46)
at com.carrotsearch.randomizedtesting.rules.StatementAdapter.evaluate(StatementAdapter.java:36)
at org.apache.lucene.util.TestRuleStoreClassName$1.evaluate(TestRuleStoreClassName.java:42)
at com.carrotsearch.randomizedtesting.rules.NoShadowingOrOverridesOnMethodsRule$1.evaluate(NoShadowingOrOverridesOnMethodsRule.java:40)
at com.carrotsearch.randomizedtesting.rules.NoShadowingOrOverridesOnMethodsRule$1.evaluate(NoShadowingOrOverridesOnMethodsRule.java:40)
at com.carrotsearch.randomizedtesting.rules.StatementAdapter.evaluate(StatementAdapter.java:36)
at com.carrotsearch.randomizedtesting.rules.StatementAdapter.evaluate(StatementAdapter.java:36)
at com.carrotsearch.randomizedtesting.rules.StatementAdapter.evaluate(StatementAdapter.java:36)
at org.apache.lucene.util.TestRuleAssertionsRequired$1.evaluate(TestRuleAssertionsRequired.java:54)
at org.apache.lucene.util.TestRuleMarkFailure$1.evaluate(TestRuleMarkFailure.java:48)
at org.apache.lucene.util.TestRuleIgnoreAfterMaxFailures$1.evaluate(TestRuleIgnoreAfterMaxFailures.java:65)
at org.apache.lucene.util.TestRuleIgnoreTestSuites$1.evaluate(TestRuleIgnoreTestSuites.java:55)
at com.carrotsearch.randomizedtesting.rules.StatementAdapter.evaluate(StatementAdapter.java:36)
at com.carrotsearch.randomizedtesting.ThreadLeakControl$StatementRunner.run(ThreadLeakControl.java:367)
at java.lang.Thread.run(Thread.java:745)
Build Log:
[...truncated 11177 lines...]
[junit4] Suite: org.apache.solr.security.PKIAuthenticationIntegrationTest
[junit4] 2> Creating dataDir: /export/home/jenkins/workspace/Lucene-Solr-5.x-Solaris/solr/build/solr-core/test/J1/temp/solr.security.PKIAuthenticationIntegrationTest_CA4757D498DE9F88-001/init-core-data-001
[junit4] 2> 2696167 INFO (SUITE-PKIAuthenticationIntegrationTest-seed#[CA4757D498DE9F88]-worker) [ ] o.a.s.BaseDistributedSearchTestCase Setting hostContext system property: /u_/j
[junit4] 2> 2696170 INFO (TEST-PKIAuthenticationIntegrationTest.testPkiAuth-seed#[CA4757D498DE9F88]) [ ] o.a.s.c.ZkTestServer STARTING ZK TEST SERVER
[junit4] 2> 2696170 INFO (Thread-10368) [ ] o.a.s.c.ZkTestServer client port:0.0.0.0/0.0.0.0:0
[junit4] 2> 2696170 INFO (Thread-10368) [ ] o.a.s.c.ZkTestServer Starting server
[junit4] 2> 2696270 INFO (TEST-PKIAuthenticationIntegrationTest.testPkiAuth-seed#[CA4757D498DE9F88]) [ ] o.a.s.c.ZkTestServer start zk server on port:45447
[junit4] 2> 2696270 INFO (TEST-PKIAuthenticationIntegrationTest.testPkiAuth-seed#[CA4757D498DE9F88]) [ ] o.a.s.c.c.SolrZkClient Using default ZkCredentialsProvider
[junit4] 2> 2696270 INFO (TEST-PKIAuthenticationIntegrationTest.testPkiAuth-seed#[CA4757D498DE9F88]) [ ] o.a.s.c.c.ConnectionManager Waiting for client to connect to ZooKeeper
[junit4] 2> 2696291 INFO (zkCallback-2844-thread-1) [ ] o.a.s.c.c.ConnectionManager Watcher org.apache.solr.common.cloud.ConnectionManager@b3220d2 name:ZooKeeperConnection Watcher:127.0.0.1:45447 got event WatchedEvent state:SyncConnected type:None path:null path:null type:None
[junit4] 2> 2696292 INFO (TEST-PKIAuthenticationIntegrationTest.testPkiAuth-seed#[CA4757D498DE9F88]) [ ] o.a.s.c.c.ConnectionManager Client is connected to ZooKeeper
[junit4] 2> 2696292 INFO (TEST-PKIAuthenticationIntegrationTest.testPkiAuth-seed#[CA4757D498DE9F88]) [ ] o.a.s.c.c.SolrZkClient Using default ZkACLProvider
[junit4] 2> 2696292 INFO (TEST-PKIAuthenticationIntegrationTest.testPkiAuth-seed#[CA4757D498DE9F88]) [ ] o.a.s.c.c.SolrZkClient makePath: /solr
[junit4] 2> 2696300 INFO (TEST-PKIAuthenticationIntegrationTest.testPkiAuth-seed#[CA4757D498DE9F88]) [ ] o.a.s.c.c.SolrZkClient Using default ZkCredentialsProvider
[junit4] 2> 2696300 INFO (TEST-PKIAuthenticationIntegrationTest.testPkiAuth-seed#[CA4757D498DE9F88]) [ ] o.a.s.c.c.ConnectionManager Waiting for client to connect to ZooKeeper
[junit4] 2> 2696301 INFO (zkCallback-2845-thread-1) [ ] o.a.s.c.c.ConnectionManager Watcher org.apache.solr.common.cloud.ConnectionManager@62a3fbfc name:ZooKeeperConnection Watcher:127.0.0.1:45447/solr got event WatchedEvent state:SyncConnected type:None path:null path:null type:None
[junit4] 2> 2696302 INFO (TEST-PKIAuthenticationIntegrationTest.testPkiAuth-seed#[CA4757D498DE9F88]) [ ] o.a.s.c.c.ConnectionManager Client is connected to ZooKeeper
[junit4] 2> 2696302 INFO (TEST-PKIAuthenticationIntegrationTest.testPkiAuth-seed#[CA4757D498DE9F88]) [ ] o.a.s.c.c.SolrZkClient Using default ZkACLProvider
[junit4] 2> 2696302 INFO (TEST-PKIAuthenticationIntegrationTest.testPkiAuth-seed#[CA4757D498DE9F88]) [ ] o.a.s.c.c.SolrZkClient makePath: /collections/collection1
[junit4] 2> 2696304 INFO (TEST-PKIAuthenticationIntegrationTest.testPkiAuth-seed#[CA4757D498DE9F88]) [ ] o.a.s.c.c.SolrZkClient makePath: /collections/collection1/shards
[junit4] 2> 2696307 INFO (TEST-PKIAuthenticationIntegrationTest.testPkiAuth-seed#[CA4757D498DE9F88]) [ ] o.a.s.c.c.SolrZkClient makePath: /collections/control_collection
[junit4] 2> 2696309 INFO (TEST-PKIAuthenticationIntegrationTest.testPkiAuth-seed#[CA4757D498DE9F88]) [ ] o.a.s.c.c.SolrZkClient makePath: /collections/control_collection/shards
[junit4] 2> 2696311 INFO (TEST-PKIAuthenticationIntegrationTest.testPkiAuth-seed#[CA4757D498DE9F88]) [ ] o.a.s.c.AbstractZkTestCase put /export/home/jenkins/workspace/Lucene-Solr-5.x-Solaris/solr/core/src/test-files/solr/collection1/conf/solrconfig-tlog.xml to /configs/conf1/solrconfig.xml
[junit4] 2> 2696311 INFO (TEST-PKIAuthenticationIntegrationTest.testPkiAuth-seed#[CA4757D498DE9F88]) [ ] o.a.s.c.c.SolrZkClient makePath: /configs/conf1/solrconfig.xml
[junit4] 2> 2696314 INFO (TEST-PKIAuthenticationIntegrationTest.testPkiAuth-seed#[CA4757D498DE9F88]) [ ] o.a.s.c.AbstractZkTestCase put /export/home/jenkins/workspace/Lucene-Solr-5.x-Solaris/solr/core/src/test-files/solr/collection1/conf/schema.xml to /configs/conf1/schema.xml
[junit4] 2> 2696315 INFO (TEST-PKIAuthenticationIntegrationTest.testPkiAuth-seed#[CA4757D498DE9F88]) [ ] o.a.s.c.c.SolrZkClient makePath: /configs/conf1/schema.xml
[junit4] 2> 2696317 INFO (TEST-PKIAuthenticationIntegrationTest.testPkiAuth-seed#[CA4757D498DE9F88]) [ ] o.a.s.c.AbstractZkTestCase put /export/home/jenkins/workspace/Lucene-Solr-5.x-Solaris/solr/core/src/test-files/solr/collection1/conf/solrconfig.snippet.randomindexconfig.xml to /configs/conf1/solrconfig.snippet.randomindexconfig.xml
[junit4] 2> 2696317 INFO (TEST-PKIAuthenticationIntegrationTest.testPkiAuth-seed#[CA4757D498DE9F88]) [ ] o.a.s.c.c.SolrZkClient makePath: /configs/conf1/solrconfig.snippet.randomindexconfig.xml
[junit4] 2> 2696320 INFO (TEST-PKIAuthenticationIntegrationTest.testPkiAuth-seed#[CA4757D498DE9F88]) [ ] o.a.s.c.AbstractZkTestCase put /export/home/jenkins/workspace/Lucene-Solr-5.x-Solaris/solr/core/src/test-files/solr/collection1/conf/stopwords.txt to /configs/conf1/stopwords.txt
[junit4] 2> 2696320 INFO (TEST-PKIAuthenticationIntegrationTest.testPkiAuth-seed#[CA4757D498DE9F88]) [ ] o.a.s.c.c.SolrZkClient makePath: /configs/conf1/stopwords.txt
[junit4] 2> 2696323 INFO (TEST-PKIAuthenticationIntegrationTest.testPkiAuth-seed#[CA4757D498DE9F88]) [ ] o.a.s.c.AbstractZkTestCase put /export/home/jenkins/workspace/Lucene-Solr-5.x-Solaris/solr/core/src/test-files/solr/collection1/conf/protwords.txt to /configs/conf1/protwords.txt
[junit4] 2> 2696323 INFO (TEST-PKIAuthenticationIntegrationTest.testPkiAuth-seed#[CA4757D498DE9F88]) [ ] o.a.s.c.c.SolrZkClient makePath: /configs/conf1/protwords.txt
[junit4] 2> 2696325 INFO (TEST-PKIAuthenticationIntegrationTest.testPkiAuth-seed#[CA4757D498DE9F88]) [ ] o.a.s.c.AbstractZkTestCase put /export/home/jenkins/workspace/Lucene-Solr-5.x-Solaris/solr/core/src/test-files/solr/collection1/conf/currency.xml to /configs/conf1/currency.xml
[junit4] 2> 2696325 INFO (TEST-PKIAuthenticationIntegrationTest.testPkiAuth-seed#[CA4757D498DE9F88]) [ ] o.a.s.c.c.SolrZkClient makePath: /configs/conf1/currency.xml
[junit4] 2> 2696328 INFO (TEST-PKIAuthenticationIntegrationTest.testPkiAuth-seed#[CA4757D498DE9F88]) [ ] o.a.s.c.AbstractZkTestCase put /export/home/jenkins/workspace/Lucene-Solr-5.x-Solaris/solr/core/src/test-files/solr/collection1/conf/enumsConfig.xml to /configs/conf1/enumsConfig.xml
[junit4] 2> 2696328 INFO (TEST-PKIAuthenticationIntegrationTest.testPkiAuth-seed#[CA4757D498DE9F88]) [ ] o.a.s.c.c.SolrZkClient makePath: /configs/conf1/enumsConfig.xml
[junit4] 2> 2696330 INFO (TEST-PKIAuthenticationIntegrationTest.testPkiAuth-seed#[CA4757D498DE9F88]) [ ] o.a.s.c.AbstractZkTestCase put /export/home/jenkins/workspace/Lucene-Solr-5.x-Solaris/solr/core/src/test-files/solr/collection1/conf/open-exchange-rates.json to /configs/conf1/open-exchange-rates.json
[junit4] 2> 2696330 INFO (TEST-PKIAuthenticationIntegrationTest.testPkiAuth-seed#[CA4757D498DE9F88]) [ ] o.a.s.c.c.SolrZkClient makePath: /configs/conf1/open-exchange-rates.json
[junit4] 2> 2696333 INFO (TEST-PKIAuthenticationIntegrationTest.testPkiAuth-seed#[CA4757D498DE9F88]) [ ] o.a.s.c.AbstractZkTestCase put /export/home/jenkins/workspace/Lucene-Solr-5.x-Solaris/solr/core/src/test-files/solr/collection1/conf/mapping-ISOLatin1Accent.txt to /configs/conf1/mapping-ISOLatin1Accent.txt
[junit4] 2> 2696334 INFO (TEST-PKIAuthenticationIntegrationTest.testPkiAuth-seed#[CA4757D498DE9F88]) [ ] o.a.s.c.c.SolrZkClient makePath: /configs/conf1/mapping-ISOLatin1Accent.txt
[junit4] 2> 2696336 INFO (TEST-PKIAuthenticationIntegrationTest.testPkiAuth-seed#[CA4757D498DE9F88]) [ ] o.a.s.c.AbstractZkTestCase put /export/home/jenkins/workspace/Lucene-Solr-5.x-Solaris/solr/core/src/test-files/solr/collection1/conf/old_synonyms.txt to /configs/conf1/old_synonyms.txt
[junit4] 2> 2696336 INFO (TEST-PKIAuthenticationIntegrationTest.testPkiAuth-seed#[CA4757D498DE9F88]) [ ] o.a.s.c.c.SolrZkClient makePath: /configs/conf1/old_synonyms.txt
[junit4] 2> 2696338 INFO (TEST-PKIAuthenticationIntegrationTest.testPkiAuth-seed#[CA4757D498DE9F88]) [ ] o.a.s.c.AbstractZkTestCase put /export/home/jenkins/workspace/Lucene-Solr-5.x-Solaris/solr/core/src/test-files/solr/collection1/conf/synonyms.txt to /configs/conf1/synonyms.txt
[junit4] 2> 2696338 INFO (TEST-PKIAuthenticationIntegrationTest.testPkiAuth-seed#[CA4757D498DE9F88]) [ ] o.a.s.c.c.SolrZkClient makePath: /configs/conf1/synonyms.txt
[junit4] 2> 2696484 INFO (TEST-PKIAuthenticationIntegrationTest.testPkiAuth-seed#[CA4757D498DE9F88]) [ ] o.a.s.SolrTestCaseJ4 Writing core.properties file to /export/home/jenkins/workspace/Lucene-Solr-5.x-Solaris/solr/build/solr-core/test/J1/temp/solr.security.PKIAuthenticationIntegrationTest_CA4757D498DE9F88-001/control-001/cores/collection1
[junit4] 2> 2696485 INFO (TEST-PKIAuthenticationIntegrationTest.testPkiAuth-seed#[CA4757D498DE9F88]) [ ] o.e.j.s.Server jetty-9.2.13.v20150730
[junit4] 2> 2696487 INFO (TEST-PKIAuthenticationIntegrationTest.testPkiAuth-seed#[CA4757D498DE9F88]) [ ] o.e.j.s.h.ContextHandler Started o.e.j.s.ServletContextHandler@1eeb2ec4{/u_/j,null,AVAILABLE}
[junit4] 2> 2696487 INFO (TEST-PKIAuthenticationIntegrationTest.testPkiAuth-seed#[CA4757D498DE9F88]) [ ] o.e.j.s.ServerConnector Started ServerConnector@22bb36e0{HTTP/1.1}{127.0.0.1:33913}
[junit4] 2> 2696487 INFO (TEST-PKIAuthenticationIntegrationTest.testPkiAuth-seed#[CA4757D498DE9F88]) [ ] o.e.j.s.Server Started @2701413ms
[junit4] 2> 2696487 INFO (TEST-PKIAuthenticationIntegrationTest.testPkiAuth-seed#[CA4757D498DE9F88]) [ ] o.a.s.c.s.e.JettySolrRunner Jetty properties: {solr.data.dir=/export/home/jenkins/workspace/Lucene-Solr-5.x-Solaris/solr/build/solr-core/test/J1/temp/solr.security.PKIAuthenticationIntegrationTest_CA4757D498DE9F88-001/tempDir-001/control/data, hostContext=/u_/j, hostPort=33913, coreRootDirectory=/export/home/jenkins/workspace/Lucene-Solr-5.x-Solaris/solr/build/solr-core/test/J1/../../../../../../../../../../export/home/jenkins/workspace/Lucene-Solr-5.x-Solaris/solr/build/solr-core/test/J1/temp/solr.security.PKIAuthenticationIntegrationTest_CA4757D498DE9F88-001/control-001/cores}
[junit4] 2> 2696487 INFO (TEST-PKIAuthenticationIntegrationTest.testPkiAuth-seed#[CA4757D498DE9F88]) [ ] o.a.s.s.SolrDispatchFilter SolrDispatchFilter.init(): sun.misc.Launcher$AppClassLoader@659e0bfd
[junit4] 2> 2696487 INFO (TEST-PKIAuthenticationIntegrationTest.testPkiAuth-seed#[CA4757D498DE9F88]) [ ] o.a.s.c.SolrResourceLoader new SolrResourceLoader for directory: '/export/home/jenkins/workspace/Lucene-Solr-5.x-Solaris/solr/build/solr-core/test/J1/../../../../../../../../../../export/home/jenkins/workspace/Lucene-Solr-5.x-Solaris/solr/build/solr-core/test/J1/temp/solr.security.PKIAuthenticationIntegrationTest_CA4757D498DE9F88-001/control-001/'
[junit4] 2> 2696488 INFO (TEST-PKIAuthenticationIntegrationTest.testPkiAuth-seed#[CA4757D498DE9F88]) [ ] o.a.s.c.SolrResourceLoader JNDI not configured for solr (NoInitialContextEx)
[junit4] 2> 2696488 INFO (TEST-PKIAuthenticationIntegrationTest.testPkiAuth-seed#[CA4757D498DE9F88]) [ ] o.a.s.c.SolrResourceLoader solr home defaulted to 'solr/' (could not find system property or JNDI)
[junit4] 2> 2696505 INFO (TEST-PKIAuthenticationIntegrationTest.testPkiAuth-seed#[CA4757D498DE9F88]) [ ] o.a.s.c.c.SolrZkClient Using default ZkCredentialsProvider
[junit4] 2> 2696506 INFO (TEST-PKIAuthenticationIntegrationTest.testPkiAuth-seed#[CA4757D498DE9F88]) [ ] o.a.s.c.c.ConnectionManager Waiting for client to connect to ZooKeeper
[junit4] 2> 2696507 INFO (zkCallback-2846-thread-1) [ ] o.a.s.c.c.ConnectionManager Watcher org.apache.solr.common.cloud.ConnectionManager@214014e2 name:ZooKeeperConnection Watcher:127.0.0.1:45447/solr got event WatchedEvent state:SyncConnected type:None path:null path:null type:None
[junit4] 2> 2696507 INFO (TEST-PKIAuthenticationIntegrationTest.testPkiAuth-seed#[CA4757D498DE9F88]) [ ] o.a.s.c.c.ConnectionManager Client is connected to ZooKeeper
[junit4] 2> 2696508 INFO (TEST-PKIAuthenticationIntegrationTest.testPkiAuth-seed#[CA4757D498DE9F88]) [ ] o.a.s.c.c.SolrZkClient Using default ZkACLProvider
[junit4] 2> 2696509 INFO (TEST-PKIAuthenticationIntegrationTest.testPkiAuth-seed#[CA4757D498DE9F88]) [ ] o.a.s.s.SolrDispatchFilter Loading solr.xml from SolrHome (not found in ZooKeeper)
[junit4] 2> 2696509 INFO (TEST-PKIAuthenticationIntegrationTest.testPkiAuth-seed#[CA4757D498DE9F88]) [ ] o.a.s.c.SolrXmlConfig Loading container configuration from /export/home/jenkins/workspace/Lucene-Solr-5.x-Solaris/solr/build/solr-core/test/J1/../../../../../../../../../../export/home/jenkins/workspace/Lucene-Solr-5.x-Solaris/solr/build/solr-core/test/J1/temp/solr.security.PKIAuthenticationIntegrationTest_CA4757D498DE9F88-001/control-001/solr.xml
[junit4] 2> 2696513 INFO (TEST-PKIAuthenticationIntegrationTest.testPkiAuth-seed#[CA4757D498DE9F88]) [ ] o.a.s.c.CoresLocator Config-defined core root directory: /export/home/jenkins/workspace/Lucene-Solr-5.x-Solaris/solr/build/solr-core/test/J1/../../../../../../../../../../export/home/jenkins/workspace/Lucene-Solr-5.x-Solaris/solr/build/solr-core/test/J1/temp/solr.security.PKIAuthenticationIntegrationTest_CA4757D498DE9F88-001/control-001/cores
[junit4] 2> 2696513 INFO (TEST-PKIAuthenticationIntegrationTest.testPkiAuth-seed#[CA4757D498DE9F88]) [ ] o.a.s.c.CoreContainer New CoreContainer 838726036
[junit4] 2> 2696513 INFO (TEST-PKIAuthenticationIntegrationTest.testPkiAuth-seed#[CA4757D498DE9F88]) [ ] o.a.s.c.CoreContainer Loading cores into CoreContainer [instanceDir=/export/home/jenkins/workspace/Lucene-Solr-5.x-Solaris/solr/build/solr-core/test/J1/../../../../../../../../../../export/home/jenkins/workspace/Lucene-Solr-5.x-Solaris/solr/build/solr-core/test/J1/temp/solr.security.PKIAuthenticationIntegrationTest_CA4757D498DE9F88-001/control-001/]
[junit4] 2> 2696513 INFO (TEST-PKIAuthenticationIntegrationTest.testPkiAuth-seed#[CA4757D498DE9F88]) [ ] o.a.s.c.CoreContainer loading shared library: /export/home/jenkins/workspace/Lucene-Solr-5.x-Solaris/solr/build/solr-core/test/J1/../../../../../../../../../../export/home/jenkins/workspace/Lucene-Solr-5.x-Solaris/solr/build/solr-core/test/J1/temp/solr.security.PKIAuthenticationIntegrationTest_CA4757D498DE9F88-001/control-001/lib
[junit4] 2> 2696513 WARN (TEST-PKIAuthenticationIntegrationTest.testPkiAuth-seed#[CA4757D498DE9F88]) [ ] o.a.s.c.SolrResourceLoader Can't find (or read) directory to add to classloader: lib (resolved as: /export/home/jenkins/workspace/Lucene-Solr-5.x-Solaris/solr/build/solr-core/test/J1/../../../../../../../../../../export/home/jenkins/workspace/Lucene-Solr-5.x-Solaris/solr/build/solr-core/test/J1/temp/solr.security.PKIAuthenticationIntegrationTest_CA4757D498DE9F88-001/control-001/lib).
[junit4] 2> 2696521 INFO (TEST-PKIAuthenticationIntegrationTest.testPkiAuth-seed#[CA4757D498DE9F88]) [ ] o.a.s.h.c.HttpShardHandlerFactory created with socketTimeout : 90000,urlScheme : ,connTimeout : 15000,maxConnectionsPerHost : 20,maxConnections : 10000,corePoolSize : 0,maximumPoolSize : 2147483647,maxThreadIdleTime : 5,sizeOfQueue : -1,fairnessPolicy : false,useRetries : false,
[junit4] 2> 2696522 INFO (TEST-PKIAuthenticationIntegrationTest.testPkiAuth-seed#[CA4757D498DE9F88]) [ ] o.a.s.u.UpdateShardHandler Creating UpdateShardHandler HTTP client with params: socketTimeout=340000&connTimeout=45000&retry=true
[junit4] 2> 2696523 INFO (TEST-PKIAuthenticationIntegrationTest.testPkiAuth-seed#[CA4757D498DE9F88]) [ ] o.a.s.l.LogWatcher SLF4J impl is org.slf4j.impl.Log4jLoggerFactory
[junit4] 2> 2696523 INFO (TEST-PKIAuthenticationIntegrationTest.testPkiAuth-seed#[CA4757D498DE9F88]) [ ] o.a.s.l.LogWatcher Registering Log Listener [Log4j (org.slf4j.impl.Log4jLoggerFactory)]
[junit4] 2> 2696523 INFO (TEST-PKIAuthenticationIntegrationTest.testPkiAuth-seed#[CA4757D498DE9F88]) [ ] o.a.s.c.ZkContainer Zookeeper client=127.0.0.1:45447/solr
[junit4] 2> 2696523 INFO (TEST-PKIAuthenticationIntegrationTest.testPkiAuth-seed#[CA4757D498DE9F88]) [ ] o.a.s.c.ZkController zkHost includes chroot
[junit4] 2> 2696523 INFO (TEST-PKIAuthenticationIntegrationTest.testPkiAuth-seed#[CA4757D498DE9F88]) [ ] o.a.s.c.c.SolrZkClient Using default ZkCredentialsProvider
[junit4] 2> 2696523 INFO (TEST-PKIAuthenticationIntegrationTest.testPkiAuth-seed#[CA4757D498DE9F88]) [ ] o.a.s.c.c.ConnectionManager Waiting for client to connect to ZooKeeper
[junit4] 2> 2696525 INFO (zkCallback-2848-thread-1) [ ] o.a.s.c.c.ConnectionManager Watcher org.apache.solr.common.cloud.ConnectionManager@69ab6b31 name:ZooKeeperConnection Watcher:127.0.0.1:45447 got event WatchedEvent state:SyncConnected type:None path:null path:null type:None
[junit4] 2> 2696525 INFO (TEST-PKIAuthenticationIntegrationTest.testPkiAuth-seed#[CA4757D498DE9F88]) [ ] o.a.s.c.c.ConnectionManager Client is connected to ZooKeeper
[junit4] 2> 2696525 INFO (TEST-PKIAuthenticationIntegrationTest.testPkiAuth-seed#[CA4757D498DE9F88]) [ ] o.a.s.c.c.SolrZkClient Using default ZkACLProvider
[junit4] 2> 2696527 INFO (TEST-PKIAuthenticationIntegrationTest.testPkiAuth-seed#[CA4757D498DE9F88]) [n:127.0.0.1:33913_u_%2Fj ] o.a.s.c.c.ConnectionManager Waiting for client to connect to ZooKeeper
[junit4] 2> 2696529 INFO (zkCallback-2849-thread-1-processing-n:127.0.0.1:33913_u_%2Fj) [n:127.0.0.1:33913_u_%2Fj ] o.a.s.c.c.ConnectionManager Watcher org.apache.solr.common.cloud.ConnectionManager@693ec3cc name:ZooKeeperConnection Watcher:127.0.0.1:45447/solr got event WatchedEvent state:SyncConnected type:None path:null path:null type:None
[junit4] 2> 2696529 INFO (TEST-PKIAuthenticationIntegrationTest.testPkiAuth-seed#[CA4757D498DE9F88]) [n:127.0.0.1:33913_u_%2Fj ] o.a.s.c.c.ConnectionManager Client is connected to ZooKeeper
[junit4] 2> 2696531 INFO (TEST-PKIAuthenticationIntegrationTest.testPkiAuth-seed#[CA4757D498DE9F88]) [n:127.0.0.1:33913_u_%2Fj ] o.a.s.c.c.SolrZkClient makePath: /overseer/queue
[junit4] 2> 2696533 INFO (TEST-PKIAuthenticationIntegrationTest.testPkiAuth-seed#[CA4757D498DE9F88]) [n:127.0.0.1:33913_u_%2Fj ] o.a.s.c.c.SolrZkClient makePath: /overseer/collection-queue-work
[junit4] 2> 2696537 INFO (TEST-PKIAuthenticationIntegrationTest.testPkiAuth-seed#[CA4757D498DE9F88]) [n:127.0.0.1:33913_u_%2Fj ] o.a.s.c.c.SolrZkClient makePath: /overseer/collection-map-running
[junit4] 2> 2696540 INFO (TEST-PKIAuthenticationIntegrationTest.testPkiAuth-seed#[CA4757D498DE9F88]) [n:127.0.0.1:33913_u_%2Fj ] o.a.s.c.c.SolrZkClient makePath: /overseer/collection-map-completed
[junit4] 2> 2696543 INFO (TEST-PKIAuthenticationIntegrationTest.testPkiAuth-seed#[CA4757D498DE9F88]) [n:127.0.0.1:33913_u_%2Fj ] o.a.s.c.c.SolrZkClient makePath: /overseer/collection-map-failure
[junit4] 2> 2696546 INFO (TEST-PKIAuthenticationIntegrationTest.testPkiAuth-seed#[CA4757D498DE9F88]) [n:127.0.0.1:33913_u_%2Fj ] o.a.s.c.c.SolrZkClient makePath: /live_nodes
[junit4] 2> 2696549 INFO (TEST-PKIAuthenticationIntegrationTest.testPkiAuth-seed#[CA4757D498DE9F88]) [n:127.0.0.1:33913_u_%2Fj ] o.a.s.c.c.SolrZkClient makePath: /aliases.json
[junit4] 2> 2696551 INFO (TEST-PKIAuthenticationIntegrationTest.testPkiAuth-seed#[CA4757D498DE9F88]) [n:127.0.0.1:33913_u_%2Fj ] o.a.s.c.c.SolrZkClient makePath: /clusterstate.json
[junit4] 2> 2696552 INFO (TEST-PKIAuthenticationIntegrationTest.testPkiAuth-seed#[CA4757D498DE9F88]) [n:127.0.0.1:33913_u_%2Fj ] o.a.s.c.c.SolrZkClient makePath: /security.json
[junit4] 2> 2696553 INFO (TEST-PKIAuthenticationIntegrationTest.testPkiAuth-seed#[CA4757D498DE9F88]) [n:127.0.0.1:33913_u_%2Fj ] o.a.s.c.ZkController Register node as live in ZooKeeper:/live_nodes/127.0.0.1:33913_u_%2Fj
[junit4] 2> 2696554 INFO (TEST-PKIAuthenticationIntegrationTest.testPkiAuth-seed#[CA4757D498DE9F88]) [n:127.0.0.1:33913_u_%2Fj ] o.a.s.c.c.SolrZkClient makePath: /live_nodes/127.0.0.1:33913_u_%2Fj
[junit4] 2> 2696557 INFO (TEST-PKIAuthenticationIntegrationTest.testPkiAuth-seed#[CA4757D498DE9F88]) [n:127.0.0.1:33913_u_%2Fj ] o.a.s.c.c.SolrZkClient makePath: /overseer_elect
[junit4] 2> 2696559 INFO (TEST-PKIAuthenticationIntegrationTest.testPkiAuth-seed#[CA4757D498DE9F88]) [n:127.0.0.1:33913_u_%2Fj ] o.a.s.c.c.SolrZkClient makePath: /overseer_elect/election
[junit4] 2> 2696560 INFO (TEST-PKIAuthenticationIntegrationTest.testPkiAuth-seed#[CA4757D498DE9F88]) [n:127.0.0.1:33913_u_%2Fj ] o.a.s.c.Overseer Overseer (id=null) closing
[junit4] 2> 2696561 INFO (TEST-PKIAuthenticationIntegrationTest.testPkiAuth-seed#[CA4757D498DE9F88]) [n:127.0.0.1:33913_u_%2Fj ] o.a.s.c.LeaderElector Joined leadership election with path: /overseer_elect/election/94851893663825924-127.0.0.1:33913_u_%2Fj-n_0000000000
[junit4] 2> 2696561 INFO (TEST-PKIAuthenticationIntegrationTest.testPkiAuth-seed#[CA4757D498DE9F88]) [n:127.0.0.1:33913_u_%2Fj ] o.a.s.c.OverseerElectionContext I am going to be the leader 127.0.0.1:33913_u_%2Fj
[junit4] 2> 2696562 INFO (TEST-PKIAuthenticationIntegrationTest.testPkiAuth-seed#[CA4757D498DE9F88]) [n:127.0.0.1:33913_u_%2Fj ] o.a.s.c.c.SolrZkClient makePath: /overseer_elect/leader
[junit4] 2> 2696563 INFO (TEST-PKIAuthenticationIntegrationTest.testPkiAuth-seed#[CA4757D498DE9F88]) [n:127.0.0.1:33913_u_%2Fj ] o.a.s.c.Overseer Overseer (id=94851893663825924-127.0.0.1:33913_u_%2Fj-n_0000000000) starting
[junit4] 2> 2696565 INFO (TEST-PKIAuthenticationIntegrationTest.testPkiAuth-seed#[CA4757D498DE9F88]) [n:127.0.0.1:33913_u_%2Fj ] o.a.s.c.c.SolrZkClient makePath: /overseer/queue-work
[junit4] 2> 2696573 INFO (TEST-PKIAuthenticationIntegrationTest.testPkiAuth-seed#[CA4757D498DE9F88]) [n:127.0.0.1:33913_u_%2Fj ] o.a.s.c.OverseerAutoReplicaFailoverThread Starting OverseerAutoReplicaFailoverThread autoReplicaFailoverWorkLoopDelay=10000 autoReplicaFailoverWaitAfterExpiration=30000 autoReplicaFailoverBadNodeExpiration=60000
[junit4] 2> 2696574 INFO (TEST-PKIAuthenticationIntegrationTest.testPkiAuth-seed#[CA4757D498DE9F88]) [n:127.0.0.1:33913_u_%2Fj ] o.a.s.c.c.ZkStateReader Updating cluster state from ZooKeeper...
[junit4] 2> 2696574 INFO (OverseerCollectionConfigSetProcessor-94851893663825924-127.0.0.1:33913_u_%2Fj-n_0000000000) [n:127.0.0.1:33913_u_%2Fj ] o.a.s.c.OverseerTaskProcessor Process current queue of overseer operations
[junit4] 2> 2696575 INFO (OverseerStateUpdate-94851893663825924-127.0.0.1:33913_u_%2Fj-n_0000000000) [n:127.0.0.1:33913_u_%2Fj ] o.a.s.c.Overseer Starting to work on the main queue
[junit4] 2> 2696584 INFO (TEST-PKIAuthenticationIntegrationTest.testPkiAuth-seed#[CA4757D498DE9F88]) [n:127.0.0.1:33913_u_%2Fj ] o.a.s.c.CoreContainer Security conf doesn't exist. Skipping setup for authorization module.
[junit4] 2> 2696584 INFO (TEST-PKIAuthenticationIntegrationTest.testPkiAuth-seed#[CA4757D498DE9F88]) [n:127.0.0.1:33913_u_%2Fj ] o.a.s.c.CoreContainer No authentication plugin used.
[junit4] 2> 2696585 INFO (TEST-PKIAuthenticationIntegrationTest.testPkiAuth-seed#[CA4757D498DE9F88]) [n:127.0.0.1:33913_u_%2Fj ] o.a.s.c.CoresLocator Looking for core definitions underneath /export/home/jenkins/workspace/Lucene-Solr-5.x-Solaris/solr/build/solr-core/test/J1/../../../../../../../../../../export/home/jenkins/workspace/Lucene-Solr-5.x-Solaris/solr/build/solr-core/test/J1/temp/solr.security.PKIAuthenticationIntegrationTest_CA4757D498DE9F88-001/control-001/cores
[junit4] 2> 2696586 INFO (TEST-PKIAuthenticationIntegrationTest.testPkiAuth-seed#[CA4757D498DE9F88]) [n:127.0.0.1:33913_u_%2Fj ] o.a.s.c.SolrCore Created CoreDescriptor: {name=collection1, config=solrconfig.xml, transient=false, schema=schema.xml, loadOnStartup=true, configSetProperties=configsetprops.json, instanceDir=/export/home/jenkins/workspace/Lucene-Solr-5.x-Solaris/solr/build/solr-core/test/J1/../../../../../../../../../../export/home/jenkins/workspace/Lucene-Solr-5.x-Solaris/solr/build/solr-core/test/J1/temp/solr.security.PKIAuthenticationIntegrationTest_CA4757D498DE9F88-001/control-001/cores/collection1, collection=control_collection, absoluteInstDir=/export/home/jenkins/workspace/Lucene-Solr-5.x-Solaris/solr/build/solr-core/test/J1/../../../../../../../../../../export/home/jenkins/workspace/Lucene-Solr-5.x-Solaris/solr/build/solr-core/test/J1/temp/solr.security.PKIAuthenticationIntegrationTest_CA4757D498DE9F88-001/control-001/cores/collection1/, coreNodeName=, dataDir=data/, shard=}
[junit4] 2> 2696586 INFO (TEST-PKIAuthenticationIntegrationTest.testPkiAuth-seed#[CA4757D498DE9F88]) [n:127.0.0.1:33913_u_%2Fj ] o.a.s.c.CoresLocator Found core collection1 in /export/home/jenkins/workspace/Lucene-Solr-5.x-Solaris/solr/build/solr-core/test/J1/../../../../../../../../../../export/home/jenkins/workspace/Lucene-Solr-5.x-Solaris/solr/build/solr-core/test/J1/temp/solr.security.PKIAuthenticationIntegrationTest_CA4757D498DE9F88-001/control-001/cores/collection1/
[junit4] 2> 2696586 INFO (TEST-PKIAuthenticationIntegrationTest.testPkiAuth-seed#[CA4757D498DE9F88]) [n:127.0.0.1:33913_u_%2Fj ] o.a.s.c.CoresLocator Found 1 core definitions
[junit4] 2> 2696588 INFO (TEST-PKIAuthenticationIntegrationTest.testPkiAuth-seed#[CA4757D498DE9F88]) [n:127.0.0.1:33913_u_%2Fj ] o.a.s.s.SolrDispatchFilter user.dir=/export/home/jenkins/workspace/Lucene-Solr-5.x-Solaris/solr/build/solr-core/test/J1
[junit4] 2> 2696588 INFO (TEST-PKIAuthenticationIntegrationTest.testPkiAuth-seed#[CA4757D498DE9F88]) [n:127.0.0.1:33913_u_%2Fj ] o.a.s.s.SolrDispatchFilter SolrDispatchFilter.init() done
[junit4] 2> 2696589 INFO (coreLoadExecutor-10016-thread-1-processing-n:127.0.0.1:33913_u_%2Fj) [n:127.0.0.1:33913_u_%2Fj c:control_collection x:collection1] o.a.s.c.ZkController publishing state=down
[junit4] 2> 2696589 INFO (coreLoadExecutor-10016-thread-1-processing-n:127.0.0.1:33913_u_%2Fj) [n:127.0.0.1:33913_u_%2Fj c:control_collection x:collection1] o.a.s.c.ZkController numShards not found on descriptor - reading it from system property
[junit4] 2> 2696592 INFO (OverseerStateUpdate-94851893663825924-127.0.0.1:33913_u_%2Fj-n_0000000000) [n:127.0.0.1:33913_u_%2Fj ] o.a.s.c.Overseer processMessage: queueSize: 1, message = {
[junit4] 2> "core":"collection1",
[junit4] 2> "roles":null,
[junit4] 2> "base_url":"http://127.0.0.1:33913/u_/j",
[junit4] 2> "node_name":"127.0.0.1:33913_u_%2Fj",
[junit4] 2> "numShards":"1",
[junit4] 2> "state":"down",
[junit4] 2> "shard":null,
[junit4] 2> "collection":"control_collection",
[junit4] 2> "operation":"state"} current state version: 0
[junit4] 2> 2696592 INFO (OverseerStateUpdate-94851893663825924-127.0.0.1:33913_u_%2Fj-n_0000000000) [n:127.0.0.1:33913_u_%2Fj ] o.a.s.c.o.ReplicaMutator Update state numShards=1 message={
[junit4] 2> "core":"collection1",
[junit4] 2> "roles":null,
[junit4] 2> "base_url":"http://127.0.0.1:33913/u_/j",
[junit4] 2> "node_name":"127.0.0.1:33913_u_%2Fj",
[junit4] 2> "numShards":"1",
[junit4] 2> "state":"down",
[junit4] 2> "shard":null,
[junit4] 2> "collection":"control_collection",
[junit4] 2> "operation":"state"}
[junit4] 2> 2696592 INFO (coreLoadExecutor-10016-thread-1-processing-n:127.0.0.1:33913_u_%2Fj) [n:127.0.0.1:33913_u_%2Fj c:control_collection x:collection1] o.a.s.c.ZkController look for our core node name
[junit4] 2> 2696593 INFO (OverseerStateUpdate-94851893663825924-127.0.0.1:33913_u_%2Fj-n_0000000000) [n:127.0.0.1:33913_u_%2Fj ] o.a.s.c.o.ClusterStateMutator building a new cName: control_collection
[junit4] 2> 2696593 INFO (OverseerStateUpdate-94851893663825924-127.0.0.1:33913_u_%2Fj-n_0000000000) [n:127.0.0.1:33913_u_%2Fj ] o.a.s.c.o.ReplicaMutator Assigning new node to shard shard=shard1
[junit4] 2> 2696595 INFO (zkCallback-2849-thread-1-processing-n:127.0.0.1:33913_u_%2Fj) [n:127.0.0.1:33913_u_%2Fj ] o.a.s.c.c.ZkStateReader A cluster state change: WatchedEvent state:SyncConnected type:NodeDataChanged path:/clusterstate.json, has occurred - updating... (live nodes size: 1)
[junit4] 2> 2697594 INFO (coreLoadExecutor-10016-thread-1-processing-n:127.0.0.1:33913_u_%2Fj) [n:127.0.0.1:33913_u_%2Fj c:control_collection x:collection1] o.a.s.c.ZkController waiting to find shard id in clusterstate for collection1
[junit4] 2> 2697594 INFO (coreLoadExecutor-10016-thread-1-processing-n:127.0.0.1:33913_u_%2Fj) [n:127.0.0.1:33913_u_%2Fj c:control_collection x:collection1] o.a.s.c.ZkController Check for collection zkNode:control_collection
[junit4] 2> 2697594 INFO (coreLoadExecutor-10016-thread-1-processing-n:127.0.0.1:33913_u_%2Fj) [n:127.0.0.1:33913_u_%2Fj c:control_collection x:collection1] o.a.s.c.ZkController Collection zkNode exists
[junit4] 2> 2697595 INFO (coreLoadExecutor-10016-thread-1-processing-n:127.0.0.1:33913_u_%2Fj) [n:127.0.0.1:33913_u_%2Fj c:control_collection x:collection1] o.a.s.c.c.ZkStateReader Load collection config from:/collections/control_collection
[junit4] 2> 2697596 INFO (coreLoadExecutor-10016-thread-1-processing-n:127.0.0.1:33913_u_%2Fj) [n:127.0.0.1:33913_u_%2Fj c:control_collection x:collection1] o.a.s.c.c.ZkStateReader path=/collections/control_collection configName=conf1 specified config exists in ZooKeeper
[junit4] 2> 2697596 INFO (coreLoadExecutor-10016-thread-1-processing-n:127.0.0.1:33913_u_%2Fj) [n:127.0.0.1:33913_u_%2Fj c:control_collection x:collection1] o.a.s.c.SolrResourceLoader new SolrResourceLoader for directory: '/export/home/jenkins/workspace/Lucene-Solr-5.x-Solaris/solr/build/solr-core/test/J1/../../../../../../../../../../export/home/jenkins/workspace/Lucene-Solr-5.x-Solaris/solr/build/solr-core/test/J1/temp/solr.security.PKIAuthenticationIntegrationTest_CA4757D498DE9F88-001/control-001/cores/collection1/'
[junit4] 2> 2697596 INFO (coreLoadExecutor-10016-thread-1-processing-n:127.0.0.1:33913_u_%2Fj) [n:127.0.0.1:33913_u_%2Fj c:control_collection x:collection1] o.a.s.c.SolrResourceLoader JNDI not configured for solr (NoInitialContextEx)
[junit4] 2> 2697596 INFO (coreLoadExecutor-10016-thread-1-processing-n:127.0.0.1:33913_u_%2Fj) [n:127.0.0.1:33913_u_%2Fj c:control_collection x:collection1] o.a.s.c.SolrResourceLoader solr home defaulted to 'solr/' (could not find system property or JNDI)
[junit4] 2> 2697612 INFO (coreLoadExecutor-10016-thread-1-processing-n:127.0.0.1:33913_u_%2Fj) [n:127.0.0.1:33913_u_%2Fj c:control_collection x:collection1] o.a.s.c.Config loaded config solrconfig.xml with version 0
[junit4] 2> 2697616 INFO (coreLoadExecutor-10016-thread-1-processing-n:127.0.0.1:33913_u_%2Fj) [n:127.0.0.1:33913_u_%2Fj c:control_collection x:collection1] o.a.s.c.SolrConfig current version of requestparams : -1
[junit4] 2> 2697618 INFO (coreLoadExecutor-10016-thread-1-processing-n:127.0.0.1:33913_u_%2Fj) [n:127.0.0.1:33913_u_%2Fj c:control_collection x:collection1] o.a.s.c.SolrConfig Using Lucene MatchVersion: 5.4.0
[junit4] 2> 2697622 INFO (coreLoadExecutor-10016-thread-1-processing-n:127.0.0.1:33913_u_%2Fj) [n:127.0.0.1:33913_u_%2Fj c:control_collection x:collection1] o.a.s.c.Config Loaded SolrConfig: solrconfig.xml
[junit4] 2> 2697624 INFO (coreLoadExecutor-10016-thread-1-processing-n:127.0.0.1:33913_u_%2Fj) [n:127.0.0.1:33913_u_%2Fj c:control_collection x:collection1] o.a.s.s.IndexSchema Reading Solr Schema from /configs/conf1/schema.xml
[junit4] 2> 2697627 INFO (coreLoadExecutor-10016-thread-1-processing-n:127.0.0.1:33913_u_%2Fj) [n:127.0.0.1:33913_u_%2Fj c:control_collection x:collection1] o.a.s.s.IndexSchema [collection1] Schema name=test
[junit4] 2> 2697688 INFO (coreLoadExecutor-10016-thread-1-processing-n:127.0.0.1:33913_u_%2Fj) [n:127.0.0.1:33913_u_%2Fj c:control_collection x:collection1] o.a.s.s.OpenExchangeRatesOrgProvider Initialized with rates=open-exchange-rates.json, refreshInterval=1440.
[junit4] 2> 2697693 INFO (coreLoadExecutor-10016-thread-1-processing-n:127.0.0.1:33913_u_%2Fj) [n:127.0.0.1:33913_u_%2Fj c:control_collection x:collection1] o.a.s.s.IndexSchema default search field in schema is text
[junit4] 2> 2697693 INFO (coreLoadExecutor-10016-thread-1-processing-n:127.0.0.1:33913_u_%2Fj) [n:127.0.0.1:33913_u_%2Fj c:control_collection x:collection1] o.a.s.s.IndexSchema unique key field: id
[junit4] 2> 2697704 INFO (coreLoadExecutor-10016-thread-1-processing-n:127.0.0.1:33913_u_%2Fj) [n:127.0.0.1:33913_u_%2Fj c:control_collection x:collection1] o.a.s.s.FileExchangeRateProvider Reloading exchange rates from file currency.xml
[junit4] 2> 2697706 INFO (coreLoadExecutor-10016-thread-1-processing-n:127.0.0.1:33913_u_%2Fj) [n:127.0.0.1:33913_u_%2Fj c:control_collection x:collection1] o.a.s.s.FileExchangeRateProvider Reloading exchange rates from file currency.xml
[junit4] 2> 2697708 INFO (coreLoadExecutor-10016-thread-1-processing-n:127.0.0.1:33913_u_%2Fj) [n:127.0.0.1:33913_u_%2Fj c:control_collection x:collection1] o.a.s.s.OpenExchangeRatesOrgProvider Reloading exchange rates from open-exchange-rates.json
[junit4] 2> 2697709 WARN (coreLoadExecutor-10016-thread-1-processing-n:127.0.0.1:33913_u_%2Fj) [n:127.0.0.1:33913_u_%2Fj c:control_collection x:collection1] o.a.s.s.OpenExchangeRatesOrgProvider Unknown key IMPORTANT NOTE
[junit4] 2> 2697709 WARN (coreLoadExecutor-10016-thread-1-processing-n:127.0.0.1:33913_u_%2Fj) [n:127.0.0.1:33913_u_%2Fj c:control_collection x:collection1] o.a.s.s.OpenExchangeRatesOrgProvider Expected key, got STRING
[junit4] 2> 2697709 INFO (coreLoadExecutor-10016-thread-1-processing-n:127.0.0.1:33913_u_%2Fj) [n:127.0.0.1:33913_u_%2Fj c:control_collection x:collection1] o.a.s.s.OpenExchangeRatesOrgProvider Reloading exchange rates from open-exchange-rates.json
[junit4] 2> 2697710 WARN (coreLoadExecutor-10016-thread-1-processing-n:127.0.0.1:33913_u_%2Fj) [n:127.0.0.1:33913_u_%2Fj c:control_collection x:collection1] o.a.s.s.OpenExchangeRatesOrgProvider Unknown key IMPORTANT NOTE
[junit4] 2> 2697710 WARN (coreLoadExecutor-10016-thread-1-processing-n:127.0.0.1:33913_u_%2Fj) [n:127.0.0.1:33913_u_%2Fj c:control_collection x:collection1] o.a.s.s.OpenExchangeRatesOrgProvider Expected key, got STRING
[junit4] 2> 2697711 INFO (coreLoadExecutor-10016-thread-1-processing-n:127.0.0.1:33913_u_%2Fj) [n:127.0.0.1:33913_u_%2Fj c:control_collection x:collection1] o.a.s.c.ConfigSetProperties Did not find ConfigSet properties, assuming default properties: Can't find resource 'configsetprops.json' in classpath or '/configs/conf1', cwd=/export/home/jenkins/workspace/Lucene-Solr-5.x-Solaris/solr/build/solr-core/test/J1
[junit4] 2> 2697711 INFO (coreLoadExecutor-10016-thread-1-processing-n:127.0.0.1:33913_u_%2Fj) [n:127.0.0.1:33913_u_%2Fj c:control_collection x:collection1] o.a.s.c.CoreContainer Creating SolrCore 'collection1' using configuration from collection control_collection
[junit4] 2> 2697712 INFO (coreLoadExecutor-10016-thread-1-processing-n:127.0.0.1:33913_u_%2Fj) [n:127.0.0.1:33913_u_%2Fj c:control_collection s:shard1 r:core_node1 x:collection1] o.a.s.c.SolrCore org.apache.solr.core.MockDirectoryFactory
[junit4] 2> 2697712 INFO (coreLoadExecutor-10016-thread-1-processing-n:127.0.0.1:33913_u_%2Fj) [n:127.0.0.1:33913_u_%2Fj c:control_collection s:shard1 r:core_node1 x:collection1] o.a.s.c.SolrCore [[collection1] ] Opening new SolrCore at [/export/home/jenkins/workspace/Lucene-Solr-5.x-Solaris/solr/build/solr-core/test/J1/../../../../../../../../../../export/home/jenkins/workspace/Lucene-Solr-5.x-Solaris/solr/build/solr-core/test/J1/temp/solr.security.PKIAuthenticationIntegrationTest_CA4757D498DE9F88-001/control-001/cores/collection1/], dataDir=[null]
[junit4] 2> 2697712 INFO (coreLoadExecutor-10016-thread-1-processing-n:127.0.0.1:33913_u_%2Fj) [n:127.0.0.1:33913_u_%2Fj c:control_collection s:shard1 r:core_node1 x:collection1] o.a.s.c.JmxMonitoredMap JMX monitoring is enabled. Adding Solr mbeans to JMX Server: com.sun.jmx.mbeanserver.JmxMBeanServer@53889303
[junit4] 2> 2697712 INFO (coreLoadExecutor-10016-thread-1-processing-n:127.0.0.1:33913_u_%2Fj) [n:127.0.0.1:33913_u_%2Fj c:control_collection s:shard1 r:core_node1 x:collection1] o.a.s.c.CachingDirectoryFactory return new directory for /export/home/jenkins/workspace/Lucene-Solr-5.x-Solaris/solr/build/solr-core/test/J1/../../../../../../../../../../export/home/jenkins/workspace/Lucene-Solr-5.x-Solaris/solr/build/solr-core/test/J1/temp/solr.security.PKIAuthenticationIntegrationTest_CA4757D498DE9F88-001/control-001/cores/collection1/data
[junit4] 2> 2697712 INFO (coreLoadExecutor-10016-thread-1-processing-n:127.0.0.1:33913_u_%2Fj) [n:127.0.0.1:33913_u_%2Fj c:control_collection s:shard1 r:core_node1 x:collection1] o.a.s.c.SolrCore New index directory detected: old=null new=/export/home/jenkins/workspace/Lucene-Solr-5.x-Solaris/solr/build/solr-core/test/J1/../../../../../../../../../../export/home/jenkins/workspace/Lucene-Solr-5.x-Solaris/solr/build/solr-core/test/J1/temp/solr.security.PKIAuthenticationIntegrationTest_CA4757D498DE9F88-001/control-001/cores/collection1/data/index/
[junit4] 2> 2697712 WARN (coreLoadExecutor-10016-thread-1-processing-n:127.0.0.1:33913_u_%2Fj) [n:127.0.0.1:33913_u_%2Fj c:control_collection s:shard1 r:core_node1 x:collection1] o.a.s.c.SolrCore [collection1] Solr index directory '/export/home/jenkins/workspace/Lucene-Solr-5.x-Solaris/solr/build/solr-core/test/J1/../../../../../../../../../../export/home/jenkins/workspace/Lucene-Solr-5.x-Solaris/solr/build/solr-core/test/J1/temp/solr.security.PKIAuthenticationIntegrationTest_CA4757D498DE9F88-001/control-001/cores/collection1/data/index' doesn't exist. Creating new index...
[junit4] 2> 2697713 INFO (coreLoadExecutor-10016-thread-1-processing-n:127.0.0.1:33913_u_%2Fj) [n:127.0.0.1:33913_u_%2Fj c:control_collection s:shard1 r:core_node1 x:collection1] o.a.s.c.CachingDirectoryFactory return new directory for /export/home/jenkins/workspace/Lucene-Solr-5.x-Solaris/solr/build/solr-core/test/J1/../../../../../../../../../../export/home/jenkins/workspace/Lucene-Solr-5.x-Solaris/solr/build/solr-core/test/J1/temp/solr.security.PKIAuthenticationIntegrationTest_CA4757D498DE9F88-001/control-001/cores/collection1/data/index
[junit4] 2> 2697713 INFO (coreLoadExecutor-10016-thread-1-processing-n:127.0.0.1:33913_u_%2Fj) [n:127.0.0.1:33913_u_%2Fj c:control_collection s:shard1 r:core_node1 x:collection1] o.a.s.u.RandomMergePolicy RandomMergePolicy wrapping class org.apache.lucene.index.LogByteSizeMergePolicy: [LogByteSizeMergePolicy: minMergeSize=1677721, mergeFactor=39, maxMergeSize=2147483648, maxMergeSizeForForcedMerge=9223372036854775807, calibrateSizeByDeletes=false, maxMergeDocs=2147483647, maxCFSSegmentSizeMB=8.796093022207999E12, noCFSRatio=0.0]
[junit4] 2> 2697713 INFO (coreLoadExecutor-10016-thread-1-processing-n:127.0.0.1:33913_u_%2Fj) [n:127.0.0.1:33913_u_%2Fj c:control_collection s:shard1 r:core_node1 x:collection1] o.a.s.c.SolrCore SolrDeletionPolicy.onCommit: commits: num=1
[junit4] 2> commit{dir=MockDirectoryWrapper(RAMDirectory@627c0f44 lockFactory=org.apache.lucene.store.SingleInstanceLockFactory@3befe4c3),segFN=segments_1,generation=1}
[junit4] 2> 2697713 INFO (coreLoadExecutor-10016-thread-1-processing-n:127.0.0.1:33913_u_%2Fj) [n:127.0.0.1:33913_u_%2Fj c:control_collection s:shard1 r:core_node1 x:collection1] o.a.s.c.SolrCore newest commit generation = 1
[junit4] 2> 2697713 INFO (OldIndexDirectoryCleanupThreadForCore-collection1) [n:127.0.0.1:33913_u_%2Fj c:control_collection s:shard1 r:core_node1 x:collection1] o.a.s.c.SolrCore Looking for old index directories to cleanup for core collection1 in /export/home/jenkins/workspace/Lucene-Solr-5.x-Solaris/solr/build/solr-core/test/J1/../../../../../../../../../../export/home/jenkins/workspace/Lucene-Solr-5.x-Solaris/solr/build/solr-core/test/J1/temp/solr.security.PKIAuthenticationIntegrationTest_CA4757D498DE9F88-001/control-001/cores/collection1/data/
[junit4] 2> 2697714 WARN (OldIndexDirectoryCleanupThreadForCore-collection1) [n:127.0.0.1:33913_u_%2Fj c:control_collection s:shard1 r:core_node1 x:collection1] o.a.s.c.DirectoryFactory /export/home/jenkins/workspace/Lucene-Solr-5.x-Solaris/solr/build/solr-core/test/J1/../../../../../../../../../../export/home/jenkins/workspace/Lucene-Solr-5.x-Solaris/solr/build/solr-core/test/J1/temp/solr.security.PKIAuthenticationIntegrationTest_CA4757D498DE9F88-001/control-001/cores/collection1/data/ does not point to a valid data directory; skipping clean-up of old index directories.
[junit4] 2> 2697716 INFO (coreLoadExecutor-10016-thread-1-processing-n:127.0.0.1:33913_u_%2Fj) [n:127.0.0.1:33913_u_%2Fj c:control_collection s:shard1 r:core_node1 x:collection1] o.a.s.u.p.UpdateRequestProcessorChain creating updateRequestProcessorChain "nodistrib"
[junit4] 2> 2697717 INFO (coreLoadExecutor-10016-thread-1-processing-n:127.0.0.1:33913_u_%2Fj) [n:127.0.0.1:33913_u_%2Fj c:control_collection s:shard1 r:core_node1 x:collection1] o.a.s.u.p.UpdateRequestProcessorChain creating updateRequestProcessorChain "dedupe"
[junit4] 2> 2697717 INFO (coreLoadExecutor-10016-thread-1-processing-n:127.0.0.1:33913_u_%2Fj) [n:127.0.0.1:33913_u_%2Fj c:control_collection s:shard1 r:core_node1 x:collection1] o.a.s.u.p.UpdateRequestProcessorChain inserting DistributedUpdateProcessorFactory into updateRequestProcessorChain "dedupe"
[junit4] 2> 2697717 INFO (coreLoadExecutor-10016-thread-1-processing-n:127.0.0.1:33913_u_%2Fj) [n:127.0.0.1:33913_u_%2Fj c:control_collection s:shard1 r:core_node1 x:collection1] o.a.s.u.p.UpdateRequestProcessorChain creating updateRequestProcessorChain "stored_sig"
[junit4] 2> 2697717 INFO (coreLoadExecutor-10016-thread-1-processing-n:127.0.0.1:33913_u_%2Fj) [n:127.0.0.1:33913_u_%2Fj c:control_collection s:shard1 r:core_node1 x:collection1] o.a.s.u.p.UpdateRequestProcessorChain inserting DistributedUpdateProcessorFactory into updateRequestProcessorChain "stored_sig"
[junit4] 2> 2697717 INFO (coreLoadExecutor-10016-thread-1-processing-n:127.0.0.1:33913_u_%2Fj) [n:127.0.0.1:33913_u_%2Fj c:control_collection s:shard1 r:core_node1 x:collection1] o.a.s.u.p.UpdateRequestProcessorChain creating updateRequestProcessorChain "distrib-dup-test-chain-explicit"
[junit4] 2> 2697717 INFO (coreLoadExecutor-10016-thread-1-processing-n:127.0.0.1:33913_u_%2Fj) [n:127.0.0.1:33913_u_%2Fj c:control_collection s:shard1 r:core_node1 x:collection1] o.a.s.u.p.UpdateRequestProcessorChain creating updateRequestProcessorChain "distrib-dup-test-chain-implicit"
[junit4] 2> 2697717 INFO (coreLoadExecutor-10016-thread-1-processing-n:127.0.0.1:33913_u_%2Fj) [n:127.0.0.1:33913_u_%2Fj c:control_collection s:shard1 r:core_node1 x:collection1] o.a.s.u.p.UpdateRequestProcessorChain inserting DistributedUpdateProcessorFactory into updateRequestProcessorChain "distrib-dup-test-chain-implicit"
[junit4] 2> 2697717 INFO (coreLoadExecutor-10016-thread-1-processing-n:127.0.0.1:33913_u_%2Fj) [n:127.0.0.1:33913_u_%2Fj c:control_collection s:shard1 r:core_node1 x:collection1] o.a.s.c.SolrCore no updateRequestProcessorChain defined as default, creating implicit default
[junit4] 2> 2697717 WARN (coreLoadExecutor-10016-thread-1-processing-n:127.0.0.1:33913_u_%2Fj) [n:127.0.0.1:33913_u_%2Fj c:control_collection s:shard1 r:core_node1 x:collection1] o.a.s.c.RequestHandlers INVALID paramSet a in requestHandler {type = requestHandler,name = /dump,class = DumpRequestHandler,args = {defaults={a=A,b=B}}}
[junit4] 2> 2697719 INFO (coreLoadExecutor-10016-thread-1-processing-n:127.0.0.1:33913_u_%2Fj) [n:127.0.0.1:33913_u_%2Fj c:control_collection s:shard1 r:core_node1 x:collection1] o.a.s.h.l.XMLLoader xsltCacheLifetimeSeconds=60
[junit4] 2> 2697720 INFO (coreLoadExecutor-10016-thread-1-processing-n:127.0.0.1:33913_u_%2Fj) [n:127.0.0.1:33913_u_%2Fj c:control_collection s:shard1 r:core_node1 x:collection1] o.a.s.h.l.XMLLoader xsltCacheLifetimeSeconds=60
[junit4] 2> 2697721 INFO (coreLoadExecutor-10016-thread-1-processing-n:127.0.0.1:33913_u_%2Fj) [n:127.0.0.1:33913_u_%2Fj c:control_collection s:shard1 r:core_node1 x:collection1] o.a.s.h.l.XMLLoader xsltCacheLifetimeSeconds=60
[junit4] 2> 2697722 INFO (coreLoadExecutor-10016-thread-1-processing-n:127.0.0.1:33913_u_%2Fj) [n:127.0.0.1:33913_u_%2Fj c:control_collection s:shard1 r:core_node1 x:collection1] o.a.s.h.l.XMLLoader xsltCacheLifetimeSeconds=60
[junit4] 2> 2697725 INFO (coreLoadExecutor-10016-thread-1-processing-n:127.0.0.1:33913_u_%2Fj) [n:127.0.0.1:33913_u_%2Fj c:control_collection s:shard1 r:core_node1 x:collection1] o.a.s.c.RequestHandlers Registered paths: /admin/mbeans,standard,/dump,/update/csv,/update/json/docs,/admin/luke,/admin/segments,/get,/admin/system,/replication,/admin/properties,/config,/schema,/admin/plugins,/admin/logging,/update/json,/admin/threads,/admin/ping,/update,/admin/file
[junit4] 2> 2697725 INFO (coreLoadExecutor-10016-thread-1-processing-n:127.0.0.1:33913_u_%2Fj) [n:127.0.0.1:33913_u_%2Fj c:control_collection s:shard1 r:core_node1 x:collection1] o.a.s.c.SolrCore Using default statsCache cache: org.apache.solr.search.stats.LocalStatsCache
[junit4] 2> 2697725 INFO (coreLoadExecutor-10016-thread-1-processing-n:127.0.0.1:33913_u_%2Fj) [n:127.0.0.1:33913_u_%2Fj c:control_collection s:shard1 r:core_node1 x:collection1] o.a.s.u.UpdateHandler Using UpdateLog implementation: org.apache.solr.update.UpdateLog
[junit4] 2> 2697725 INFO (coreLoadExecutor-10016-thread-1-processing-n:127.0.0.1:33913_u_%2Fj) [n:127.0.0.1:33913_u_%2Fj c:control_collection s:shard1 r:core_node1 x:collection1] o.a.s.u.UpdateLog Initializing UpdateLog: dataDir= defaultSyncLevel=FLUSH numRecordsToKeep=100 maxNumLogsToKeep=10 numVersionBuckets=65536
[junit4] 2> 2697726 INFO (coreLoadExecutor-10016-thread-1-processing-n:127.0.0.1:33913_u_%2Fj) [n:127.0.0.1:33913_u_%2Fj c:control_collection s:shard1 r:core_node1 x:collection1] o.a.s.c.SolrCore Hard AutoCommit: disabled
[junit4] 2> 2697726 INFO (coreLoadExecutor-10016-thread-1-processing-n:127.0.0.1:33913_u_%2Fj) [n:127.0.0.1:33913_u_%2Fj c:control_collection s:shard1 r:core_node1 x:collection1] o.a.s.c.SolrCore Soft AutoCommit: disabled
[junit4] 2> 2697727 INFO (coreLoadExecutor-10016-thread-1-processing-n:127.0.0.1:33913_u_%2Fj) [n:127.0.0.1:33913_u_%2Fj c:control_collection s:shard1 r:core_node1 x:collection1] o.a.s.u.RandomMergePolicy RandomMergePolicy wrapping class org.apache.lucene.index.LogDocMergePolicy: [LogDocMergePolicy: minMergeSize=1000, mergeFactor=22, maxMergeSize=9223372036854775807, maxMergeSizeForForcedMerge=9223372036854775807, calibrateSizeByDeletes=true, maxMergeDocs=2147483647, maxCFSSegmentSizeMB=8.796093022207999E12, noCFSRatio=1.0]
[junit4] 2> 2697727 INFO (coreLoadExecutor-10016-thread-1-processing-n:127.0.0.1:33913_u_%2Fj) [n:127.0.0.1:33913_u_%2Fj c:control_collection s:shard1 r:core_node1 x:collection1] o.a.s.c.SolrCore SolrDeletionPolicy.onInit: commits: num=1
[junit4] 2> commit{dir=MockDirectoryWrapper(RAMDirectory@627c0f44 lockFactory=org.apache.lucene.store.SingleInstanceLockFactory@3befe4c3),segFN=segments_1,generation=1}
[junit4] 2> 2697727 INFO (coreLoadExecutor-10016-thread-1-processing-n:127.0.0.1:33913_u_%2Fj) [n:127.0.0.1:33913_u_%2Fj c:control_collection s:shard1 r:core_node1 x:collection1] o.a.s.c.SolrCore newest commit generation = 1
[junit4] 2> 2697727 INFO (coreLoadExecutor-10016-thread-1-processing-n:127.0.0.1:33913_u_%2Fj) [n:127.0.0.1:33913_u_%2Fj c:control_collection s:shard1 r:core_node1 x:collection1] o.a.s.s.SolrIndexSearcher Opening Searcher@6bc2139f[collection1] main
[junit4] 2> 2697727 INFO (coreLoadExecutor-10016-thread-1-processing-n:127.0.0.1:33913_u_%2Fj) [n:127.0.0.1:33913_u_%2Fj c:control_collection s:shard1 r:core_node1 x:collection1] o.a.s.c.c.ZkStateReader Load collection config from:/collections/control_collection
[junit4] 2> 2697728 INFO (coreLoadExecutor-10016-thread-1-processing-n:127.0.0.1:33913_u_%2Fj) [n:127.0.0.1:33913_u_%2Fj c:control_collection s:shard1 r:core_node1 x:collection1] o.a.s.c.c.ZkStateReader path=/collections/control_collection configName=conf1 specified config exists in ZooKeeper
[junit4] 2> 2697728 INFO (coreLoadExecutor-10016-thread-1-processing-n:127.0.0.1:33913_u_%2Fj) [n:127.0.0.1:33913_u_%2Fj c:control_collection s:shard1 r:core_node1 x:collection1] o.a.s.r.ManagedResourceStorage Setting up ZooKeeper-based storage for the RestManager with znodeBase: /configs/conf1
[junit4] 2> 2697729 INFO (coreLoadExecutor-10016-thread-1-processing-n:127.0.0.1:33913_u_%2Fj) [n:127.0.0.1:33913_u_%2Fj c:control_collection s:shard1 r:core_node1 x:collection1] o.a.s.r.ManagedResourceStorage Configured ZooKeeperStorageIO with znodeBase: /configs/conf1
[junit4] 2> 2697729 INFO (coreLoadExecutor-10016-thread-1-processing-n:127.0.0.1:33913_u_%2Fj) [n:127.0.0.1:33913_u_%2Fj c:control_collection s:shard1 r:core_node1 x:collection1] o.a.s.r.RestManager Initializing RestManager with initArgs: {}
[junit4] 2> 2697729 INFO (coreLoadExecutor-10016-thread-1-processing-n:127.0.0.1:33913_u_%2Fj) [n:127.0.0.1:33913_u_%2Fj c:control_collection s:shard1 r:core_node1 x:collection1] o.a.s.r.ManagedResourceStorage Reading _rest_managed.json using ZooKeeperStorageIO:path=/configs/conf1
[junit4] 2> 2697729 INFO (coreLoadExecutor-10016-thread-1-processing-n:127.0.0.1:33913_u_%2Fj) [n:127.0.0.1:33913_u_%2Fj c:control_collection s:shard1 r:core_node1 x:collection1] o.a.s.r.ManagedResourceStorage No data found for znode /configs/conf1/_rest_managed.json
[junit4] 2> 2697729 INFO (coreLoadExecutor-10016-thread-1-processing-n:127.0.0.1:33913_u_%2Fj) [n:127.0.0.1:33913_u_%2Fj c:control_collection s:shard1 r:core_node1 x:collection1] o.a.s.r.ManagedResourceStorage Loaded null at path _rest_managed.json using ZooKeeperStorageIO:path=/configs/conf1
[junit4] 2> 2697730 INFO (coreLoadExecutor-10016-thread-1-processing-n:127.0.0.1:33913_u_%2Fj) [n:127.0.0.1:33913_u_%2Fj c:control_collection s:shard1 r:core_node1 x:collection1] o.a.s.r.RestManager Initializing 0 registered ManagedResources
[junit4] 2> 2697730 INFO (coreLoadExecutor-10016-thread-1-processing-n:127.0.0.1:33913_u_%2Fj) [n:127.0.0.1:33913_u_%2Fj c:control_collection s:shard1 r:core_node1 x:collection1] o.a.s.h.ReplicationHandler Commits will be reserved for 10000
[junit4] 2> 2697730 INFO (searcherExecutor-10017-thread-1-processing-n:127.0.0.1:33913_u_%2Fj x:collection1 s:shard1 c:control_collection r:core_node1) [n:127.0.0.1:33913_u_%2Fj c:control_collection s:shard1 r:core_node1 x:collection1] o.a.s.c.SolrCore [collection1] Registered new searcher Searcher@6bc2139f[collection1] main{ExitableDirectoryReader(UninvertingDirectoryReader())}
[junit4] 2> 2697730 INFO (coreLoadExecutor-10016-thread-1-processing-n:127.0.0.1:33913_u_%2Fj) [n:127.0.0.1:33913_u_%2Fj c:control_collection s:shard1 r:core_node1 x:collection1] o.a.s.u.UpdateLog Looking up max value of version field to seed version buckets
[junit4] 2> 2697730 INFO (coreLoadExecutor-10016-thread-1-processing-n:127.0.0.1:33913_u_%2Fj) [n:127.0.0.1:33913_u_%2Fj c:control_collection s:shard1 r:core_node1 x:collection1] o.a.s.u.VersionInfo Refreshing highest value of _version_ for 65536 version buckets from index
[junit4] 2> 2697730 INFO (coreLoadExecutor-10016-thread-1-processing-n:127.0.0.1:33913_u_%2Fj) [n:127.0.0.1:33913_u_%2Fj c:control_collection s:shard1 r:core_node1 x:collection1] o.a.s.u.VersionInfo No terms found for _version_, cannot seed version bucket highest value from index
[junit4] 2> 2697730 INFO (coreLoadExecutor-10016-thread-1-processing-n:127.0.0.1:33913_u_%2Fj) [n:127.0.0.1:33913_u_%2Fj c:control_collection s:shard1 r:core_node1 x:collection1] o.a.s.u.UpdateLog Could not find max version in index or recent updates, using new clock 1517630300245458944
[junit4] 2> 2697732 INFO (coreLoadExecutor-10016-thread-1-processing-n:127.0.0.1:33913_u_%2Fj) [n:127.0.0.1:33913_u_%2Fj c:control_collection s:shard1 r:core_node1 x:collection1] o.a.s.u.UpdateLog Took 2.0ms to seed version buckets with highest version 1517630300245458944
[junit4] 2> 2697733 INFO (coreLoadExecutor-10016-thread-1-processing-n:127.0.0.1:33913_u_%2Fj) [n:127.0.0.1:33913_u_%2Fj c:control_collection s:shard1 r:core_node1 x:collection1] o.a.s.c.ZkController watch zkdir /configs/conf1
[junit4] 2> 2697733 INFO (coreLoadExecutor-10016-thread-1-processing-n:127.0.0.1:33913_u_%2Fj) [n:127.0.0.1:33913_u_%2Fj c:control_collection s:shard1 r:core_node1 x:collection1] o.a.s.c.CoreContainer registering core: collection1
[junit4] 2> 2697734 INFO (coreZkRegister-10010-thread-1-processing-n:127.0.0.1:33913_u_%2Fj x:collection1 s:shard1 c:control_collection r:core_node1) [n:127.0.0.1:33913_u_%2Fj c:control_collection s:shard1 r:core_node1 x:collection1] o.a.s.c.ZkController Register replica - core:collection1 address:http://127.0.0.1:33913/u_/j collection:control_collection shard:shard1
[junit4] 2> 2697735 INFO (coreZkRegister-10010-thread-1-processing-n:127.0.0.1:33913_u_%2Fj x:collection1 s:shard1 c:control_collection r:core_node1) [n:127.0.0.1:33913_u_%2Fj c:control_collection s:shard1 r:core_node1 x:collection1] o.a.s.c.c.SolrZkClient makePath: /collections/control_collection/leader_elect/shard1/election
[junit4] 2> 2697740 INFO (coreZkRegister-10010-thread-1-processing-n:127.0.0.1:33913_u_%2Fj x:collection1 s:shard1 c:control_collection r:core_node1) [n:127.0.0.1:33913_u_%2Fj c:control_collection s:shard1 r:core_node1 x:collection1] o.a.s.c.LeaderElector Joined leadership election with path: /collections/control_collection/leader_elect/shard1/election/94851893663825924-core_node1-n_0000000000
[junit4] 2> 2697740 INFO (coreZkRegister-10010-thread-1-processing-n:127.0.0.1:33913_u_%2Fj x:collection1 s:shard1 c:control_collection r:core_node1) [n:127.0.0.1:33913_u_%2Fj c:control_collection s:shard1 r:core_node1 x:collection1] o.a.s.c.ShardLeaderElectionContext Running the leader process for shard shard1
[junit4] 2> 2697743 INFO (coreZkRegister-10010-thread-1-processing-n:127.0.0.1:33913_u_%2Fj x:collection1 s:shard1 c:control_collection r:core_node1) [n:127.0.0.1:33913_u_%2Fj c:control_collection s:shard1 r:core_node1 x:collection1] o.a.s.c.ShardLeaderElectionContext Enough replicas found to continue.
[junit4] 2> 2697743 INFO (coreZkRegister-10010-thread-1-processing-n:127.0.0.1:33913_u_%2Fj x:collection1 s:shard1 c:control_collection r:core_node1) [n:127.0.0.1:33913_u_%2Fj c:control_collection s:shard1 r:core_node1 x:collection1] o.a.s.c.ShardLeaderElectionContext I may be the new leader - try and sync
[junit4] 2> 2697743 INFO (coreZkRegister-10010-thread-1-processing-n:127.0.0.1:33913_u_%2Fj x:collection1 s:shard1 c:control_collection r:core_node1) [n:127.0.0.1:33913_u_%2Fj c:control_collection s:shard1 r:core_node1 x:collection1] o.a.s.c.SyncStrategy Sync replicas to http://127.0.0.1:33913/u_/j/collection1/
[junit4] 2> 2697743 INFO (coreZkRegister-10010-thread-1-processing-n:127.0.0.1:33913_u_%2Fj x:collection1 s:shard1 c:control_collection r:core_node1) [n:127.0.0.1:33913_u_%2Fj c:control_collection s:shard1 r:core_node1 x:collection1] o.a.s.c.SyncStrategy Sync Success - now sync replicas to me
[junit4] 2> 2697743 INFO (coreZkRegister-10010-thread-1-processing-n:127.0.0.1:33913_u_%2Fj x:collection1 s:shard1 c:control_collection r:core_node1) [n:127.0.0.1:33913_u_%2Fj c:control_collection s:shard1 r:core_node1 x:collection1] o.a.s.c.SyncStrategy http://127.0.0.1:33913/u_/j/collection1/ has no replicas
[junit4] 2> 2697743 INFO (coreZkRegister-10010-thread-1-processing-n:127.0.0.1:33913_u_%2Fj x:collection1 s:shard1 c:control_collection r:core_node1) [n:127.0.0.1:33913_u_%2Fj c:control_collection s:shard1 r:core_node1 x:collection1] o.a.s.c.ShardLeaderElectionContext I am the new leader: http://127.0.0.1:33913/u_/j/collection1/ shard1
[junit4] 2> 2697743 INFO (OverseerStateUpdate-94851893663825924-127.0.0.1:33913_u_%2Fj-n_0000000000) [n:127.0.0.1:33913_u_%2Fj ] o.a.s.c.Overseer processMessage: queueSize: 1, message = {
[junit4] 2> "operation":"leader",
[junit4] 2> "shard":"shard1",
[junit4] 2> "collection":"control_collection"} current state version: 1
[junit4] 2> 2697744 INFO (coreZkRegister-10010-thread-1-processing-n:127.0.0.1:33913_u_%2Fj x:collection1 s:shard1 c:control_collection r:core_node1) [n:127.0.0.1:33913_u_%2Fj c:control_collection s:shard1 r:core_node1 x:collection1] o.a.s.c.c.SolrZkClient makePath: /collections/control_collection/leaders/shard1
[junit4] 2> 2697748 INFO (coreZkRegister-10010-thread-1-processing-n:127.0.0.1:33913_u_%2Fj x:collection1 s:shard1 c:control_collection r:core_node1) [n:127.0.0.1:33913_u_%2Fj c:control_collection s:shard1 r:core_node1 x:collection1] o.a.s.c.ShardLeaderElectionContextBase Creating leader registration node
[junit4] 2> 2697752 INFO (OverseerStateUpdate-94851893663825924-127.0.0.1:33913_u_%2Fj-n_0000000000) [n:127.0.0.1:33913_u_%2Fj ] o.a.s.c.Overseer processMessage: queueSize: 1, message = {
[junit4] 2> "operation":"leader",
[junit4] 2> "shard":"shard1",
[junit4] 2> "collection":"control_collection",
[junit4] 2> "base_url":"http://127.0.0.1:33913/u_/j",
[junit4] 2> "core":"collection1",
[junit4] 2> "state":"active"} current state version: 1
[junit4] 2> 2697856 INFO (zkCallback-2849-thread-1-processing-n:127.0.0.1:33913_u_%2Fj) [n:127.0.0.1:33913_u_%2Fj ] o.a.s.c.c.ZkStateReader A cluster state change: WatchedEvent state:SyncConnected type:NodeDataChanged path:/clusterstate.json, has occurred - updating... (live nodes size: 1)
[junit4] 2> 2697903 INFO (coreZkRegister-10010-thread-1-processing-n:127.0.0.1:33913_u_%2Fj x:collection1 s:shard1 c:control_collection r:core_node1) [n:127.0.0.1:33913_u_%2Fj c:control_collection s:shard1 r:core_node1 x:collection1] o.a.s.c.ZkController We are http://127.0.0.1:33913/u_/j/collection1/ and leader is http://127.0.0.1:33913/u_/j/collection1/
[junit4] 2> 2697903 INFO (coreZkRegister-10010-thread-1-processing-n:127.0.0.1:33913_u_%2Fj x:collection1 s:shard1 c:control_collection r:core_node1) [n:127.0.0.1:33913_u_%2Fj c:control_collection s:shard1 r:core_node1 x:collection1] o.a.s.c.ZkController No LogReplay needed for core=collection1 baseURL=http://127.0.0.1:33913/u_/j
[junit4] 2> 2697903 INFO (coreZkRegister-10010-thread-1-processing-n:127.0.0.1:33913_u_%2Fj x:collection1 s:shard1 c:control_collection r:core_node1) [n:127.0.0.1:33913_u_%2Fj c:control_collection s:shard1 r:core_node1 x:collection1] o.a.s.c.ZkController I am the leader, no recovery necessary
[junit4] 2> 2697903 INFO (coreZkRegister-10010-thread-1-processing-n:127.0.0.1:33913_u_%2Fj x:collection1 s:shard1 c:control_collection r:core_node1) [n:127.0.0.1:33913_u_%2Fj c:control_collection s:shard1 r:core_node1 x:collection1] o.a.s.c.ZkController publishing state=active
[junit4] 2> 2697903 INFO (coreZkRegister-10010-thread-1-processing-n:127.0.0.1:33913_u_%2Fj x:collection1 s:shard1 c:control_collection r:core_node1) [n:127.0.0.1:33913_u_%2Fj c:control_collection s:shard1 r:core_node1 x:collection1] o.a.s.c.ZkController numShards not found on descriptor - reading it from system property
[junit4] 2> 2697906 INFO (OverseerStateUpdate-94851893663825924-127.0.0.1:33913_u_%2Fj-n_0000000000) [n:127.0.0.1:33913_u_%2Fj ] o.a.s.c.Overseer processMessage: queueSize: 1, message = {
[junit4] 2> "core":"collection1",
[junit4] 2> "core_node_name":"core_node1",
[junit4] 2> "roles":null,
[junit4] 2> "base_url":"http://127.0.0.1:33913/u_/j",
[junit4] 2> "node_name":"127.0.0.1:33913_u_%2Fj",
[junit4] 2> "numShards":"1",
[junit4] 2> "state":"active",
[junit4] 2> "shard":"shard1",
[junit4] 2> "collection":"control_collection",
[junit4] 2> "operation":"state"} current state version: 2
[junit4] 2> 2697906 INFO (OverseerStateUpdate-94851893663825924-127.0.0.1:33913_u_%2Fj-n_0000000000) [n:127.0.0.1:33913_u_%2Fj ] o.a.s.c.o.ReplicaMutator Update state numShards=1 message={
[junit4] 2> "core":"collection1",
[junit4] 2> "core_node_name":"core_node1",
[junit4] 2> "roles":null,
[junit4] 2> "base_url":"http://127.0.0.1:33913/u_/j",
[junit4] 2> "node_name":"127.0.0.1:33913_u_%2Fj",
[junit4] 2> "numShards":"1",
[junit4] 2> "state":"active",
[junit4] 2> "shard":"shard1",
[junit4] 2> "collection":"control_collection",
[junit4] 2> "operation":"state"}
[junit4] 2> 2698009 INFO (zkCallback-2849-thread-1-processing-n:127.0.0.1:33913_u_%2Fj) [n:127.0.0.1:33913_u_%2Fj ] o.a.s.c.c.ZkStateReader A cluster state change: WatchedEvent state:SyncConnected type:NodeDataChanged path:/clusterstate.json, has occurred - updating... (live nodes size: 1)
[junit4] 2> 2698092 INFO (TEST-PKIAuthenticationIntegrationTest.testPkiAuth-seed#[CA4757D498DE9F88]) [ ] o.a.s.c.c.SolrZkClient Using default ZkCredentialsProvider
[junit4] 2> 2698092 INFO (TEST-PKIAuthenticationIntegrationTest.testPkiAuth-seed#[CA4757D498DE9F88]) [ ] o.a.s.c.c.ConnectionManager Waiting for client to connect to ZooKeeper
[junit4] 2> 2698094 INFO (zkCallback-2851-thread-1) [ ] o.a.s.c.c.ConnectionManager Watcher org.apache.solr.common.cloud.ConnectionManager@1d0736a9 name:ZooKeeperConnection Watcher:127.0.0.1:45447/solr got event WatchedEvent state:SyncConnected type:None path:null path:null type:None
[junit4] 2> 2698094 INFO (TEST-PKIAuthenticationIntegrationTest.testPkiAuth-seed#[CA4757D498DE9F88]) [ ] o.a.s.c.c.ConnectionManager Client is connected to ZooKeeper
[junit4] 2> 2698094 INFO (TEST-PKIAuthenticationIntegrationTest.testPkiAuth-seed#[CA4757D498DE9F88]) [ ] o.a.s.c.c.SolrZkClient Using default ZkACLProvider
[junit4] 2> 2698094 INFO (TEST-PKIAuthenticationIntegrationTest.testPkiAuth-seed#[CA4757D498DE9F88]) [ ] o.a.s.c.c.ZkStateReader Updating cluster state from ZooKeeper...
[junit4] 2> 2698097 INFO (TEST-PKIAuthenticationIntegrationTest.testPkiAuth-seed#[CA4757D498DE9F88]) [ ] o.a.s.c.ChaosMonkey monkey: init - expire sessions:false cause connection loss:false
[junit4] 2> 2698869 INFO (TEST-PKIAuthenticationIntegrationTest.testPkiAuth-seed#[CA4757D498DE9F88]) [ ] o.a.s.SolrTestCaseJ4 Writing core.properties file to /export/home/jenkins/workspace/Lucene-Solr-5.x-Solaris/solr/build/solr-core/test/J1/temp/solr.security.PKIAuthenticationIntegrationTest_CA4757D498DE9F88-001/shard-1-001/cores/collection1
[junit4] 2> 2698870 INFO (TEST-PKIAuthenticationIntegrationTest.testPkiAuth-seed#[CA4757D498DE9F88]) [ ] o.a.s.c.AbstractFullDistribZkTestBase create jetty 1 in directory /export/home/jenkins/workspace/Lucene-Solr-5.x-Solaris/solr/build/solr-core/test/J1/temp/solr.security.PKIAuthenticationIntegrationTest_CA4757D498DE9F88-001/shard-1-001
[junit4] 2> 2698871 INFO (TEST-PKIAuthenticationIntegrationTest.testPkiAuth-seed#[CA4757D498DE9F88]) [ ] o.e.j.s.Server jetty-9.2.13.v20150730
[junit4] 2> 2698876 INFO (TEST-PKIAuthenticationIntegrationTest.testPkiAuth-seed#[CA4757D498DE9F88]) [ ] o.e.j.s.h.ContextHandler Started o.e.j.s.ServletContextHandler@86cde2{/u_/j,null,AVAILABLE}
[junit4] 2> 2698876 INFO (TEST-PKIAuthenticationIntegrationTest.testPkiAuth-seed#[CA4757D498DE9F88]) [ ] o.e.j.s.ServerConnector Started ServerConnector@6ee678b7{HTTP/1.1}{127.0.0.1:46532}
[junit4] 2> 2698877 INFO (TEST-PKIAuthenticationIntegrationTest.testPkiAuth-seed#[CA4757D498DE9F88]) [ ] o.e.j.s.Server Started @2703803ms
[junit4] 2> 2698877 INFO (TEST-PKIAuthenticationIntegrationTest.testPkiAuth-seed#[CA4757D498DE9F88]) [ ] o.a.s.c.s.e.JettySolrRunner Jetty properties: {solr.data.dir=/export/home/jenkins/workspace/Lucene-Solr-5.x-Solaris/solr/build/solr-core/test/J1/temp/solr.security.PKIAuthenticationIntegrationTest_CA4757D498DE9F88-001/tempDir-001/jetty1, solrconfig=solrconfig.xml, hostContext=/u_/j, hostPort=46532, coreRootDirectory=/export/home/jenkins/workspace/Lucene-Solr-5.x-Solaris/solr/build/solr-core/test/J1/../../../../../../../../../../export/home/jenkins/workspace/Lucene-Solr-5.x-Solaris/solr/build/solr-core/test/J1/temp/solr.security.PKIAuthenticationIntegrationTest_CA4757D498DE9F88-001/shard-1-001/cores}
[junit4] 2> 2698877 INFO (TEST-PKIAuthenticationIntegrationTest.testPkiAuth-seed#[CA4757D498DE9F88]) [ ] o.a.s.s.SolrDispatchFilter SolrDispatchFilter.init(): sun.misc.Launcher$AppClassLoader@659e0bfd
[junit4] 2> 2698877 INFO (TEST-PKIAuthenticationIntegrationTest.testPkiAuth-seed#[CA4757D498DE9F88]) [ ] o.a.s.c.SolrResourceLoader new SolrResourceLoader for directory: '/export/home/jenkins/workspace/Lucene-Solr-5.x-Solaris/solr/build/solr-core/test/J1/../../../../../../../../../../export/home/jenkins/workspace/Lucene-Solr-5.x-Solaris/solr/build/solr-core/test/J1/temp/solr.security.PKIAuthenticationIntegrationTest_CA4757D498DE9F88-001/shard-1-001/'
[junit4] 2> 2698878 INFO (TEST-PKIAuthenticationIntegrationTest.testPkiAuth-seed#[CA4757D498DE9F88]) [ ] o.a.s.c.SolrResourceLoader JNDI not configured for solr (NoInitialContextEx)
[junit4] 2> 2698878 INFO (TEST-PKIAuthenticationIntegrationTest.testPkiAuth-seed#[CA4757D498DE9F88]) [ ] o.a.s.c.SolrResourceLoader solr home defaulted to 'solr/' (could not find system property or JNDI)
[junit4] 2> 2698901 INFO (TEST-PKIAuthenticationIntegrationTest.testPkiAuth-seed#[CA4757D498DE9F88]) [ ] o.a.s.c.c.SolrZkClient Using default ZkCredentialsProvider
[junit4] 2> 2698901 INFO (TEST-PKIAuthenticationIntegrationTest.testPkiAuth-seed#[CA4757D498DE9F88]) [ ] o.a.s.c.c.ConnectionManager Waiting for client to connect to ZooKeeper
[junit4] 2> 2698903 INFO (zkCallback-2852-thread-1) [ ] o.a.s.c.c.ConnectionManager Watcher org.apache.solr.common.cloud.ConnectionManager@63bc9a10 name:ZooKeeperConnection Watcher:127.0.0.1:45447/solr got event WatchedEvent state:SyncConnected type:None path:null path:null type:None
[junit4] 2> 2698903 INFO (TEST-PKIAuthenticationIntegrationTest.testPkiAuth-seed#[CA4757D498DE9F88]) [ ] o.a.s.c.c.ConnectionManager Client is connected to ZooKeeper
[junit4] 2> 2698903 INFO (TEST-PKIAuthenticationIntegrationTest.testPkiAuth-seed#[CA4757D498DE9F88]) [ ] o.a.s.c.c.SolrZkClient Using default ZkACLProvider
[junit4] 2> 2698905 INFO (TEST-PKIAuthenticationIntegrationTest.testPkiAuth-seed#[CA4757D498DE9F88]) [ ] o.a.s.s.SolrDispatchFilter Loading solr.xml from SolrHome (not found in ZooKeeper)
[junit4] 2> 2698905 INFO (TEST-PKIAuthenticationIntegrationTest.testPkiAuth-seed#[CA4757D498DE9F88]) [ ] o.a.s.c.SolrXmlConfig Loading container configuration from /export/home/jenkins/workspace/Lucene-Solr-5.x-Solaris/solr/build/solr-core/test/J1/../../../../../../../../../../export/home/jenkins/workspace/Lucene-Solr-5.x-Solaris/solr/build/solr-core/test/J1/temp/solr.security.PKIAuthenticationIntegrationTest_CA4757D498DE9F88-001/shard-1-001/solr.xml
[junit4] 2> 2698908 INFO (TEST-PKIAuthenticationIntegrationTest.testPkiAuth-seed#[CA4757D498DE9F88]) [ ] o.a.s.c.CoresLocator Config-defined core root directory: /export/home/jenkins/workspace/Lucene-Solr-5.x-Solaris/solr/build/solr-core/test/J1/../../../../../../../../../../export/home/jenkins/workspace/Lucene-Solr-5.x-Solaris/solr/build/solr-core/test/J1/temp/solr.security.PKIAuthenticationIntegrationTest_CA4757D498DE9F88-001/shard-1-001/cores
[junit4] 2> 2698908 INFO (TEST-PKIAuthenticationIntegrationTest.testPkiAuth-seed#[CA4757D498DE9F88]) [ ] o.a.s.c.CoreContainer New CoreContainer 1167265062
[junit4] 2> 2698908 INFO (TEST-PKIAuthenticationIntegrationTest.testPkiAuth-seed#[CA4757D498DE9F88]) [ ] o.a.s.c.CoreContainer Loading cores into CoreContainer [instanceDir=/export/home/jenkins/workspace/Lucene-Solr-5.x-Solaris/solr/build/solr-core/test/J1/../../../../../../../../../../export/home/jenkins/workspace/Lucene-Solr-5.x-Solaris/solr/build/solr-core/test/J1/temp/solr.security.PKIAuthenticationIntegrationTest_CA4757D498DE9F88-001/shard-1-001/]
[junit4] 2> 2698908 INFO (TEST-PKIAuthenticationIntegrationTest.testPkiAuth-seed#[CA4757D498DE9F88]) [ ] o.a.s.c.CoreContainer loading shared library: /export/home/jenkins/workspace/Lucene-Solr-5.x-Solaris/solr/build/solr-core/test/J1/../../../../../../../../../../export/home/jenkins/workspace/Lucene-Solr-5.x-Solaris/solr/build/solr-core/test/J1/temp/solr.security.PKIAuthenticationIntegrationTest_CA4757D498DE9F88-001/shard-1-001/lib
[junit4] 2> 2698908 WARN (TEST-PKIAuthenticationIntegrationTest.testPkiAuth-seed#[CA4757D498DE9F88]) [ ] o.a.s.c.SolrResourceLoader Can't find (or read) directory to add to classloader: lib (resolved as: /export/home/jenkins/workspace/Lucene-Solr-5.x-Solaris/solr/build/solr-core/test/J1/../../../../../../../../../../export/home/jenkins/workspace/Lucene-Solr-5.x-Solaris/solr/build/solr-core/test/J1/temp/solr.security.PKIAuthenticationIntegrationTest_CA4757D498DE9F88-001/shard-1-001/lib).
[junit4] 2> 2698916 INFO (TEST-PKIAuthenticationIntegrationTest.testPkiAuth-seed#[CA4757D498DE9F88]) [ ] o.a.s.h.c.HttpShardHandlerFactory created with socketTimeout : 90000,urlScheme : ,connTimeout : 15000,maxConnectionsPerHost : 20,maxConnections : 10000,corePoolSize : 0,maximumPoolSize : 2147483647,maxThreadIdleTime : 5,sizeOfQueue : -1,fairnessPolicy : false,useRetries : false,
[junit4] 2> 2698917 INFO (TEST-PKIAuthenticationIntegrationTest.testPkiAuth-seed#[CA4757D498DE9F88]) [ ] o.a.s.u.UpdateShardHandler Creating UpdateShardHandler HTTP client with params: socketTimeout=340000&connTimeout=45000&retry=true
[junit4] 2> 2698917 INFO (TEST-PKIAuthenticationIntegrationTest.testPkiAuth-seed#[CA4757D498DE9F88]) [ ] o.a.s.l.LogWatcher SLF4J impl is org.slf4j.impl.Log4jLoggerFactory
[junit4] 2> 2698917 INFO (TEST-PKIAuthenticationIntegrationTest.testPkiAuth-seed#[CA4757D498DE9F88]) [ ] o.a.s.l.LogWatcher Registering Log Listener [Log4j (org.slf4j.impl.Log4jLoggerFactory)]
[junit4] 2> 2698917 INFO (TEST-PKIAuthenticationIntegrationTest.testPkiAuth-seed#[CA4757D498DE9F88]) [ ] o.a.s.c.ZkContainer Zookeeper client=127.0.0.1:45447/solr
[junit4] 2> 2698917 INFO (TEST-PKIAuthenticationIntegrationTest.testPkiAuth-seed#[CA4757D498DE9F88]) [ ] o.a.s.c.ZkController zkHost includes chroot
[junit4] 2> 2698917 INFO (TEST-PKIAuthenticationIntegrationTest.testPkiAuth-seed#[CA4757D498DE9F88]) [ ] o.a.s.c.c.SolrZkClient Using default ZkCredentialsProvider
[junit4] 2> 2698918 INFO (TEST-PKIAuthenticationIntegrationTest.testPkiAuth-seed#[CA4757D498DE9F88]) [ ] o.a.s.c.c.ConnectionManager Waiting for client to connect to ZooKeeper
[junit4] 2> 2698920 INFO (zkCallback-2854-thread-1) [ ] o.a.s.c.c.ConnectionManager Watcher org.apache.solr.common.cloud.ConnectionManager@5f6747c0 name:ZooKeeperConnection Watcher:127.0.0.1:45447 got event WatchedEvent state:SyncConnected type:None path:null path:null type:None
[junit4] 2> 2698920 INFO (TEST-PKIAuthenticationIntegrationTest.testPkiAuth-seed#[CA4757D498DE9F88]) [ ] o.a.s.c.c.ConnectionManager Client is connected to ZooKeeper
[junit4] 2> 2698921 INFO (TEST-PKIAuthenticationIntegrationTest.testPkiAuth-seed#[CA4757D498DE9F88]) [ ] o.a.s.c.c.SolrZkClient Using default ZkACLProvider
[junit4] 2> 2698922 INFO (TEST-PKIAuthenticationIntegrationTest.testPkiAuth-seed#[CA4757D498DE9F88]) [n:127.0.0.1:46532_u_%2Fj ] o.a.s.c.c.ConnectionManager Waiting for client to connect to ZooKeeper
[junit4] 2> 2698923 INFO (zkCallback-2855-thread-1-processing-n:127.0.0.1:46532_u_%2Fj) [n:127.0.0.1:46532_u_%2Fj ] o.a.s.c.c.ConnectionManager Watcher org.apache.solr.common.cloud.ConnectionManager@43ef95f3 name:ZooKeeperConnection Watcher:127.0.0.1:45447/solr got event WatchedEvent state:SyncConnected type:None path:null path:null type:None
[junit4] 2> 2698924 INFO (TEST-PKIAuthenticationIntegrationTest.testPkiAuth-seed#[CA4757D498DE9F88]) [n:127.0.0.1:46532_u_%2Fj ] o.a.s.c.c.ConnectionManager Client is connected to ZooKeeper
[junit4] 2> 2698930 INFO (TEST-PKIAuthenticationIntegrationTest.testPkiAuth-seed#[CA4757D498DE9F88]) [n:127.0.0.1:46532_u_%2Fj ] o.a.s.c.c.ZkStateReader Updating cluster state from ZooKeeper...
[junit4] 2> 2699944 INFO (TEST-PKIAuthenticationIntegrationTest.testPkiAuth-seed#[CA4757D498DE9F88]) [n:127.0.0.1:46532_u_%2Fj ] o.a.s.c.ZkController Register node as live in ZooKeeper:/live_nodes/127.0.0.1:46532_u_%2Fj
[junit4] 2> 2699944 INFO (TEST-PKIAuthenticationIntegrationTest.testPkiAuth-seed#[CA4757D498DE9F88]) [n:127.0.0.1:46532_u_%2Fj ] o.a.s.c.c.SolrZkClient makePath: /live_nodes/127.0.0.1:46532_u_%2Fj
[junit4] 2> 2699946 INFO (zkCallback-2849-thread-1-processing-n:127.0.0.1:33913_u_%2Fj) [n:127.0.0.1:33913_u_%2Fj ] o.a.s.c.c.ZkStateReader A live node change: WatchedEvent state:SyncConnected type:NodeChildrenChanged path:/live_nodes, has occurred - updating... (live nodes size: 1)
[junit4] 2> 2699946 INFO (zkCallback-2855-thread-1-processing-n:127.0.0.1:46532_u_%2Fj) [n:127.0.0.1:46532_u_%2Fj ] o.a.s.c.c.ZkStateReader A live node change: WatchedEvent state:SyncConnected type:NodeChildrenChanged path:/live_nodes, has occurred - updating... (live nodes size: 1)
[junit4] 2> 2699946 INFO (zkCallback-2851-thread-1) [ ] o.a.s.c.c.ZkStateReader A live node change: WatchedEvent state:SyncConnected type:NodeChildrenChanged path:/live_nodes, has occurred - updating... (live nodes size: 1)
[junit4] 2> 2699949 INFO (TEST-PKIAuthenticationIntegrationTest.testPkiAuth-seed#[CA4757D498DE9F88]) [n:127.0.0.1:46532_u_%2Fj ] o.a.s.c.Overseer Overseer (id=null) closing
[junit4] 2> 2699949 INFO (TEST-PKIAuthenticationIntegrationTest.testPkiAuth-seed#[CA4757D498DE9F88]) [n:127.0.0.1:46532_u_%2Fj ] o.a.s.c.LeaderElector Joined leadership election with path: /overseer_elect/election/94851893663825928-127.0.0.1:46532_u_%2Fj-n_0000000001
[junit4] 2> 2699950 INFO (TEST-PKIAuthenticationIntegrationTest.testPkiAuth-seed#[CA4757D498DE9F88]) [n:127.0.0.1:46532_u_%2Fj ] o.a.s.c.LeaderElector Watching path /overseer_elect/election/94851893663825924-127.0.0.1:33913_u_%2Fj-n_0000000000 to know if I could be the leader
[junit4] 2> 2699957 INFO (TEST-PKIAuthenticationIntegrationTest.testPkiAuth-seed#[CA4757D498DE9F88]) [n:127.0.0.1:46532_u_%2Fj ] o.a.s.c.CoreContainer Security conf doesn't exist. Skipping setup for authorization module.
[junit4] 2> 2699957 INFO (TEST-PKIAuthenticationIntegrationTest.testPkiAuth-seed#[CA4757D498DE9F88]) [n:127.0.0.1:46532_u_%2Fj ] o.a.s.c.CoreContainer No authentication plugin used.
[junit4] 2> 2699958 INFO (TEST-PKIAuthenticationIntegrationTest.testPkiAuth-seed#[CA4757D498DE9F88]) [n:127.0.0.1:46532_u_%2Fj ] o.a.s.c.CoresLocator Looking for core definitions underneath /export/home/jenkins/workspace/Lucene-Solr-5.x-Solaris/solr/build/solr-core/test/J1/../../../../../../../../../../export/home/jenkins/workspace/Lucene-Solr-5.x-Solaris/solr/build/solr-core/test/J1/temp/solr.security.PKIAuthenticationIntegrationTest_CA4757D498DE9F88-001/shard-1-001/cores
[junit4] 2> 2699959 INFO (TEST-PKIAuthenticationIntegrationTest.testPkiAuth-seed#[CA4757D498DE9F88]) [n:127.0.0.1:46532_u_%2Fj ] o.a.s.c.SolrCore Created CoreDescriptor: {name=collection1, config=solrconfig.xml, transient=false, schema=schema.xml, loadOnStartup=true, configSetProperties=configsetprops.json, instanceDir=/export/home/jenkins/workspace/Lucene-Solr-5.x-Solaris/solr/build/solr-core/test/J1/../../../../../../../../../../export/home/jenkins/workspace/Lucene-Solr-5.x-Solaris/solr/build/solr-core/test/J1/temp/solr.security.PKIAuthenticationIntegrationTest_CA4757D498DE9F88-001/shard-1-001/cores/collection1, collection=collection1, absoluteInstDir=/export/home/jenkins/workspace/Lucene-Solr-5.x-Solaris/solr/build/solr-core/test/J1/../../../../../../../../../../export/home/jenkins/workspace/Lucene-Solr-5.x-Solaris/solr/build/solr-core/test/J1/temp/solr.security.PKIAuthenticationIntegrationTest_CA4757D498DE9F88-001/shard-1-001/cores/collection1/, coreNodeName=, dataDir=data/, shard=}
[junit4] 2> 2699959 INFO (TEST-PKIAuthenticationIntegrationTest.testPkiAuth-seed#[CA4757D498DE9F88]) [n:127.0.0.1:46532_u_%2Fj ] o.a.s.c.CoresLocator Found core collection1 in /export/home/jenkins/workspace/Lucene-Solr-5.x-Solaris/solr/build/solr-core/test/J1/../../../../../../../../../../export/home/jenkins/workspace/Lucene-Solr-5.x-Solaris/solr/build/solr-core/test/J1/temp/solr.security.PKIAuthenticationIntegrationTest_CA4757D498DE9F88-001/shard-1-001/cores/collection1/
[junit4] 2> 2699959 INFO (TEST-PKIAuthenticationIntegrationTest.testPkiAuth-seed#[CA4757D498DE9F88]) [n:127.0.0.1:46532_u_%2Fj ] o.a.s.c.CoresLocator Found 1 core definitions
[junit4] 2> 2699960 INFO (TEST-PKIAuthenticationIntegrationTest.testPkiAuth-seed#[CA4757D498DE9F88]) [n:127.0.0.1:46532_u_%2Fj ] o.a.s.s.SolrDispatchFilter user.dir=/export/home/jenkins/workspace/Lucene-Solr-5.x-Solaris/solr/build/solr-core/test/J1
[junit4] 2> 2699960 INFO (TEST-PKIAuthenticationIntegrationTest.testPkiAuth-seed#[CA4757D498DE9F88]) [n:127.0.0.1:46532_u_%2Fj ] o.a.s.s.SolrDispatchFilter SolrDispatchFilter.init() done
[junit4] 2> 2699961 INFO (coreLoadExecutor-10027-thread-1-processing-n:127.0.0.1:46532_u_%2Fj) [n:127.0.0.1:46532_u_%2Fj c:collection1 x:collection1] o.a.s.c.ZkController publishing state=down
[junit4] 2> 2699961 INFO (coreLoadExecutor-10027-thread-1-processing-n:127.0.0.1:46532_u_%2Fj) [n:127.0.0.1:46532_u_%2Fj c:collection1 x:collection1] o.a.s.c.ZkController numShards not found on descriptor - reading it from system property
[junit4] 2> 2699964 INFO (OverseerStateUpdate-94851893663825924-127.0.0.1:33913_u_%2Fj-n_0000000000) [n:127.0.0.1:33913_u_%2Fj ] o.a.s.c.Overseer processMessage: queueSize: 1, message = {
[junit4] 2> "core":"collection1",
[junit4] 2> "roles":null,
[junit4] 2> "base_url":"http://127.0.0.1:46532/u_/j",
[junit4] 2> "node_name":"127.0.0.1:46532_u_%2Fj",
[junit4] 2> "numShards":"2",
[junit4] 2> "state":"down",
[junit4] 2> "shard":null,
[junit4] 2> "collection":"collection1",
[junit4] 2> "operation":"state"} current state version: 3
[junit4] 2> 2699964 INFO (OverseerStateUpdate-94851893663825924-127.0.0.1:33913_u_%2Fj-n_0000000000) [n:127.0.0.1:33913_u_%2Fj ] o.a.s.c.o.ReplicaMutator Update state numShards=2 message={
[junit4] 2> "core":"collection1",
[junit4] 2> "roles":null,
[junit4] 2> "base_url":"http://127.0.0.1:46532/u_/j",
[junit4] 2> "node_name":"127.0.0.1:46532_u_%2Fj",
[junit4] 2> "numShards":"2",
[junit4] 2> "state":"down",
[junit4] 2> "shard":null,
[junit4] 2> "collection":"collection1",
[junit4] 2> "operation":"state"}
[junit4] 2> 2699965 INFO (OverseerStateUpdate-94851893663825924-127.0.0.1:33913_u_%2Fj-n_0000000000) [n:127.0.0.1:33913_u_%2Fj ] o.a.s.c.o.ClusterStateMutator building a new cName: collection1
[junit4] 2> 2699965 INFO (coreLoadExecutor-10027-thread-1-processing-n:127.0.0.1:46532_u_%2Fj) [n:127.0.0.1:46532_u_%2Fj c:collection1 x:collection1] o.a.s.c.ZkController look for our core node name
[junit4] 2> 2699965 INFO (OverseerStateUpdate-94851893663825924-127.0.0.1:33913_u_%2Fj-n_0000000000) [n:127.0.0.1:33913_u_%2Fj ] o.a.s.c.o.ReplicaMutator Assigning new node to shard shard=shard2
[junit4] 2> 2699966 INFO (zkCallback-2849-thread-1-processing-n:127.0.0.1:33913_u_%2Fj) [n:127.0.0.1:33913_u_%2Fj ] o.a.s.c.c.ZkStateReader A cluster state change: WatchedEvent state:SyncConnected type:NodeDataChanged path:/clusterstate.json, has occurred - updating... (live nodes size: 2)
[junit4] 2> 2699966 INFO (zkCallback-2851-thread-1) [ ] o.a.s.c.c.ZkStateReader A cluster state change: WatchedEvent state:SyncConnected type:NodeDataChanged path:/clusterstate.json, has occurred - updating... (live nodes size: 2)
[junit4] 2> 2699966 INFO (zkCallback-2855-thread-1-processing-n:127.0.0.1:46532_u_%2Fj) [n:127.0.0.1:46532_u_%2Fj ] o.a.s.c.c.ZkStateReader A cluster state change: WatchedEvent state:SyncConnected type:NodeDataChanged path:/clusterstate.json, has occurred - updating... (live nodes size: 2)
[junit4] 2> 2700966 INFO (coreLoadExecutor-10027-thread-1-processing-n:127.0.0.1:46532_u_%2Fj) [n:127.0.0.1:46532_u_%2Fj c:collection1 x:collection1] o.a.s.c.ZkController waiting to find shard id in clusterstate for collection1
[junit4] 2> 2700966 INFO (coreLoadExecutor-10027-thread-1-processing-n:127.0.0.1:46532_u_%2Fj) [n:127.0.0.1:46532_u_%2Fj c:collection1 x:collection1] o.a.s.c.ZkController Check for collection zkNode:collection1
[junit4] 2> 2700967 INFO (coreLoadExecutor-10027-thread-1-processing-n:127.0.0.1:46532_u_%2Fj) [n:127.0.0.1:46532_u_%2Fj c:collection1 x:collection1] o.a.s.c.ZkController Collection zkNode exists
[junit4] 2> 2700967 INFO (coreLoadExecutor-10027-thread-1-processing-n:127.0.0.1:46532_u_%2Fj) [n:127.0.0.1:46532_u_%2Fj c:collection1 x:collection1] o.a.s.c.c.ZkStateReader Load collection config from:/collections/collection1
[junit4] 2> 2700968 INFO (coreLoadExecutor-10027-thread-1-processing-n:127.0.0.1:46532_u_%2Fj) [n:127.0.0.1:46532_u_%2Fj c:collection1 x:collection1] o.a.s.c.c.ZkStateReader path=/collections/collection1 configName=conf1 specified config exists in ZooKeeper
[junit4] 2> 2700968 INFO (coreLoadExecutor-10027-thread-1-processing-n:127.0.0.1:46532_u_%2Fj) [n:127.0.0.1:46532_u_%2Fj c:collection1 x:collection1] o.a.s.c.SolrResourceLoader new SolrResourceLoader for directory: '/export/home/jenkins/workspace/Lucene-Solr-5.x-Solaris/solr/build/solr-core/test/J1/../../../../../../../../../../export/home/jenkins/workspace/Lucene-Solr-5.x-Solaris/solr/build/solr-core/test/J1/temp/solr.security.PKIAuthenticationIntegrationTest_CA4757D498DE9F88-001/shard-1-001/cores/collection1/'
[junit4] 2> 2700968 INFO (coreLoadExecutor-10027-thread-1-processing-n:127.0.0.1:46532_u_%2Fj) [n:127.0.0.1:46532_u_%2Fj c:collection1 x:collection1] o.a.s.c.SolrResourceLoader JNDI not configured for solr (NoInitialContextEx)
[junit4] 2> 2700968 INFO (coreLoadExecutor-10027-thread-1-processing-n:127.0.0.1:46532_u_%2Fj) [n:127.0.0.1:46532_u_%2Fj c:collection1 x:collection1] o.a.s.c.SolrResourceLoader solr home defaulted to 'solr/' (could not find system property or JNDI)
[junit4] 2> 2700983 INFO (coreLoadExecutor-10027-thread-1-processing-n:127.0.0.1:46532_u_%2Fj) [n:127.0.0.1:46532_u_%2Fj c:collection1 x:collection1] o.a.s.c.Config loaded config solrconfig.xml with version 0
[junit4] 2> 2700988 INFO (coreLoadExecutor-10027-thread-1-processing-n:127.0.0.1:46532_u_%2Fj) [n:127.0.0.1:46532_u_%2Fj c:collection1 x:collection1] o.a.s.c.SolrConfig current version of requestparams : -1
[junit4] 2> 2700990 INFO (coreLoadExecutor-10027-thread-1-processing-n:127.0.0.1:46532_u_%2Fj) [n:127.0.0.1:46532_u_%2Fj c:collection1 x:collection1] o.a.s.c.SolrConfig Using Lucene MatchVersion: 5.4.0
[junit4] 2
[...truncated too long message...]
apache.solr.cloud.AbstractFullDistribZkTestBase.waitForRecoveriesToFinish(AbstractFullDistribZkTestBase.java:836)
[junit4] > at org.apache.solr.cloud.AbstractFullDistribZkTestBase.waitForThingsToLevelOut(AbstractFullDistribZkTestBase.java:1392)
[junit4] > at org.apache.solr.security.PKIAuthenticationIntegrationTest.testPkiAuth(PKIAuthenticationIntegrationTest.java:51)
[junit4] > at org.apache.solr.BaseDistributedSearchTestCase$ShardsRepeatRule$ShardsFixedStatement.callStatement(BaseDistributedSearchTestCase.java:963)
[junit4] > at org.apache.solr.BaseDistributedSearchTestCase$ShardsRepeatRule$ShardsStatement.evaluate(BaseDistributedSearchTestCase.java:938)
[junit4] > at java.lang.Thread.run(Thread.java:745)
[junit4] 2> 2749063 INFO (SUITE-PKIAuthenticationIntegrationTest-seed#[CA4757D498DE9F88]-worker) [n:127.0.0.1:40551_u_%2Fj c:collection1 s:shard1 r:core_node4 x:collection1] o.a.s.SolrTestCaseJ4 ###deleteCore
[junit4] 2> NOTE: leaving temporary files on disk at: /export/home/jenkins/workspace/Lucene-Solr-5.x-Solaris/solr/build/solr-core/test/J1/temp/solr.security.PKIAuthenticationIntegrationTest_CA4757D498DE9F88-001
[junit4] 2> NOTE: test params are: codec=DummyCompressingStoredFields(storedFieldsFormat=CompressingStoredFieldsFormat(compressionMode=DUMMY, chunkSize=6, maxDocsPerChunk=998, blockSize=909), termVectorsFormat=CompressingTermVectorsFormat(compressionMode=DUMMY, chunkSize=6, blockSize=909)), sim=RandomSimilarityProvider(queryNorm=true,coord=no): {}, locale=es_PR, timezone=Europe/Isle_of_Man
[junit4] 2> NOTE: SunOS 5.11 amd64/Oracle Corporation 1.8.0_66 (64-bit)/cpus=3,threads=1,free=109978928,total=518979584
[junit4] 2> NOTE: All tests run in this JVM: [OpenExchangeRatesOrgProviderTest, BJQParserTest, TestMacros, TestRecoveryHdfs, BasicFunctionalityTest, TestCustomSort, TestReversedWildcardFilterFactory, TestScoreJoinQPScore, NumericFieldsTest, TestSortingResponseWriter, ShowFileRequestHandlerTest, SpellPossibilityIteratorTest, FieldMutatingUpdateProcessorTest, SuggesterTSTTest, SaslZkACLProviderTest, DocExpirationUpdateProcessorFactoryTest, TermVectorComponentDistributedTest, DefaultValueUpdateProcessorTest, SegmentsInfoRequestHandlerTest, TestConfigSetsAPIExclusivity, SpatialHeatmapFacetsTest, TestManagedSchemaFieldTypeResource, TestSolrConfigHandlerCloud, TestDocBasedVersionConstraints, TestRequestStatusCollectionAPI, TestSolrConfigHandler, LoggingHandlerTest, SpellingQueryConverterTest, DeleteInactiveReplicaTest, CurrencyFieldOpenExchangeTest, TestConfigOverlay, TestAuthorizationFramework, TestRealTimeGet, AnalyticsQueryTest, DistributedFacetPivotWhiteBoxTest, LeaderFailoverAfterPartitionTest, TestRecovery, DistributedFacetPivotLargeTest, BinaryUpdateRequestHandlerTest, TestFuzzyAnalyzedSuggestions, InfoHandlerTest, TestInitQParser, TestQueryUtils, LeaderElectionIntegrationTest, ChaosMonkeySafeLeaderTest, MinimalSchemaTest, TestWriterPerf, TestManagedResource, TestSerializedLuceneMatchVersion, CollectionsAPIDistributedZkTest, TestFieldCollectionResource, SuggesterWFSTTest, TestInfoStreamLogging, DistanceUnitsTest, BitVectorTest, DirectUpdateHandlerOptimizeTest, IndexSchemaRuntimeFieldTest, TestReRankQParserPlugin, DistribCursorPagingTest, ResourceLoaderTest, ZkStateWriterTest, CSVRequestHandlerTest, TestDistributedStatsComponentCardinality, DistributedSuggestComponentTest, TestMiniSolrCloudCluster, BasicDistributedZk2Test, TestSchemaNameResource, TestSchemaResource, TestFastOutputStream, SpellCheckComponentTest, TestBinaryResponseWriter, NoCacheHeaderTest, TestExpandComponent, SolrXmlInZkTest, TestBlendedInfixSuggestions, TestOverriddenPrefixQueryForCustomFieldType, TestChildDocTransformer, TestConfigSetsAPI, TestSolrCoreProperties, TestAtomicUpdateErrorCases, TestJoin, TestSolrDeletionPolicy2, CoreMergeIndexesAdminHandlerTest, ResponseLogComponentTest, TestOmitPositions, BufferStoreTest, TestManagedStopFilterFactory, TestRebalanceLeaders, VersionInfoTest, HighlighterConfigTest, TestRTGBase, TestObjectReleaseTracker, TestCollationField, BlockCacheTest, DeleteShardTest, ChangedSchemaMergeTest, TestTrieFacet, TestSchemaSimilarityResource, TestPKIAuthenticationPlugin, DateFieldTest, BigEndianAscendingWordSerializerTest, TestCoreDiscovery, TestFoldingMultitermQuery, TestFieldResource, TestSha256AuthenticationProvider, BadCopyFieldTest, VMParamsZkACLAndCredentialsProvidersTest, TestPerFieldSimilarity, TestMiniSolrCloudClusterBase, TestTrie, DistanceFunctionTest, ShardRoutingCustomTest, FullSolrCloudDistribCmdsTest, TestCollapseQParserPlugin, RAMDirectoryFactoryTest, TestPHPSerializedResponseWriter, LukeRequestHandlerTest, TestSolrQueryParser, ResponseHeaderTest, TestTolerantSearch, ParsingFieldUpdateProcessorsTest, CoreAdminHandlerTest, SolrCoreCheckLockOnStartupTest, SharedFSAutoReplicaFailoverTest, TestCopyFieldCollectionResource, SSLMigrationTest, SpellCheckCollatorTest, TestConfigSetsAPIZkFailure, ZkSolrClientTest, CoreAdminCreateDiscoverTest, TestDownShardTolerantSearch, SyncSliceTest, OpenCloseCoreStressTest, OverseerTest, BasicZkTest, TestReplicationHandler, ClusterStateUpdateTest, TestRandomFaceting, LeaderElectionTest, TestZkChroot, TestRandomDVFaceting, AutoCommitTest, TestDistributedGrouping, TestHashPartitioner, DistributedSpellCheckComponentTest, ZkControllerTest, TestStressReorder, TestReload, DistributedTermsComponentTest, TestRangeQuery, SimpleFacetsTest, TestSolr4Spatial, StatsComponentTest, SolrCmdDistributorTest, BadIndexSchemaTest, ConvertedLegacyTest, TestFiltering, TestLazyCores, TestBadConfig, TestIndexSearcher, SoftAutoCommitTest, CurrencyFieldXmlFileTest, SolrIndexSplitterTest, AnalysisAfterCoreReloadTest, SignatureUpdateProcessorFactoryTest, SuggesterFSTTest, SuggesterTest, WordBreakSolrSpellCheckerTest, TestPseudoReturnFields, QueryEqualityTest, StatelessScriptUpdateProcessorFactoryTest, SortByFunctionTest, TestRemoteStreaming, DocValuesMultiTest, TestSolrDeletionPolicy1, SolrInfoMBeanTest, CacheHeaderTest, DocumentAnalysisRequestHandlerTest, TestQueryTypes, FileBasedSpellCheckerTest, DocumentBuilderTest, TestValueSourceCache, TestIndexingPerformance, FieldAnalysisRequestHandlerTest, RegexBoostProcessorTest, SolrPluginUtilsTest, TestJmxIntegration, UpdateRequestProcessorFactoryTest, TestCSVResponseWriter, QueryParsingTest, SearchHandlerTest, SOLR749Test, TestQuerySenderListener, AlternateDirectoryTest, TestSolrIndexConfig, CopyFieldTest, BadComponentTest, TestStressRecovery, TestMergePolicyConfig, TestSearchPerf, OutputWriterTest, TestPhraseSuggestions, EchoParamsTest, TestDFRSimilarityFactory, TestLMJelinekMercerSimilarityFactory, TestBM25SimilarityFactory, TestJmxMonitoredMap, DateMathParserTest, TestSystemIdResolver, TestSolrJ, ZkNodePropsTest, CircularListTest, DistributedMLTComponentTest, TestDistributedMissingSort, AssignTest, AsyncCallRequestStatusResponseTest, CollectionStateFormat2Test, CollectionsAPIAsyncDistributedZkTest, ConnectionManagerTest, DeleteLastCustomShardedReplicaTest, DistribDocExpirationUpdateProcessorTest, LeaderInitiatedRecoveryOnCommitTest, LeaderInitiatedRecoveryOnShardRestartTest, MigrateRouteKeyTest, OutOfBoxZkACLAndCredentialsProvidersTest, OverriddenZkACLAndCredentialsProvidersTest, OverseerRolesTest, RemoteQueryErrorTest, ShardSplitTest, TestCloudInspectUtil, TestCloudPivotFacet, TestCollectionAPI, TestDistribDocBasedVersion, TestLeaderInitiatedRecoveryThread, TestShortCircuitedRequests, TriLevelCompositeIdRoutingTest, HdfsRecoveryZkTest, HdfsUnloadDistributedZkTest, HdfsWriteToMultipleCollectionsTest, TestClusterStateMutator, ZkStateReaderTest, RulesTest, TestReplicationHandlerBackup, SecurityConfHandlerTest, DistributedExpandComponentTest, DistributedFacetPivotSmallAdvancedTest, DistributedQueryComponentCustomSortTest, DistributedQueryComponentOptimizationTest, TestCustomDocTransformer, TestRestManager, TestClassNameShortening, TestDynamicFieldCollectionResource, TestDynamicFieldResource, TestFieldTypeCollectionResource, TestFieldTypeResource, TestManagedSchemaDynamicFieldResource, TestSolrQueryParserResource, DateRangeFieldTest, EnumFieldTest, SpatialRPTFieldTypeTest, TestCloudManagedSchema, TestSchemaManager, AnalyticsMergeStrategyTest, MergeStrategyTest, TestComplexPhraseQParserPlugin, TestFieldSortValues, TestNoOpRegenerator, TestReloadDeadlock, TestSmileRequest, TestStandardQParsers, TestStressUserVersions, TestSortByMinMaxFunction, TestScoreJoinQPNoScore, TestClassicSimilarityFactory, TestNonDefinedSimilarityFactory, TestDefaultStatsCache, TestDistribIDF, TestExactStatsCache, PKIAuthenticationIntegrationTest]
[junit4] Completed [525/545] on J1 in 52.92s, 1 test, 1 failure <<< FAILURES!
[...truncated 78 lines...]
BUILD FAILED
/export/home/jenkins/workspace/Lucene-Solr-5.x-Solaris/build.xml:785: The following error occurred while executing this line:
/export/home/jenkins/workspace/Lucene-Solr-5.x-Solaris/build.xml:729: The following error occurred while executing this line:
/export/home/jenkins/workspace/Lucene-Solr-5.x-Solaris/build.xml:59: The following error occurred while executing this line:
/export/home/jenkins/workspace/Lucene-Solr-5.x-Solaris/solr/build.xml:233: The following error occurred while executing this line:
/export/home/jenkins/workspace/Lucene-Solr-5.x-Solaris/solr/common-build.xml:526: The following error occurred while executing this line:
/export/home/jenkins/workspace/Lucene-Solr-5.x-Solaris/lucene/common-build.xml:1452: The following error occurred while executing this line:
/export/home/jenkins/workspace/Lucene-Solr-5.x-Solaris/lucene/common-build.xml:1006: There were test failures: 545 suites (7 ignored), 2158 tests, 1 failure, 53 ignored (39 assumptions) [seed: CA4757D498DE9F88]
Total time: 68 minutes 59 seconds
Build step 'Invoke Ant' marked build as failure
Archiving artifacts
[WARNINGS] Skipping publisher since build result is FAILURE
Recording test results
Email was triggered for: Failure - Any
Sending email for trigger: Failure - Any